FailedOk

th/SRPMS[OK]
th/x32[OK]
th/i686[OK]
th/x86_64[OK]

ac/SRPMS[OK]
ac/i386[OK]
ac/i586[OK]
ac/i686[OK]
ac/alpha[OK]
ac/amd64[OK]
ac/athlon[OK]
ac/ppc[OK]
ac/sparc[OK]
ac/sparc64[OK]

Advanced Search
main()
Powered by PLD Linux
(c) 2002-2020 PLD Team
$Revision: 1.37 $
Powered by Linux.
Your IP: 34.200.222.93

php-pecl-igbinary 8011602f-d122-4f33-815e-31fae694e91c

Status:Failed
Source URL:https://buildlogs.pld-linux.org/pld/th/x86_64/FAIL/php-pecl-igbinary,8011602f-d122-4f33-815e-31fae694e91c.bz2
text/plain URL:View!
full text:View!
rpm -qa of builder:View!
Date:2020/07/15 18:38:01
Runtime:0:00:25.085141

Toc:

  • error 1
  • rpm: error: Failed build dependencies:
  • error 2
  • rpm: error: Failed build dependencies:
  • prep
  • Executing(%prep): /bin/sh -e /tmp/B.h_o2bR/BUILD/tmp/rpm-tmp.42581
  • build
  • Executing(%build): /bin/sh -e /tmp/B.h_o2bR/BUILD/tmp/rpm-tmp.42581
  • error 3
  • error: Bad exit status from /tmp/B.h_o2bR/BUILD/tmp/rpm-tmp.42581 (%build)
  • error 4
  • RPM build errors:
  • error 5
  • error: No files produced.

Content:

checking if we should skip the build
started at: Wed Jul 15 18:37:18 2020
killing old processes on a builder
sending signal 9 to pid -1
Killed
cleaning up /tmp
fetching https://srcbuilder.pld-linux.org/th//srpms/8011602f-d122-4f33-815e-31fae694e91c/php74-pecl-igbinary-3.1.2-1.src.rpm
fetched 83951 bytes, 163.3 K/s
installing srpm: php74-pecl-igbinary-3.1.2-1.src.rpm
+ install -d /tmp/B.h_o2bR/BUILD /tmp/B.h_o2bR/RPMS
+ LC_ALL=en_US.UTF-8
+ rpm -qp --changelog php74-pecl-igbinary-3.1.2-1.src.rpm
* Wed Jul 15 2020 PLD Linux Team <feedback@pld-linux.org>
- For complete changelog see: http://git.pld-linux.org/?p=packages/php-pecl-igbinary.git;a=log;h=master
* Wed Jul 15 2020 Elan Ruusamäe <glen@pld-linux.org> 02866f1
- Up to 3.1.2 * Sat Nov 09 2019 Elan Ruusamäe <glen@pld-linux.org> e378a1e
- Use 01 index for php 7.4 php.ini * Sat Nov 09 2019 Elan Ruusamäe <glen@pld-linux.org> 355bc6f
- up to 3.0.1; php5 support dropped; apc support dropped + rpm -Uhv --nodeps --define '_topdir /tmp/B.h_o2bR' --define '_specdir %{_topdir}' --define '_sourcedir %{_specdir}' --define '_rpmdir %{_topdir}/RPMS' --define '_builddir %{_topdir}/BUILD' --define 'php_suffix 74' php74-pecl-igbinary-3.1.2-1.src.rpm Preparing... ################################################## php74-pecl-igbinary ################################################## + rm -f php74-pecl-igbinary-3.1.2-1.src.rpm + install -m 700 -d /tmp/B.h_o2bR/BUILD/tmp + TMPDIR=/tmp/B.h_o2bR/BUILD/tmp + exec nice -n 0 rpmbuild -bp --short-circuit --nodeps --define '_topdir /tmp/B.h_o2bR' --define '_specdir %{_topdir}' --define '_sourcedir %{_specdir}' --define '_rpmdir %{_topdir}/RPMS' --define '_builddir %{_topdir}/BUILD' --target x86_64-pld-linux --define 'php_suffix 74' --define 'prep exit 0' /tmp/B.h_o2bR/php-pecl-igbinary.spec sh: php-config: inaccessible or not found Building target platforms: x86_64-pld-linux checking BuildConflict-ing packages no BuildConflicts found checking BR rpm: sh: php-config: inaccessible or not found rpm: error: Failed build dependencies: rpm: php74-cli is needed by php74-pecl-igbinary-3.1.2-1.src rpm: php74-devel >= 4:7.0 is needed by php74-pecl-igbinary-3.1.2-1.src rpm: php74-pcre is needed by php74-pecl-igbinary-3.1.2-1.src rpm: php74-session is needed by php74-pecl-igbinary-3.1.2-1.src rpm: php74-simplexml is needed by php74-pecl-igbinary-3.1.2-1.src rpm: php74-spl is needed by php74-pecl-igbinary-3.1.2-1.src rpm: Building target platforms: x86_64-pld-linux updating poldek cache... ready is up to date th is up to date th is up to date th-ready is up to date th-ready is up to date th-test is up to date th-test is up to date checking conflicting packages in BRed packages poldek: Loading [pndir]ready... poldek: Loading [pndir]th-test... poldek: Loading [pndir]th-test... poldek: Loading [pndir]th-ready... poldek: Loading [pndir]th-ready... poldek: Loading [pndir]th... poldek: Loading [pndir]th... poldek: 30613 packages read poldek: Removed 2229 duplicate packages from available set poldek: Processing dependencies... poldek: There are 5 packages to install: poldek: A php74-cli-7.4.6-2.x86_64 php74-common-7.4.6-2.x86_64 poldek: A php74-devel-7.4.6-2.x86_64 php74-session-7.4.6-2.x86_64 poldek: A php74-simplexml-7.4.6-2.x86_64 poldek: This operation will use 9.9MB of disk space. poldek: Need to get 2.1MB of archives (2.1MB to download). poldek: poldek: Retrieving [1/5] th-ready::php74-common-7.4.6-2.x86_64.rpm.................................done poldek: Retrieving [2/5] th-ready::php74-cli-7.4.6-2.x86_64.rpm....................................done poldek: Retrieving [3/5] th-ready::php74-devel-7.4.6-2.x86_64.rpm..................................done poldek: Retrieving [4/5] th-ready::php74-session-7.4.6-2.x86_64.rpm................................done poldek: Retrieving [5/5] th-ready::php74-simplexml-7.4.6-2.x86_64.rpm..............................done poldek: Executing pm-command.sh --upgrade -vh --test --root / --define _check_dirname_deps 1... poldek: Preparing... ################################################## no conflicts found checking BR rpm: sh: php-config: inaccessible or not found rpm: error: Failed build dependencies: rpm: php74-cli is needed by php74-pecl-igbinary-3.1.2-1.src rpm: php74-devel >= 4:7.0 is needed by php74-pecl-igbinary-3.1.2-1.src rpm: php74-pcre is needed by php74-pecl-igbinary-3.1.2-1.src rpm: php74-session is needed by php74-pecl-igbinary-3.1.2-1.src rpm: php74-simplexml is needed by php74-pecl-igbinary-3.1.2-1.src rpm: php74-spl is needed by php74-pecl-igbinary-3.1.2-1.src rpm: Building target platforms: x86_64-pld-linux installing BR: php74\-pcre php74\-spl php74\-cli php74\-devel php74\-simplexml php74\-session + poldek --noask --caplookup -Q -v '--ignore=hhvm-*' '--ignore=php4-*' '--ignore=php52-*' '--ignore=php53-*' '--ignore=php54-*' '--ignore=php55-*' '--ignore=php56-*' '--ignore=php70-*' '--ignore=php71-*' '--ignore=php72-*' '--ignore=php73-*' --upgrade php74-pcre php74-spl php74-cli php74-devel php74-simplexml php74-session Loading [pndir]ready... Loading [pndir]th-test... Loading [pndir]th-test... Loading [pndir]th-ready... Loading [pndir]th-ready... Loading [pndir]th... Loading [pndir]th... 30613 packages read Removed 2229 duplicate packages from available set Processing dependencies... There are 5 packages to install: A php74-cli-7.4.6-2.x86_64 php74-common-7.4.6-2.x86_64 A php74-devel-7.4.6-2.x86_64 php74-session-7.4.6-2.x86_64 A php74-simplexml-7.4.6-2.x86_64 This operation will use 9.9MB of disk space. Need to get 2.1MB of archives. Executing pm-command.sh --upgrade -vh --root / --define _check_dirname_deps 1... Preparing... ################################################## php74-common ################################################## php74-cli ################################################## php74-devel ################################################## php74-session ################################################## php74-simplexml ################################################## building RPM using: set -ex; : build-id: 8011602f-d122-4f33-815e-31fae694e91c; TMPDIR=/tmp/B.h_o2bR/BUILD/tmp exec nice -n 0 rpmbuild -bb --define '_smp_mflags -j9' --define '_make_opts -Otarget' --define '_pld_builder 1' --define '_topdir /tmp/B.h_o2bR' --define '_specdir %{_topdir}' --define '_sourcedir %{_specdir}' --define '_rpmdir %{_topdir}/RPMS' --define '_builddir %{_topdir}/BUILD' --target x86_64-pld-linux --define 'php_suffix 74' /tmp/B.h_o2bR/php-pecl-igbinary.spec + : build-id: 8011602f-d122-4f33-815e-31fae694e91c + TMPDIR=/tmp/B.h_o2bR/BUILD/tmp + exec nice -n 0 rpmbuild -bb --define '_smp_mflags -j9' --define '_make_opts -Otarget' --define '_pld_builder 1' --define '_topdir /tmp/B.h_o2bR' --define '_specdir %{_topdir}' --define '_sourcedir %{_specdir}' --define '_rpmdir %{_topdir}/RPMS' --define '_builddir %{_topdir}/BUILD' --target x86_64-pld-linux --define 'php_suffix 74' /tmp/B.h_o2bR/php-pecl-igbinary.spec Building target platforms: x86_64-pld-linux Executing(%prep): /bin/sh -e /tmp/B.h_o2bR/BUILD/tmp/rpm-tmp.42581 + umask 022 + cd /tmp/B.h_o2bR/BUILD + cd /tmp/B.h_o2bR/BUILD + rm -rf php74-pecl-igbinary-3.1.2 + /bin/mkdir -p php74-pecl-igbinary-3.1.2 + cd php74-pecl-igbinary-3.1.2 + /bin/gzip -dc /tmp/B.h_o2bR/igbinary-3.1.2.tgz + /bin/tar -xf - + STATUS=0 + '[' 0 -ne 0 ']' + /bin/id -u + '[' 1000 '=' 0 ']' + /bin/id -u + '[' 1000 '=' 0 ']' + /bin/chmod -Rf a+rX,u+w,g-w,o-w . + mv igbinary-3.1.2/COPYING igbinary-3.1.2/CREDITS igbinary-3.1.2/NEWS igbinary-3.1.2/README.md igbinary-3.1.2/config.m4 igbinary-3.1.2/config.w32 igbinary-3.1.2/igbinary.h igbinary-3.1.2/igbinary.php igbinary-3.1.2/igbinary.php.ini igbinary-3.1.2/igbinary.spec igbinary-3.1.2/php_igbinary.h igbinary-3.1.2/src igbinary-3.1.2/tags.sh igbinary-3.1.2/tests . + <<"EOF" + >run-tests.sh + cat + chmod +x run-tests.sh + <<"EOF" + read line + t='tests/igbinary_067.phpt]' + t=tests/igbinary_067.phpt + xfail tests/igbinary_067.phpt + typeset 't=tests/igbinary_067.phpt' + test -f tests/igbinary_067.phpt + >>tests/igbinary_067.phpt + <<-EOF + cat + read line + exit 0 Executing(%build): /bin/sh -e /tmp/B.h_o2bR/BUILD/tmp/rpm-tmp.42581 TMP=/home/users/builder/tmp HOME=/home/users/builder PATH=/home/users/builder/GNUstep/Tools:/bin:/usr/bin:/usr/local/bin:/home/users/builder/bin TMPDIR=/tmp/B.h_o2bR/BUILD/tmp + umask 022 + cd /tmp/B.h_o2bR/BUILD + cd php74-pecl-igbinary-3.1.2 + phpize Configuring for: PHP Api Version: 20190902 Zend Module Api No: 20190902 Zend Extension Api No: 320190902 + ./configure 'LDFLAGS=-Wl,--as-needed -Wl,--no-copy-dt-needed-entries -Wl,-z,relro -Wl,-z,combreloc ' 'CFLAGS=-O2 -fwrapv -pipe -Wformat -Werror=format-security -gdwarf-4 -fno-debug-types-section -fvar-tracking-assignments -g2 -Wp,-D_FORTIFY_SOURCE=2 -fstack-protector-strong --param=ssp-buffer-size=4 -Werror=trampolines -fPIC -march=x86-64 -gdwarf-4 -fno-debug-types-section -fvar-tracking-assignments -g2 ' 'CXXFLAGS=-O2 -fwrapv -pipe -Wformat -Werror=format-security -gdwarf-4 -fno-debug-types-section -fvar-tracking-assignments -g2 -Wp,-D_FORTIFY_SOURCE=2 -fstack-protector-strong --param=ssp-buffer-size=4 -Werror=trampolines -fPIC -march=x86-64 -gdwarf-4 -fno-debug-types-section -fvar-tracking-assignments -g2 ' 'FFLAGS=-O2 -fwrapv -pipe -Wformat -Werror=format-security -gdwarf-4 -fno-debug-types-section -fvar-tracking-assignments -g2 -Wp,-D_FORTIFY_SOURCE=2 -fstack-protector-strong --param=ssp-buffer-size=4 -Werror=trampolines -fPIC -march=x86-64 -gdwarf-4 -fno-debug-types-section -fvar-tracking-assignments -g2 ' 'FCFLAGS=-O2 -fwrapv -pipe -Wformat -Werror=format-security -gdwarf-4 -fno-debug-types-section -fvar-tracking-assignments -g2 -Wp,-D_FORTIFY_SOURCE=2 -fstack-protector-strong --param=ssp-buffer-size=4 -Werror=trampolines -fPIC -march=x86-64 -gdwarf-4 -fno-debug-types-section -fvar-tracking-assignments -g2 ' 'CPPFLAGS=' 'CC=x86_64-pld-linux-gcc' 'CXX=x86_64-pld-linux-g++' '--host=x86_64-pld-linux' '--build=x86_64-pld-linux' '--prefix=/usr' '--exec-prefix=/usr' '--bindir=/usr/bin' '--sbindir=/usr/sbin' '--sysconfdir=/etc' '--datadir=/usr/share' '--includedir=/usr/include' '--libdir=/usr/lib64' '--libexecdir=/usr/libexec' '--localstatedir=/var' '--sharedstatedir=/var/lib' '--mandir=/usr/share/man' '--infodir=/usr/share/info' '--x-libraries=/usr/lib64' checking for grep that handles long lines and -e... /bin/grep checking for egrep... /bin/grep -E checking for a sed that does not truncate output... /bin/sed checking for x86_64-pld-linux-pkg-config... no checking for pkg-config... /usr/bin/pkg-config checking pkg-config is at least version 0.9.0... yes checking for x86_64-pld-linux-cc... x86_64-pld-linux-gcc checking whether the C compiler works... yes checking for C compiler default output file name... a.out checking for suffix of executables... checking whether we are cross compiling... no checking for suffix of object files... o checking whether we are using the GNU C compiler... yes checking whether x86_64-pld-linux-gcc accepts -g... yes checking for x86_64-pld-linux-gcc option to accept ISO C89... none needed checking how to run the C preprocessor... x86_64-pld-linux-gcc -E checking for icc... no checking for suncc... no checking for system library directory... lib checking if compiler supports -R... no checking if compiler supports -Wl,-rpath,... yes checking build system type... x86_64-pld-linux-gnu checking host system type... x86_64-pld-linux-gnu checking target system type... x86_64-pld-linux-gnu checking for PHP prefix... /usr checking for PHP includes... -I/usr/include/php -I/usr/include/php/main -I/usr/include/php/TSRM -I/usr/include/php/Zend -I/usr/include/php/ext -I/usr/include/php/ext/date/lib checking for PHP extension directory... /usr/lib64/php74 checking for PHP installed headers prefix... /usr/include/php checking if debug is enabled... no checking if zts is enabled... no checking for gawk... gawk checking whether to enable igbinary support... yes, shared checking for ANSI C header files... yes checking for sys/types.h... yes checking for sys/stat.h... yes checking for stdlib.h... yes checking for string.h... yes checking for memory.h... yes checking for strings.h... yes checking for inttypes.h... yes checking for stdint.h... yes checking for unistd.h... yes checking stdbool.h usability... yes checking stdbool.h presence... yes checking for stdbool.h... yes checking stddef.h usability... yes checking stddef.h presence... yes checking for stddef.h... yes checking for stdint.h... (cached) yes checking PHP version... PHP 7 checking for APCu includes... not found checking size of long... 8 checking compiler type... gcc checking how to print strings... print -r checking for a sed that does not truncate output... (cached) /bin/sed checking for fgrep... /bin/grep -F checking for ld used by x86_64-pld-linux-gcc... /usr/bin/ld checking if the linker (/usr/bin/ld) is GNU ld... yes checking for BSD- or MS-compatible name lister (nm)... /usr/bin/nm -B checking the name lister (/usr/bin/nm -B) interface... BSD nm checking whether ln -s works... yes checking the maximum length of command line arguments... 1572864 checking how to convert x86_64-pld-linux-gnu file names to x86_64-pld-linux-gnu format... func_convert_file_noop checking how to convert x86_64-pld-linux-gnu file names to toolchain format... func_convert_file_noop checking for /usr/bin/ld option to reload object files... -r checking for x86_64-pld-linux-objdump... no checking for objdump... objdump checking how to recognize dependent libraries... pass_all checking for x86_64-pld-linux-dlltool... no checking for dlltool... no checking how to associate runtime and link libraries... print -r -- checking for x86_64-pld-linux-ar... no checking for ar... ar checking for archiver @FILE support... @ checking for x86_64-pld-linux-strip... no checking for strip... strip checking for x86_64-pld-linux-ranlib... no checking for ranlib... ranlib checking for mawk... (cached) gawk checking command to parse /usr/bin/nm -B output from x86_64-pld-linux-gcc object... ok checking for sysroot... no checking for a working dd... /bin/dd checking how to truncate binary pipes... /bin/dd bs=4096 count=1 checking for x86_64-pld-linux-mt... no checking for mt... no checking if : is a manifest tool... no checking for dlfcn.h... yes checking for objdir... .libs checking if x86_64-pld-linux-gcc supports -fno-rtti -fno-exceptions... no checking for x86_64-pld-linux-gcc option to produce PIC... -fPIC -DPIC checking if x86_64-pld-linux-gcc PIC flag -fPIC -DPIC works... yes checking if x86_64-pld-linux-gcc static flag -static works... yes checking if x86_64-pld-linux-gcc supports -c -o file.o... yes checking if x86_64-pld-linux-gcc supports -c -o file.o... (cached) yes checking whether the x86_64-pld-linux-gcc linker (/usr/bin/ld -m elf_x86_64) supports shared libraries... yes checking whether -lc should be explicitly linked in... no checking dynamic linker characteristics... GNU/Linux ld.so checking how to hardcode library paths into programs... immediate checking whether stripping libraries is possible... yes checking if libtool supports shared libraries... yes checking whether to build shared libraries... yes checking whether to build static libraries... no configure: patching config.h.in configure: creating ./config.status config.status: creating config.h config.status: executing libtool commands + /usr/bin/make -Otarget -j9 /bin/sh /tmp/B.h_o2bR/BUILD/php74-pecl-igbinary-3.1.2/libtool --mode=compile x86_64-pld-linux-gcc -O2 -fwrapv -pipe -Wformat -Werror=format-security -gdwarf-4 -fno-debug-types-section -fvar-tracking-assignments -g2 -Wp,-D_FORTIFY_SOURCE=2 -fstack-protector-strong --param=ssp-buffer-size=4 -Werror=trampolines -fPIC -march=x86-64 -gdwarf-4 -fno-debug-types-section -fvar-tracking-assignments -g2 -O2 -Wall -Wpointer-arith -Wcast-align -Wwrite-strings -Wswitch -finline-limit=10000 --param large-function-growth=10000 --param inline-unit-growth=10000 -I. -I/tmp/B.h_o2bR/BUILD/php74-pecl-igbinary-3.1.2 -DPHP_ATOM_INC -I/tmp/B.h_o2bR/BUILD/php74-pecl-igbinary-3.1.2/include -I/tmp/B.h_o2bR/BUILD/php74-pecl-igbinary-3.1.2/main -I/tmp/B.h_o2bR/BUILD/php74-pecl-igbinary-3.1.2 -I/usr/include/php -I/usr/include/php/main -I/usr/include/php/TSRM -I/usr/include/php/Zend -I/usr/include/php/ext -I/usr/include/php/ext/date/lib -DHAVE_CONFIG_H -O2 -fwrapv -pipe -Wformat -Werror=format-security -gdwarf-4 -fno-debug-types-section -fvar-tracking-assignments -g2 -Wp,-D_FORTIFY_SOURCE=2 -fstack-protector-strong --param=ssp-buffer-size=4 -Werror=trampolines -fPIC -march=x86-64 -gdwarf-4 -fno-debug-types-section -fvar-tracking-assignments -g2 -c /tmp/B.h_o2bR/BUILD/php74-pecl-igbinary-3.1.2/src/php7/hash_si_ptr.c -o src/php7/hash_si_ptr.lo libtool: compile: x86_64-pld-linux-gcc -O2 -fwrapv -pipe -Wformat -Werror=format-security -gdwarf-4 -fno-debug-types-section -fvar-tracking-assignments -g2 -Wp,-D_FORTIFY_SOURCE=2 -fstack-protector-strong --param=ssp-buffer-size=4 -Werror=trampolines -fPIC -march=x86-64 -gdwarf-4 -fno-debug-types-section -fvar-tracking-assignments -g2 -O2 -Wall -Wpointer-arith -Wcast-align -Wwrite-strings -Wswitch -finline-limit=10000 --param large-function-growth=10000 --param inline-unit-growth=10000 -I. -I/tmp/B.h_o2bR/BUILD/php74-pecl-igbinary-3.1.2 -DPHP_ATOM_INC -I/tmp/B.h_o2bR/BUILD/php74-pecl-igbinary-3.1.2/include -I/tmp/B.h_o2bR/BUILD/php74-pecl-igbinary-3.1.2/main -I/tmp/B.h_o2bR/BUILD/php74-pecl-igbinary-3.1.2 -I/usr/include/php -I/usr/include/php/main -I/usr/include/php/TSRM -I/usr/include/php/Zend -I/usr/include/php/ext -I/usr/include/php/ext/date/lib -DHAVE_CONFIG_H -O2 -fwrapv -pipe -Wformat -Werror=format-security -gdwarf-4 -fno-debug-types-section -fvar-tracking-assignments -g2 -Wp,-D_FORTIFY_SOURCE=2 -fstack-protector-strong --param=ssp-buffer-size=4 -Werror=trampolines -fPIC -march=x86-64 -gdwarf-4 -fno-debug-types-section -fvar-tracking-assignments -g2 -c /tmp/B.h_o2bR/BUILD/php74-pecl-igbinary-3.1.2/src/php7/hash_si_ptr.c -fPIC -DPIC -o src/php7/.libs/hash_si_ptr.o /bin/sh /tmp/B.h_o2bR/BUILD/php74-pecl-igbinary-3.1.2/libtool --mode=compile x86_64-pld-linux-gcc -O2 -fwrapv -pipe -Wformat -Werror=format-security -gdwarf-4 -fno-debug-types-section -fvar-tracking-assignments -g2 -Wp,-D_FORTIFY_SOURCE=2 -fstack-protector-strong --param=ssp-buffer-size=4 -Werror=trampolines -fPIC -march=x86-64 -gdwarf-4 -fno-debug-types-section -fvar-tracking-assignments -g2 -O2 -Wall -Wpointer-arith -Wcast-align -Wwrite-strings -Wswitch -finline-limit=10000 --param large-function-growth=10000 --param inline-unit-growth=10000 -I. -I/tmp/B.h_o2bR/BUILD/php74-pecl-igbinary-3.1.2 -DPHP_ATOM_INC -I/tmp/B.h_o2bR/BUILD/php74-pecl-igbinary-3.1.2/include -I/tmp/B.h_o2bR/BUILD/php74-pecl-igbinary-3.1.2/main -I/tmp/B.h_o2bR/BUILD/php74-pecl-igbinary-3.1.2 -I/usr/include/php -I/usr/include/php/main -I/usr/include/php/TSRM -I/usr/include/php/Zend -I/usr/include/php/ext -I/usr/include/php/ext/date/lib -DHAVE_CONFIG_H -O2 -fwrapv -pipe -Wformat -Werror=format-security -gdwarf-4 -fno-debug-types-section -fvar-tracking-assignments -g2 -Wp,-D_FORTIFY_SOURCE=2 -fstack-protector-strong --param=ssp-buffer-size=4 -Werror=trampolines -fPIC -march=x86-64 -gdwarf-4 -fno-debug-types-section -fvar-tracking-assignments -g2 -c /tmp/B.h_o2bR/BUILD/php74-pecl-igbinary-3.1.2/src/php7/hash_si.c -o src/php7/hash_si.lo libtool: compile: x86_64-pld-linux-gcc -O2 -fwrapv -pipe -Wformat -Werror=format-security -gdwarf-4 -fno-debug-types-section -fvar-tracking-assignments -g2 -Wp,-D_FORTIFY_SOURCE=2 -fstack-protector-strong --param=ssp-buffer-size=4 -Werror=trampolines -fPIC -march=x86-64 -gdwarf-4 -fno-debug-types-section -fvar-tracking-assignments -g2 -O2 -Wall -Wpointer-arith -Wcast-align -Wwrite-strings -Wswitch -finline-limit=10000 --param large-function-growth=10000 --param inline-unit-growth=10000 -I. -I/tmp/B.h_o2bR/BUILD/php74-pecl-igbinary-3.1.2 -DPHP_ATOM_INC -I/tmp/B.h_o2bR/BUILD/php74-pecl-igbinary-3.1.2/include -I/tmp/B.h_o2bR/BUILD/php74-pecl-igbinary-3.1.2/main -I/tmp/B.h_o2bR/BUILD/php74-pecl-igbinary-3.1.2 -I/usr/include/php -I/usr/include/php/main -I/usr/include/php/TSRM -I/usr/include/php/Zend -I/usr/include/php/ext -I/usr/include/php/ext/date/lib -DHAVE_CONFIG_H -O2 -fwrapv -pipe -Wformat -Werror=format-security -gdwarf-4 -fno-debug-types-section -fvar-tracking-assignments -g2 -Wp,-D_FORTIFY_SOURCE=2 -fstack-protector-strong --param=ssp-buffer-size=4 -Werror=trampolines -fPIC -march=x86-64 -gdwarf-4 -fno-debug-types-section -fvar-tracking-assignments -g2 -c /tmp/B.h_o2bR/BUILD/php74-pecl-igbinary-3.1.2/src/php7/hash_si.c -fPIC -DPIC -o src/php7/.libs/hash_si.o /bin/sh /tmp/B.h_o2bR/BUILD/php74-pecl-igbinary-3.1.2/libtool --mode=compile x86_64-pld-linux-gcc -O2 -fwrapv -pipe -Wformat -Werror=format-security -gdwarf-4 -fno-debug-types-section -fvar-tracking-assignments -g2 -Wp,-D_FORTIFY_SOURCE=2 -fstack-protector-strong --param=ssp-buffer-size=4 -Werror=trampolines -fPIC -march=x86-64 -gdwarf-4 -fno-debug-types-section -fvar-tracking-assignments -g2 -O2 -Wall -Wpointer-arith -Wcast-align -Wwrite-strings -Wswitch -finline-limit=10000 --param large-function-growth=10000 --param inline-unit-growth=10000 -I. -I/tmp/B.h_o2bR/BUILD/php74-pecl-igbinary-3.1.2 -DPHP_ATOM_INC -I/tmp/B.h_o2bR/BUILD/php74-pecl-igbinary-3.1.2/include -I/tmp/B.h_o2bR/BUILD/php74-pecl-igbinary-3.1.2/main -I/tmp/B.h_o2bR/BUILD/php74-pecl-igbinary-3.1.2 -I/usr/include/php -I/usr/include/php/main -I/usr/include/php/TSRM -I/usr/include/php/Zend -I/usr/include/php/ext -I/usr/include/php/ext/date/lib -DHAVE_CONFIG_H -O2 -fwrapv -pipe -Wformat -Werror=format-security -gdwarf-4 -fno-debug-types-section -fvar-tracking-assignments -g2 -Wp,-D_FORTIFY_SOURCE=2 -fstack-protector-strong --param=ssp-buffer-size=4 -Werror=trampolines -fPIC -march=x86-64 -gdwarf-4 -fno-debug-types-section -fvar-tracking-assignments -g2 -c /tmp/B.h_o2bR/BUILD/php74-pecl-igbinary-3.1.2/src/php7/igbinary.c -o src/php7/igbinary.lo libtool: compile: x86_64-pld-linux-gcc -O2 -fwrapv -pipe -Wformat -Werror=format-security -gdwarf-4 -fno-debug-types-section -fvar-tracking-assignments -g2 -Wp,-D_FORTIFY_SOURCE=2 -fstack-protector-strong --param=ssp-buffer-size=4 -Werror=trampolines -fPIC -march=x86-64 -gdwarf-4 -fno-debug-types-section -fvar-tracking-assignments -g2 -O2 -Wall -Wpointer-arith -Wcast-align -Wwrite-strings -Wswitch -finline-limit=10000 --param large-function-growth=10000 --param inline-unit-growth=10000 -I. -I/tmp/B.h_o2bR/BUILD/php74-pecl-igbinary-3.1.2 -DPHP_ATOM_INC -I/tmp/B.h_o2bR/BUILD/php74-pecl-igbinary-3.1.2/include -I/tmp/B.h_o2bR/BUILD/php74-pecl-igbinary-3.1.2/main -I/tmp/B.h_o2bR/BUILD/php74-pecl-igbinary-3.1.2 -I/usr/include/php -I/usr/include/php/main -I/usr/include/php/TSRM -I/usr/include/php/Zend -I/usr/include/php/ext -I/usr/include/php/ext/date/lib -DHAVE_CONFIG_H -O2 -fwrapv -pipe -Wformat -Werror=format-security -gdwarf-4 -fno-debug-types-section -fvar-tracking-assignments -g2 -Wp,-D_FORTIFY_SOURCE=2 -fstack-protector-strong --param=ssp-buffer-size=4 -Werror=trampolines -fPIC -march=x86-64 -gdwarf-4 -fno-debug-types-section -fvar-tracking-assignments -g2 -c /tmp/B.h_o2bR/BUILD/php74-pecl-igbinary-3.1.2/src/php7/igbinary.c -fPIC -DPIC -o src/php7/.libs/igbinary.o /bin/sh /tmp/B.h_o2bR/BUILD/php74-pecl-igbinary-3.1.2/libtool --mode=link x86_64-pld-linux-gcc -DPHP_ATOM_INC -I/tmp/B.h_o2bR/BUILD/php74-pecl-igbinary-3.1.2/include -I/tmp/B.h_o2bR/BUILD/php74-pecl-igbinary-3.1.2/main -I/tmp/B.h_o2bR/BUILD/php74-pecl-igbinary-3.1.2 -I/usr/include/php -I/usr/include/php/main -I/usr/include/php/TSRM -I/usr/include/php/Zend -I/usr/include/php/ext -I/usr/include/php/ext/date/lib -DHAVE_CONFIG_H -O2 -fwrapv -pipe -Wformat -Werror=format-security -gdwarf-4 -fno-debug-types-section -fvar-tracking-assignments -g2 -Wp,-D_FORTIFY_SOURCE=2 -fstack-protector-strong --param=ssp-buffer-size=4 -Werror=trampolines -fPIC -march=x86-64 -gdwarf-4 -fno-debug-types-section -fvar-tracking-assignments -g2 -Wl,--as-needed -Wl,--no-copy-dt-needed-entries -Wl,-z,relro -Wl,-z,combreloc -o igbinary.la -export-dynamic -avoid-version -prefer-pic -module -rpath /tmp/B.h_o2bR/BUILD/php74-pecl-igbinary-3.1.2/modules src/php7/igbinary.lo src/php7/hash_si.lo src/php7/hash_si_ptr.lo libtool: link: x86_64-pld-linux-gcc -shared -fPIC -DPIC -O2 -gdwarf-4 -g2 -fstack-protector-strong -march=x86-64 -gdwarf-4 -g2 -Wl,--as-needed -Wl,--no-copy-dt-needed-entries -Wl,-z -Wl,relro -Wl,-z -Wl,combreloc src/php7/.libs/igbinary.o src/php7/.libs/hash_si.o src/php7/.libs/hash_si_ptr.o -Wl,-soname -Wl,igbinary.so -o .libs/igbinary.so libtool: link: ( cd ".libs" && rm -f "igbinary.la" && ln -s "../igbinary.la" "igbinary.la" ) /bin/sh /tmp/B.h_o2bR/BUILD/php74-pecl-igbinary-3.1.2/libtool --mode=install cp ./igbinary.la /tmp/B.h_o2bR/BUILD/php74-pecl-igbinary-3.1.2/modules libtool: install: cp ./.libs/igbinary.so /tmp/B.h_o2bR/BUILD/php74-pecl-igbinary-3.1.2/modules/igbinary.so libtool: install: cp ./.libs/igbinary.lai /tmp/B.h_o2bR/BUILD/php74-pecl-igbinary-3.1.2/modules/igbinary.la libtool: finish: PATH="/home/users/builder/GNUstep/Tools:/bin:/usr/bin:/usr/local/bin:/home/users/builder/bin:/sbin" ldconfig -n /tmp/B.h_o2bR/BUILD/php74-pecl-igbinary-3.1.2/modules ---------------------------------------------------------------------- Libraries have been installed in: /tmp/B.h_o2bR/BUILD/php74-pecl-igbinary-3.1.2/modules If you ever happen to want to link against installed libraries in a given directory, LIBDIR, you must either use libtool, and specify the full pathname of the library, or use the '-LLIBDIR' flag during linking and do at least one of the following: - add LIBDIR to the 'LD_LIBRARY_PATH' environment variable during execution - add LIBDIR to the 'LD_RUN_PATH' environment variable during linking - use the '-Wl,-rpath -Wl,LIBDIR' linker flag - have your system administrator add LIBDIR to '/etc/ld.so.conf' See any operating system documentation about shared libraries for more information, such as the ld(1) and ld.so(8) manual pages. ---------------------------------------------------------------------- Build complete. Don't forget to run 'make test'. + >modules.log + /usr/bin/php74 -n -q '-dextension_dir=modules' '-dextension=/usr/lib64/php74/pcre.so' '-dextension=/usr/lib64/php74/spl.so' '-dextension=/usr/lib64/php74/simplexml.so' '-dextension=/usr/lib64/php74/session.so' '-dextension=igbinary.so' -m PHP Warning: PHP Startup: Unable to load dynamic library '/usr/lib64/php74/pcre.so' (tried: /usr/lib64/php74/pcre.so (/usr/lib64/php74/pcre.so: cannot open shared object file: No such file or directory), modules//usr/lib64/php74/pcre.so.so (modules//usr/lib64/php74/pcre.so.so: cannot open shared object file: No such file or directory)) in Unknown on line 0 PHP Warning: PHP Startup: Unable to load dynamic library '/usr/lib64/php74/spl.so' (tried: /usr/lib64/php74/spl.so (/usr/lib64/php74/spl.so: cannot open shared object file: No such file or directory), modules//usr/lib64/php74/spl.so.so (modules//usr/lib64/php74/spl.so.so: cannot open shared object file: No such file or directory)) in Unknown on line 0 + grep igbinary modules.log igbinary + ./run-tests.sh --show-diff Build complete. Don't forget to run 'make test'. ===================================================================== PHP : /usr/bin/php74 PHP_SAPI : cli PHP_VERSION : 7.4.6 ZEND_VERSION: 3.4.0 PHP_OS : Linux - Linux ymir-builder 4.9.208-1 #1 SMP Sat Jan 4 19:36:41 CET 2020 x86_64 INI actual : /tmp/B.h_o2bR/BUILD/php74-pecl-igbinary-3.1.2/tmp-php.ini More .INIs : CWD : /tmp/B.h_o2bR/BUILD/php74-pecl-igbinary-3.1.2 Extra dirs : VALGRIND : Not used ===================================================================== TIME START 2020-07-15 18:37:59 ===================================================================== TEST 1/112 [tests/__serialize_001.phpt] PASS __serialize() mechanism (001): Basics [tests/__serialize_001.phpt] TEST 2/112 [tests/__serialize_002.phpt] PASS __serialize() mechanism (002): TypeError on invalid return type [tests/__serialize_002.phpt] TEST 3/112 [tests/__serialize_003.phpt] PASS __serialize() mechanism (003): Interoperability of different serialization mechanisms [tests/__serialize_003.phpt] TEST 4/112 [tests/__serialize_004.phpt] PASS __serialize() mechanism (004): Delayed __unserialize() calls [tests/__serialize_004.phpt] TEST 5/112 [tests/__serialize_005.phpt] PASS __serialize() mechanism (005): parent::__unserialize() is safe [tests/__serialize_005.phpt] TEST 6/112 [tests/__serialize_006.phpt] PASS __serialize() mechanism (006): DateTime [tests/__serialize_006.phpt] TEST 7/112 [tests/__serialize_007.phpt] PASS __serialize() mechanism (007): handle __unserialize throwing [tests/__serialize_007.phpt] TEST 8/112 [tests/__serialize_008.phpt] PASS __serialize() mechanism (007): handle __destruct of returned data [tests/__serialize_008.phpt] TEST 9/112 [tests/__serialize_009.phpt] PASS __serialize() mechanism (009): Object/reference ids should be the same whether or not __serialize is used. [tests/__serialize_009.phpt] TEST 10/112 [tests/__serialize_010.phpt] PASS __serialize() mechanism (010): handle references in array returned by __serialize [tests/__serialize_010.phpt] TEST 11/112 [tests/__serialize_011.phpt] PASS __unserializing deeply nested structures [tests/__serialize_011.phpt] TEST 12/112 [tests/__serialize_012.phpt] ========DIFF======== 003+ object(__PHP_Incomplete_Class)#3 (5) { 003- object(__PHP_Incomplete_Class)#3 (4) { 014+ ["3"]=> 015+ NULL ========DONE======== FAIL Test unserialization of classes derived from ArrayIterator [tests/__serialize_012.phpt] TEST 13/112 [tests/__serialize_013.phpt] PASS __serialize() mechanism (013): Properties are still typed after unserialization [tests/__serialize_013.phpt] TEST 14/112 [tests/__serialize_013_php8.phpt] SKIP __serialize() mechanism (013): Properties are still typed after unserialization (php8) [tests/__serialize_013_php8.phpt] reason: __serialize/__unserialize error message different in php < 8 TEST 15/112 [tests/__serialize_014.phpt] PASS __serialize() mechanism (014): Uninitialized properties can be serialized and unserialized [tests/__serialize_014.phpt] TEST 16/112 [tests/__serialize_014_php8.phpt] SKIP __serialize() mechanism (014): Uninitialized properties can be serialized and unserialized [tests/__serialize_014_php8.phpt] reason: __serialize/__unserialize error message different in php < 8 TEST 17/112 [tests/__serialize_015.phpt] PASS __serialize() mechanism (015): Uninitialized properties from __sleep should throw when serializing [tests/__serialize_015.phpt] TEST 18/112 [tests/__serialize_015_php8.phpt] SKIP __serialize() mechanism (015): Uninitialized properties from __sleep can be serialized and unserialized [tests/__serialize_015_php8.phpt] reason: __serialize/__unserialize error message different in php < 8 TEST 19/112 [tests/__serialize_016.phpt] PASS __serialize() mechanism (016): Properties are still typed after unserialization (references) [tests/__serialize_016.phpt] TEST 20/112 [tests/__serialize_016_php8.phpt] SKIP __serialize() mechanism (016): Properties are still typed after unserialization (references) [tests/__serialize_016_php8.phpt] reason: __serialize/__unserialize error message different in php < 8 TEST 21/112 [tests/__serialize_017.phpt] PASS __serialize() mechanism (001): Basics [tests/__serialize_017.phpt] TEST 22/112 [tests/__serialize_018.phpt] PASS __serialize() freed on unserialize exception without calling destructor. [tests/__serialize_018.phpt] TEST 23/112 [tests/igbinary_001.phpt] PASS Check for igbinary presence [tests/igbinary_001.phpt] TEST 24/112 [tests/igbinary_002.phpt] PASS Check for null serialisation [tests/igbinary_002.phpt] TEST 25/112 [tests/igbinary_003.phpt] PASS Check for bool serialisation [tests/igbinary_003.phpt] TEST 26/112 [tests/igbinary_004.phpt] PASS Check for integer serialisation [tests/igbinary_004.phpt] TEST 27/112 [tests/igbinary_005.phpt] PASS Check for double serialisation [tests/igbinary_005.phpt] TEST 28/112 [tests/igbinary_006.phpt] PASS Check for simple string serialization [tests/igbinary_006.phpt] TEST 29/112 [tests/igbinary_007.phpt] PASS Check for simple array serialization [tests/igbinary_007.phpt] TEST 30/112 [tests/igbinary_008.phpt] PASS Check for array+string serialization [tests/igbinary_008.phpt] TEST 31/112 [tests/igbinary_009.phpt] PASS Check for reference serialisation [tests/igbinary_009.phpt] TEST 32/112 [tests/igbinary_009b.phpt] PASS Check for reference serialization (Original example, not using var_dump) [tests/igbinary_009b.phpt] TEST 33/112 [tests/igbinary_010.phpt] PASS Array test [tests/igbinary_010.phpt] TEST 34/112 [tests/igbinary_012.phpt] PASS Object test [tests/igbinary_012.phpt] TEST 35/112 [tests/igbinary_013.phpt] PASS Object-Array test [tests/igbinary_013.phpt] TEST 36/112 [tests/igbinary_014.phpt] PASS Object-Reference test [tests/igbinary_014.phpt] TEST 37/112 [tests/igbinary_015.phpt] SKIP Check for serialization handler [tests/igbinary_015.phpt] reason: igbinary session handler not available TEST 38/112 [tests/igbinary_015b.phpt] SKIP Check for serialization handler, ini-directive [tests/igbinary_015b.phpt] reason: igbinary session handler not available TEST 39/112 [tests/igbinary_015c.phpt] SKIP Check for serialization handler [tests/igbinary_015c.phpt] reason: igbinary session handler not available TEST 40/112 [tests/igbinary_016.phpt] PASS Object test, __sleep [tests/igbinary_016.phpt] TEST 41/112 [tests/igbinary_017.phpt] PASS Object test, __wakeup [tests/igbinary_017.phpt] TEST 42/112 [tests/igbinary_018.phpt] PASS Object test, __sleep error cases [tests/igbinary_018.phpt] TEST 43/112 [tests/igbinary_019.phpt] PASS Object test, __autoload [tests/igbinary_019.phpt] TEST 44/112 [tests/igbinary_020.phpt] PASS Object test, incomplete class [tests/igbinary_020.phpt] TEST 45/112 [tests/igbinary_021.phpt] PASS Object Serializable interface [tests/igbinary_021.phpt] TEST 46/112 [tests/igbinary_022.phpt] PASS Object test, unserialize_callback_func [tests/igbinary_022.phpt] TEST 47/112 [tests/igbinary_023.phpt] PASS Resource [tests/igbinary_023.phpt] TEST 48/112 [tests/igbinary_024.phpt] PASS Recursive objects [tests/igbinary_024.phpt] TEST 49/112 [tests/igbinary_025.phpt] PASS Object test, array of objects with __sleep [tests/igbinary_025.phpt] TEST 50/112 [tests/igbinary_025b.phpt] PASS Object test, array of small objects with __sleep [tests/igbinary_025b.phpt] TEST 51/112 [tests/igbinary_026.phpt] PASS Cyclic array test [tests/igbinary_026.phpt] TEST 52/112 [tests/igbinary_026b.phpt] PASS Cyclic array test 2 [tests/igbinary_026b.phpt] TEST 53/112 [tests/igbinary_027.phpt] SKIP Check for serialization handler [tests/igbinary_027.phpt] reason: igbinary session handler not available TEST 54/112 [tests/igbinary_028.phpt] SKIP Serialize object into session, full set [tests/igbinary_028.phpt] reason: igbinary session handler not available TEST 55/112 [tests/igbinary_029.phpt] PASS Igbinary module info [tests/igbinary_029.phpt] TEST 56/112 [tests/igbinary_030_php7.phpt] SKIP Unserialize invalid data [tests/igbinary_030_php7.phpt] reason: php 7.1 or 7.0 required TEST 57/112 [tests/igbinary_030_php72.phpt] PASS Unserialize invalid data (php 7.2+) [tests/igbinary_030_php72.phpt] TEST 58/112 [tests/igbinary_031.phpt] PASS Object Serializable interface throws exceptions [tests/igbinary_031.phpt] TEST 59/112 [tests/igbinary_032.phpt] PASS Object test, __sleep and __wakeup exceptions [tests/igbinary_032.phpt] TEST 60/112 [tests/igbinary_033.phpt] PASS Object test, cyclic references [tests/igbinary_033.phpt] TEST 61/112 [tests/igbinary_034.phpt] PASS Unserialize invalid random data [tests/igbinary_034.phpt] TEST 62/112 [tests/igbinary_040.phpt] PASS b0rked random data test [tests/igbinary_040.phpt] TEST 63/112 [tests/igbinary_041.phpt] PASS Check for double NaN, Inf, -Inf, 0, and -0. IEEE 754 doubles [tests/igbinary_041.phpt] TEST 64/112 [tests/igbinary_043.phpt] PASS Object serialization with compact strings [tests/igbinary_043.phpt] TEST 65/112 [tests/igbinary_044.phpt] PASS Check for double extremes [tests/igbinary_044.phpt] TEST 66/112 [tests/igbinary_045b.phpt] SKIP APCu serializer registration [tests/igbinary_045b.phpt] reason: APCu not loaded TEST 67/112 [tests/igbinary_045c.phpt] SKIP APCu serializer registration - more data types [tests/igbinary_045c.phpt] reason: APCu not loaded TEST 68/112 [tests/igbinary_046.phpt] PASS Correctly unserialize scalar refs. [tests/igbinary_046.phpt] TEST 69/112 [tests/igbinary_046b.phpt] PASS Correctly unserialize multiple object refs. [tests/igbinary_046b.phpt] TEST 70/112 [tests/igbinary_046c.phpt] PASS Correctly unserialize multiple array refs. [tests/igbinary_046c.phpt] TEST 71/112 [tests/igbinary_046d.phpt] PASS Correctly unserialize multiple object refs and non-refs. [tests/igbinary_046d.phpt] TEST 72/112 [tests/igbinary_047.phpt] SKIP Check for serialization handler, SessionHandlerInterface [tests/igbinary_047.phpt] reason: igbinary session handler not available TEST 73/112 [tests/igbinary_048.phpt] PASS Object test, __set not called for private attr in extended class [tests/igbinary_048.phpt] TEST 74/112 [tests/igbinary_048b.phpt] PASS Object test, __set not called for private attr in extended class [tests/igbinary_048b.phpt] TEST 75/112 [tests/igbinary_049.phpt] PASS Correctly unserialize multiple references in arrays [tests/igbinary_049.phpt] TEST 76/112 [tests/igbinary_049b.phpt] PASS Correctly unserialize multiple references in objects [tests/igbinary_049b.phpt] TEST 77/112 [tests/igbinary_050.phpt] PASS Correctly unserialize cyclic object references [tests/igbinary_050.phpt] TEST 78/112 [tests/igbinary_051.phpt] PASS Object test, __wakeup (With multiple references) [tests/igbinary_051.phpt] TEST 79/112 [tests/igbinary_052.phpt] PASS Object Serializable interface can be serialized in references [tests/igbinary_052.phpt] TEST 80/112 [tests/igbinary_053.phpt] PASS __wakeup can modify properties without affecting other objects [tests/igbinary_053.phpt] TEST 81/112 [tests/igbinary_054.phpt] PASS __wakeup can add dynamic properties without affecting other objects [tests/igbinary_054.phpt] TEST 82/112 [tests/igbinary_055.phpt] PASS __wakeup can replace a copy of the object referring to the root node. [tests/igbinary_055.phpt] TEST 83/112 [tests/igbinary_057.phpt] PASS Test serializing more strings than the capacity of the initial strings table. [tests/igbinary_057.phpt] TEST 84/112 [tests/igbinary_058.phpt] PASS Should not call __destruct if __wakeup throws an exception [tests/igbinary_058.phpt] TEST 85/112 [tests/igbinary_058b.phpt] PASS Should not call __destruct if __wakeup throws an exception (in arrays) [tests/igbinary_058b.phpt] TEST 86/112 [tests/igbinary_059.phpt] PASS igbinary_unserialize should never convert from packed array to hash when references exist (Bug #48) [tests/igbinary_059.phpt] TEST 87/112 [tests/igbinary_060.phpt] PASS Igbinary_unserialize_header warning [tests/igbinary_060.phpt] TEST 88/112 [tests/igbinary_061.phpt] SKIP igbinary session decoder should call __wakeup [tests/igbinary_061.phpt] reason: igbinary session handler not available TEST 89/112 [tests/igbinary_062.phpt] PASS igbinary should not call __wakeup() if Serializable::unserialize was used to unserialize the object data (like `unserialize`) [tests/igbinary_062.phpt] TEST 90/112 [tests/igbinary_063_php7.phpt] SKIP Accessing unserialized numbers. [tests/igbinary_063_php7.phpt] reason: php 7.1 or 7.0 required TEST 91/112 [tests/igbinary_063_php72.phpt] PASS Accessing unserialized numbers. [tests/igbinary_063_php72.phpt] TEST 92/112 [tests/igbinary_064.phpt] PASS Works when there are hash collisions in strings when serializing. [tests/igbinary_064.phpt] TEST 93/112 [tests/igbinary_065.phpt] PASS Don't emit zval has unknown type 0 (IS_UNDEF) [tests/igbinary_065.phpt] TEST 94/112 [tests/igbinary_066.phpt] PASS Test serializing different empty arrays [tests/igbinary_066.phpt] TEST 95/112 [tests/igbinary_067.phpt] SKIP Test serializing multiple reference groups to the same empty array [tests/igbinary_067.phpt] reason: requires json_encode TEST 96/112 [tests/igbinary_068.phpt] PASS Test serializing and unserializing PHP_INT_MIN [tests/igbinary_068.phpt] TEST 97/112 [tests/igbinary_069.phpt] PASS Test serializing and unserializing many duplicate strings [tests/igbinary_069.phpt] TEST 98/112 [tests/igbinary_070.phpt] PASS __serialize() mechanism in igbinary [tests/igbinary_070.phpt] TEST 99/112 [tests/igbinary_071.phpt] PASS igbinary_unserialize with references to typed properties shall skip the references or fail [tests/igbinary_071.phpt] TEST 100/112 [tests/igbinary_071_php8.phpt] SKIP igbinary_unserialize with references to typed properties shall skip the references or fail [tests/igbinary_071_php8.phpt] reason: __serialize/__unserialize error message different in php < 8 TEST 101/112 [tests/igbinary_072.phpt] PASS igbinary and __PHP_INCOMPLETE_CLASS [tests/igbinary_072.phpt] TEST 102/112 [tests/igbinary_073.phpt] PASS igbinary and large Serializable [tests/igbinary_073.phpt] TEST 103/112 [tests/igbinary_074.phpt] PASS igbinary and not enough data for array [tests/igbinary_074.phpt] TEST 104/112 [tests/igbinary_075.phpt] PASS igbinary and not enough data for array [tests/igbinary_075.phpt] TEST 105/112 [tests/igbinary_076.phpt] PASS igbinary and edge cases unserializing array keys [tests/igbinary_076.phpt] TEST 106/112 [tests/igbinary_077.phpt] PASS igbinary and large arrays [tests/igbinary_077.phpt] TEST 107/112 [tests/igbinary_078.phpt] PASS igbinary and large arrays [tests/igbinary_078.phpt] TEST 108/112 [tests/igbinary_079.phpt] PASS igbinary and many arrays [tests/igbinary_079.phpt] TEST 109/112 [tests/igbinary_080.phpt] PASS igbinary with hash collision serializing strings [tests/igbinary_080.phpt] TEST 110/112 [tests/igbinary_bug54662.phpt] PASS Nested objects cause segfault, php bug #54662 [tests/igbinary_bug54662.phpt] TEST 111/112 [tests/igbinary_bug72134.phpt] PASS igbinary_unserialize causes segfault on 3rd call for objects with dynamic property [tests/igbinary_bug72134.phpt] TEST 112/112 [tests/igbinary_unserialize_v1_compatible.phpt] PASS Unserialize backwards compatible with v1. [tests/igbinary_unserialize_v1_compatible.phpt] ===================================================================== TIME END 2020-07-15 18:38:01 ===================================================================== TEST RESULT SUMMARY --------------------------------------------------------------------- Exts skipped : 0 Exts tested : 11 --------------------------------------------------------------------- Number of tests : 112 95 Tests skipped : 17 ( 15.2%) -------- Tests warned : 0 ( 0.0%) ( 0.0%) Tests failed : 1 ( 0.9%) ( 1.1%) Tests passed : 94 ( 83.9%) ( 98.9%) --------------------------------------------------------------------- Time taken : 2 seconds ===================================================================== ===================================================================== FAILED TEST SUMMARY --------------------------------------------------------------------- Test unserialization of classes derived from ArrayIterator [tests/__serialize_012.phpt] ===================================================================== make: *** [Makefile:149: test] Error 1 error: Bad exit status from /tmp/B.h_o2bR/BUILD/tmp/rpm-tmp.42581 (%build) RPM build errors: Bad exit status from /tmp/B.h_o2bR/BUILD/tmp/rpm-tmp.42581 (%build) ended at: Wed Jul 15 18:38:01 2020, done in 0:00:25.085141 error: No files produced. + chmod -R u+rwX /tmp/B.h_o2bR/BUILD + rm -rf /tmp/B.h_o2bR/tmp /tmp/B.h_o2bR/BUILD + rm -rf /tmp/B.h_o2bR Begin-PLD-Builder-Info Build-Time: user:29.97s sys:3.25s real:43.37s (faults io:0 non-io:1157972) End-PLD-Builder-Info
[Back to list of logs] [View rpm -qa of builder]