FailedOk

th/SRPMS[OK]
th/x32[OK]
th/i686[OK]
th/x86_64[OK]

ac/SRPMS[OK]
ac/i386[OK]
ac/i586[OK]
ac/i686[OK]
ac/alpha[OK]
ac/amd64[OK]
ac/athlon[OK]
ac/ppc[OK]
ac/sparc[OK]
ac/sparc64[OK]

Advanced Search
main()
Powered by PLD Linux
(c) 2002-2018 PLD Team
$Revision: 1.37 $
Powered by Leppe'.
Your IP: 54.224.247.42

php-pecl-imagick b79e9909-14b9-48ca-8ab8-f990f1702310

Status:Failed
Source URL:ftp://buildlogs.pld-linux.org/th/x86_64/FAIL/php-pecl-imagick,b79e9909-14b9-48ca-8ab8-f990f1702310.bz2
text/plain URL:View!
full text:View!
rpm -qa of builder:View!
Date:2017/12/26 13:20:21
Runtime:0:01:37.633052

Toc:

  • error 1
  • rpm: error: Failed build dependencies:
  • error 2
  • rpm: error: Failed build dependencies:
  • prep
  • Executing(%prep): /bin/sh -e /tmp/B.k9VpwB/BUILD/tmp/rpm-tmp.83223
  • build
  • Executing(%build): /bin/sh -e /tmp/B.k9VpwB/BUILD/tmp/rpm-tmp.77708
  • error 3
  • error: Bad exit status from /tmp/B.k9VpwB/BUILD/tmp/rpm-tmp.77708 (%build)
  • error 4
  • RPM build errors:
  • error 5
  • error: No files produced.

Content:

checking if we should skip the build
started at: Tue Dec 26 13:18:22 2017
fetching https://srcbuilder.pld-linux.org/th//srpms/b79e9909-14b9-48ca-8ab8-f990f1702310/php70-pecl-imagick-3.4.3-3.src.rpm
fetched 261003 bytes, 268.7 K/s
installing srpm: php70-pecl-imagick-3.4.3-3.src.rpm
mesg: ttyname failed: Inappropriate ioctl for device
+ install -d /tmp/B.k9VpwB/BUILD /tmp/B.k9VpwB/RPMS
+ LC_ALL=en_US.UTF-8
+ rpm -qp --changelog php70-pecl-imagick-3.4.3-3.src.rpm
* Tue Dec 26 2017 PLD Linux Team <feedback@pld-linux.org>
- For complete changelog see: http://git.pld-linux.org/?p=packages/php-pecl-imagick.git;a=log;h=master
* Mon Sep 04 2017 Elan Ruusamäe <glen@delfi.ee> 142a9e6
- ImageMagick-7.0.7.0-1 rebuild - release 3 (by relup.sh) * Wed May 03 2017 Elan Ruusamäe <glen@delfi.ee> c2bedcf
- ImageMagick-7.0.5-5 rebuild - release 2 (by relup.sh) * Mon Apr 10 2017 Elan Ruusamäe <glen@delfi.ee> 2f0fc69
- up to 3.4.3 * Tue Dec 27 2016 Jan Rękorajski <baggins@pld-linux.org> 2a03fe3
- rebuild with ImageMagick 7.0.4.0 - rel 2 + rpm -Uhv --nodeps --define '_topdir /tmp/B.k9VpwB' --define '_specdir %{_topdir}' --define '_sourcedir %{_specdir}' --define '_rpmdir %{_topdir}/RPMS' --define '_builddir %{_topdir}/BUILD' --define 'php_suffix 70' php70-pecl-imagick-3.4.3-3.src.rpm Preparing... ################################################## php70-pecl-imagick ################################################## + rm -f php70-pecl-imagick-3.4.3-3.src.rpm mesg: ttyname failed: Inappropriate ioctl for device + install -m 700 -d /tmp/B.k9VpwB/BUILD/tmp mesg: ttyname failed: Inappropriate ioctl for device + TMPDIR=/tmp/B.k9VpwB/BUILD/tmp + exec nice -n 0 rpmbuild -bp --short-circuit --nodeps --define '_topdir /tmp/B.k9VpwB' --define '_specdir %{_topdir}' --define '_sourcedir %{_specdir}' --define '_rpmdir %{_topdir}/RPMS' --define '_builddir %{_topdir}/BUILD' --target x86_64-pld-linux --define 'php_suffix 70' --define 'prep exit 0' /tmp/B.k9VpwB/php-pecl-imagick.spec Building target platforms: x86_64-pld-linux checking BuildConflict-ing packages no BuildConflicts found checking BR rpm: error: Failed build dependencies: rpm: php70-devel >= 4:5.3 is needed by php70-pecl-imagick-3.4.3-3.src rpm: php70-cli is needed by php70-pecl-imagick-3.4.3-3.src rpm: php70-pcre is needed by php70-pecl-imagick-3.4.3-3.src rpm: php70-spl is needed by php70-pecl-imagick-3.4.3-3.src rpm: Building target platforms: x86_64-pld-linux updating poldek cache... ready is up to date Retrieving th::packages.ndir.md... th is up to date Retrieving th::packages.ndir.md... th is up to date Retrieving th-ready::packages.ndir.md... th-ready is up to date Retrieving th-ready::packages.ndir.md... th-ready is up to date Retrieving th-test::packages.ndir.md... th-test is up to date Retrieving th-test::packages.ndir.md... th-test is up to date checking conflicting packages in BRed packages poldek: Loading [pndir]ready... poldek: Loading [pndir]th-test... poldek: Loading [pndir]th-test... poldek: Loading [pndir]th-ready... poldek: Loading [pndir]th-ready... poldek: Loading [pndir]th... poldek: Loading [pndir]th... poldek: 30252 packages read poldek: Removed 3520 duplicate packages from available set poldek: Processing dependencies... poldek: php70-pcre-7.0.26-3.x86_64 marks php70-common-7.0.26-3.x86_64 (cap /etc/php70/conf.d) poldek: php70-spl-7.0.26-3.x86_64 marks php70-simplexml-7.0.26-3.x86_64 (cap php70-simplexml = 4:7.0.26-3) poldek: php56-devel-5.6.32-2.x86_64 obsoleted by php70-devel-7.0.26-3.x86_64 poldek: There are 6 packages to install (2 marked by dependencies), 1 to remove: poldek: I php70-cli-7.0.26-3.x86_64 php70-devel-7.0.26-3.x86_64 poldek: I php70-pcre-7.0.26-3.x86_64 php70-spl-7.0.26-3.x86_64 poldek: D php70-common-7.0.26-3.x86_64 php70-simplexml-7.0.26-3.x86_64 poldek: R php56-devel-5.6.32-2.x86_64 poldek: This operation will use 4.5MB of disk space. poldek: Need to get 1.8MB of archives (1.8MB to download). poldek: poldek: Retrieving [1/6] th-test::php70-common-7.0.26-3.x86_64.rpm... poldek: ..............................done poldek: Retrieving [2/6] th-test::php70-cli-7.0.26-3.x86_64.rpm... poldek: ..............................done poldek: Retrieving [3/6] th-test::php70-devel-7.0.26-3.x86_64.rpm... poldek: ..............................done poldek: Retrieving [4/6] th-test::php70-pcre-7.0.26-3.x86_64.rpm... poldek: ..............................done poldek: Retrieving [5/6] th-test::php70-spl-7.0.26-3.x86_64.rpm... poldek: ..............................done poldek: Retrieving [6/6] th-test::php70-simplexml-7.0.26-3.x86_64.rpm... poldek: ..............................done poldek: Executing pm-command.sh --upgrade -vh --test --root / --define _check_dirname_deps 1... poldek: Preparing... ################################################## no conflicts found checking BR rpm: error: Failed build dependencies: rpm: php70-devel >= 4:5.3 is needed by php70-pecl-imagick-3.4.3-3.src rpm: php70-cli is needed by php70-pecl-imagick-3.4.3-3.src rpm: php70-pcre is needed by php70-pecl-imagick-3.4.3-3.src rpm: php70-spl is needed by php70-pecl-imagick-3.4.3-3.src rpm: Building target platforms: x86_64-pld-linux installing BR: php70\-spl php70\-cli php70\-pcre php70\-devel + poldek --noask --caplookup -Q -v '--ignore=hhvm-*' '--ignore=php4-*' '--ignore=php52-*' '--ignore=php53-*' '--ignore=php54-*' '--ignore=php55-*' '--ignore=php56-*' --upgrade php70-spl php70-cli php70-pcre php70-devel Loading [pndir]ready... Loading [pndir]th-test... Loading [pndir]th-test... Loading [pndir]th-ready... Loading [pndir]th-ready... Loading [pndir]th... Loading [pndir]th... 30252 packages read Removed 3520 duplicate packages from available set Processing dependencies... php70-pcre-7.0.26-3.x86_64 marks php70-common-7.0.26-3.x86_64 (cap /etc/php70/conf.d) php56-devel-5.6.32-2.x86_64 obsoleted by php70-devel-7.0.26-3.x86_64 php70-spl-7.0.26-3.x86_64 marks php70-simplexml-7.0.26-3.x86_64 (cap php70-simplexml = 4:7.0.26-3) There are 6 packages to install (2 marked by dependencies), 1 to remove: I php70-cli-7.0.26-3.x86_64 php70-devel-7.0.26-3.x86_64 I php70-pcre-7.0.26-3.x86_64 php70-spl-7.0.26-3.x86_64 D php70-common-7.0.26-3.x86_64 php70-simplexml-7.0.26-3.x86_64 R php56-devel-5.6.32-2.x86_64 This operation will use 4.5MB of disk space. Need to get 1.8MB of archives. Executing pm-command.sh --upgrade -vh --root / --define _check_dirname_deps 1... Preparing... ################################################## php70-common ################################################## php70-pcre ################################################## php70-devel ################################################## php70-cli ################################################## php70-simplexml ################################################## php70-spl ################################################## building RPM using: set -ex; : build-id: b79e9909-14b9-48ca-8ab8-f990f1702310; TMPDIR=/tmp/B.k9VpwB/BUILD/tmp exec nice -n 0 rpmbuild -bb --define '_smp_mflags -j5' --define '_make_opts -Otarget' --define '_pld_builder 1' --define '_topdir /tmp/B.k9VpwB' --define '_specdir %{_topdir}' --define '_sourcedir %{_specdir}' --define '_rpmdir %{_topdir}/RPMS' --define '_builddir %{_topdir}/BUILD' --target x86_64-pld-linux --define 'php_suffix 70' /tmp/B.k9VpwB/php-pecl-imagick.spec mesg: ttyname failed: Inappropriate ioctl for device + : build-id: b79e9909-14b9-48ca-8ab8-f990f1702310 + TMPDIR=/tmp/B.k9VpwB/BUILD/tmp + exec nice -n 0 rpmbuild -bb --define '_smp_mflags -j5' --define '_make_opts -Otarget' --define '_pld_builder 1' --define '_topdir /tmp/B.k9VpwB' --define '_specdir %{_topdir}' --define '_sourcedir %{_specdir}' --define '_rpmdir %{_topdir}/RPMS' --define '_builddir %{_topdir}/BUILD' --target x86_64-pld-linux --define 'php_suffix 70' /tmp/B.k9VpwB/php-pecl-imagick.spec Building target platforms: x86_64-pld-linux Executing(%prep): /bin/sh -e /tmp/B.k9VpwB/BUILD/tmp/rpm-tmp.83223 + umask 022 + cd /tmp/B.k9VpwB/BUILD + cd /tmp/B.k9VpwB/BUILD + rm -rf php70-pecl-imagick-3.4.3 + /bin/mkdir -p php70-pecl-imagick-3.4.3 + cd php70-pecl-imagick-3.4.3 + /usr/bin/gzip -dc /tmp/B.k9VpwB/imagick-3.4.3.tgz + /bin/tar -xf - + STATUS=0 + '[' 0 -ne 0 ']' + /bin/id -u + '[' 1000 '=' 0 ']' + /bin/id -u + '[' 1000 '=' 0 ']' + /bin/chmod -Rf a+rX,u+w,g-w,o-w . + mv imagick-3.4.3/CREDITS imagick-3.4.3/ChangeLog imagick-3.4.3/LICENSE imagick-3.4.3/config.m4 imagick-3.4.3/config.w32 imagick-3.4.3/examples imagick-3.4.3/imagemagick.m4 imagick-3.4.3/imagick.c imagick-3.4.3/imagick_class.c imagick-3.4.3/imagick_file.c imagick-3.4.3/imagick_helpers.c imagick-3.4.3/imagickdraw_class.c imagick-3.4.3/imagickkernel_class.c imagick-3.4.3/imagickpixel_class.c imagick-3.4.3/imagickpixeliterator_class.c imagick-3.4.3/php_imagick.h imagick-3.4.3/php_imagick_defs.h imagick-3.4.3/php_imagick_file.h imagick-3.4.3/php_imagick_helpers.h imagick-3.4.3/php_imagick_macros.h imagick-3.4.3/php_imagick_shared.h imagick-3.4.3/shim_im6_to_im7.c imagick-3.4.3/shim_im6_to_im7.h imagick-3.4.3/tests . + echo 'Patch #0 (skip_version_check.patch):' Patch #0 (skip_version_check.patch): + '[' -f /tmp/B.k9VpwB/skip_version_check.patch ']' + /bin/cat /tmp/B.k9VpwB/skip_version_check.patch + /usr/bin/patch -s -p1 + Test Imagick, annotateImage '[tests/034_Imagick_annotateImage_basic.phpt]' + eval echo '$3' + echo '[tests/034_Imagick_annotateImage_basic.phpt]' + nf='[tests/034_Imagick_annotateImage_basic.phpt]' + t='[tests/034_Imagick_annotateImage_basic.phpt]' + t='tests/034_Imagick_annotateImage_basic.phpt]' + t=tests/034_Imagick_annotateImage_basic.phpt + xfail tests/034_Imagick_annotateImage_basic.phpt + t=tests/034_Imagick_annotateImage_basic.phpt + >>tests/034_Imagick_annotateImage_basic.phpt + <<-EOF + cat + Test ImagickDraw, composite '[tests/177_ImagickDraw_composite_basic.phpt]' + eval echo '$3' + echo '[tests/177_ImagickDraw_composite_basic.phpt]' + nf='[tests/177_ImagickDraw_composite_basic.phpt]' + t='[tests/177_ImagickDraw_composite_basic.phpt]' + t='tests/177_ImagickDraw_composite_basic.phpt]' + t=tests/177_ImagickDraw_composite_basic.phpt + xfail tests/177_ImagickDraw_composite_basic.phpt + t=tests/177_ImagickDraw_composite_basic.phpt + >>tests/177_ImagickDraw_composite_basic.phpt + <<-EOF + cat + Test ImagickDraw, setFontSize '[tests/206_ImagickDraw_setFontSize_basic.phpt]' + eval echo '$3' + echo '[tests/206_ImagickDraw_setFontSize_basic.phpt]' + nf='[tests/206_ImagickDraw_setFontSize_basic.phpt]' + t='[tests/206_ImagickDraw_setFontSize_basic.phpt]' + t='tests/206_ImagickDraw_setFontSize_basic.phpt]' + t=tests/206_ImagickDraw_setFontSize_basic.phpt + xfail tests/206_ImagickDraw_setFontSize_basic.phpt + t=tests/206_ImagickDraw_setFontSize_basic.phpt + >>tests/206_ImagickDraw_setFontSize_basic.phpt + <<-EOF + cat + Test ImagickDraw, setFontFamily '[tests/207_ImagickDraw_setFontFamily_basic.phpt]' + eval echo '$3' + echo '[tests/207_ImagickDraw_setFontFamily_basic.phpt]' + nf='[tests/207_ImagickDraw_setFontFamily_basic.phpt]' + t='[tests/207_ImagickDraw_setFontFamily_basic.phpt]' + t='tests/207_ImagickDraw_setFontFamily_basic.phpt]' + t=tests/207_ImagickDraw_setFontFamily_basic.phpt + xfail tests/207_ImagickDraw_setFontFamily_basic.phpt + t=tests/207_ImagickDraw_setFontFamily_basic.phpt + >>tests/207_ImagickDraw_setFontFamily_basic.phpt + <<-EOF + cat + Test ImagickDraw, setFontStretch '[tests/208_ImagickDraw_setFontStretch_basic.phpt]' + eval echo '$3' + echo '[tests/208_ImagickDraw_setFontStretch_basic.phpt]' + nf='[tests/208_ImagickDraw_setFontStretch_basic.phpt]' + t='[tests/208_ImagickDraw_setFontStretch_basic.phpt]' + t='tests/208_ImagickDraw_setFontStretch_basic.phpt]' + t=tests/208_ImagickDraw_setFontStretch_basic.phpt + xfail tests/208_ImagickDraw_setFontStretch_basic.phpt + t=tests/208_ImagickDraw_setFontStretch_basic.phpt + >>tests/208_ImagickDraw_setFontStretch_basic.phpt + <<-EOF + cat + Test ImagickDraw, setFontWeight '[tests/209_ImagickDraw_setFontWeight_basic.phpt]' + eval echo '$3' + echo '[tests/209_ImagickDraw_setFontWeight_basic.phpt]' + nf='[tests/209_ImagickDraw_setFontWeight_basic.phpt]' + t='[tests/209_ImagickDraw_setFontWeight_basic.phpt]' + t='tests/209_ImagickDraw_setFontWeight_basic.phpt]' + t=tests/209_ImagickDraw_setFontWeight_basic.phpt + xfail tests/209_ImagickDraw_setFontWeight_basic.phpt + t=tests/209_ImagickDraw_setFontWeight_basic.phpt + >>tests/209_ImagickDraw_setFontWeight_basic.phpt + <<-EOF + cat + Test ImagickDraw, setFontStyle '[tests/210_ImagickDraw_setFontStyle_basic.phpt]' + eval echo '$3' + echo '[tests/210_ImagickDraw_setFontStyle_basic.phpt]' + nf='[tests/210_ImagickDraw_setFontStyle_basic.phpt]' + t='[tests/210_ImagickDraw_setFontStyle_basic.phpt]' + t='tests/210_ImagickDraw_setFontStyle_basic.phpt]' + t=tests/210_ImagickDraw_setFontStyle_basic.phpt + xfail tests/210_ImagickDraw_setFontStyle_basic.phpt + t=tests/210_ImagickDraw_setFontStyle_basic.phpt + >>tests/210_ImagickDraw_setFontStyle_basic.phpt + <<-EOF + cat + Test ImagickDraw, setGravity '[tests/212_ImagickDraw_setGravity_basic.phpt]' + eval echo '$3' + echo '[tests/212_ImagickDraw_setGravity_basic.phpt]' + nf='[tests/212_ImagickDraw_setGravity_basic.phpt]' + t='[tests/212_ImagickDraw_setGravity_basic.phpt]' + t='tests/212_ImagickDraw_setGravity_basic.phpt]' + t=tests/212_ImagickDraw_setGravity_basic.phpt + xfail tests/212_ImagickDraw_setGravity_basic.phpt + t=tests/212_ImagickDraw_setGravity_basic.phpt + >>tests/212_ImagickDraw_setGravity_basic.phpt + <<-EOF + cat + Test ImagickDraw, setTextAlignment '[tests/222_ImagickDraw_setTextAlignment_basic.phpt]' + eval echo '$3' + echo '[tests/222_ImagickDraw_setTextAlignment_basic.phpt]' + nf='[tests/222_ImagickDraw_setTextAlignment_basic.phpt]' + t='[tests/222_ImagickDraw_setTextAlignment_basic.phpt]' + t='tests/222_ImagickDraw_setTextAlignment_basic.phpt]' + t=tests/222_ImagickDraw_setTextAlignment_basic.phpt + xfail tests/222_ImagickDraw_setTextAlignment_basic.phpt + t=tests/222_ImagickDraw_setTextAlignment_basic.phpt + >>tests/222_ImagickDraw_setTextAlignment_basic.phpt + <<-EOF + cat + Test ImagickDraw, setTextAntialias '[tests/223_ImagickDraw_setTextAntialias_basic.phpt]' + eval echo '$3' + echo '[tests/223_ImagickDraw_setTextAntialias_basic.phpt]' + nf='[tests/223_ImagickDraw_setTextAntialias_basic.phpt]' + t='[tests/223_ImagickDraw_setTextAntialias_basic.phpt]' + t='tests/223_ImagickDraw_setTextAntialias_basic.phpt]' + t=tests/223_ImagickDraw_setTextAntialias_basic.phpt + xfail tests/223_ImagickDraw_setTextAntialias_basic.phpt + t=tests/223_ImagickDraw_setTextAntialias_basic.phpt + >>tests/223_ImagickDraw_setTextAntialias_basic.phpt + <<-EOF + cat + Test ImagickDraw, setTextUnderColor '[tests/224_ImagickDraw_setTextUnderColor_basic.phpt]' + eval echo '$3' + echo '[tests/224_ImagickDraw_setTextUnderColor_basic.phpt]' + nf='[tests/224_ImagickDraw_setTextUnderColor_basic.phpt]' + t='[tests/224_ImagickDraw_setTextUnderColor_basic.phpt]' + t='tests/224_ImagickDraw_setTextUnderColor_basic.phpt]' + t=tests/224_ImagickDraw_setTextUnderColor_basic.phpt + xfail tests/224_ImagickDraw_setTextUnderColor_basic.phpt + t=tests/224_ImagickDraw_setTextUnderColor_basic.phpt + >>tests/224_ImagickDraw_setTextUnderColor_basic.phpt + <<-EOF + cat + Test ImagickDraw, setTextDecoration '[tests/225_ImagickDraw_setTextDecoration_basic.phpt]' + eval echo '$3' + echo '[tests/225_ImagickDraw_setTextDecoration_basic.phpt]' + nf='[tests/225_ImagickDraw_setTextDecoration_basic.phpt]' + t='[tests/225_ImagickDraw_setTextDecoration_basic.phpt]' + t='tests/225_ImagickDraw_setTextDecoration_basic.phpt]' + t=tests/225_ImagickDraw_setTextDecoration_basic.phpt + xfail tests/225_ImagickDraw_setTextDecoration_basic.phpt + t=tests/225_ImagickDraw_setTextDecoration_basic.phpt + >>tests/225_ImagickDraw_setTextDecoration_basic.phpt + <<-EOF + cat + Test Tutorial, psychedelicFont '[tests/241_Tutorial_psychedelicFont_basic.phpt]' + eval echo '$3' + echo '[tests/241_Tutorial_psychedelicFont_basic.phpt]' + nf='[tests/241_Tutorial_psychedelicFont_basic.phpt]' + t='[tests/241_Tutorial_psychedelicFont_basic.phpt]' + t='tests/241_Tutorial_psychedelicFont_basic.phpt]' + t=tests/241_Tutorial_psychedelicFont_basic.phpt + xfail tests/241_Tutorial_psychedelicFont_basic.phpt + t=tests/241_Tutorial_psychedelicFont_basic.phpt + >>tests/241_Tutorial_psychedelicFont_basic.phpt + <<-EOF + cat + Test Tutorial, svgExample '[tests/243_Tutorial_svgExample_basic.phpt]' + eval echo '$3' + echo '[tests/243_Tutorial_svgExample_basic.phpt]' + nf='[tests/243_Tutorial_svgExample_basic.phpt]' + t='[tests/243_Tutorial_svgExample_basic.phpt]' + t='tests/243_Tutorial_svgExample_basic.phpt]' + t=tests/243_Tutorial_svgExample_basic.phpt + xfail tests/243_Tutorial_svgExample_basic.phpt + t=tests/243_Tutorial_svgExample_basic.phpt + >>tests/243_Tutorial_svgExample_basic.phpt + <<-EOF + cat + Test Tutorial, psychedelicFontGif '[tests/244_Tutorial_psychedelicFontGif_basic.phpt]' + eval echo '$3' + echo '[tests/244_Tutorial_psychedelicFontGif_basic.phpt]' + nf='[tests/244_Tutorial_psychedelicFontGif_basic.phpt]' + t='[tests/244_Tutorial_psychedelicFontGif_basic.phpt]' + t='tests/244_Tutorial_psychedelicFontGif_basic.phpt]' + t=tests/244_Tutorial_psychedelicFontGif_basic.phpt + xfail tests/244_Tutorial_psychedelicFontGif_basic.phpt + t=tests/244_Tutorial_psychedelicFontGif_basic.phpt + >>tests/244_Tutorial_psychedelicFontGif_basic.phpt + <<-EOF + cat + Test Imagick, Imagick::exportImagePixels '[tests/256_Imagick_exportImagePixels_basic.phpt]' + eval echo '$3' + echo '[tests/256_Imagick_exportImagePixels_basic.phpt]' + nf='[tests/256_Imagick_exportImagePixels_basic.phpt]' + t='[tests/256_Imagick_exportImagePixels_basic.phpt]' + t='tests/256_Imagick_exportImagePixels_basic.phpt]' + t=tests/256_Imagick_exportImagePixels_basic.phpt + xfail tests/256_Imagick_exportImagePixels_basic.phpt + t=tests/256_Imagick_exportImagePixels_basic.phpt + >>tests/256_Imagick_exportImagePixels_basic.phpt + <<-EOF + cat + Test ImagickDraw, getTextDirection '[tests/264_ImagickDraw_getTextDirection_basic.phpt]' + eval echo '$3' + echo '[tests/264_ImagickDraw_getTextDirection_basic.phpt]' + nf='[tests/264_ImagickDraw_getTextDirection_basic.phpt]' + t='[tests/264_ImagickDraw_getTextDirection_basic.phpt]' + t='tests/264_ImagickDraw_getTextDirection_basic.phpt]' + t=tests/264_ImagickDraw_getTextDirection_basic.phpt + xfail tests/264_ImagickDraw_getTextDirection_basic.phpt + t=tests/264_ImagickDraw_getTextDirection_basic.phpt + >>tests/264_ImagickDraw_getTextDirection_basic.phpt + <<-EOF + cat + Test ImagickDraw, getFontResolution '[tests/266_ImagickDraw_getFontResolution_basic.phpt]' + eval echo '$3' + echo '[tests/266_ImagickDraw_getFontResolution_basic.phpt]' + nf='[tests/266_ImagickDraw_getFontResolution_basic.phpt]' + t='[tests/266_ImagickDraw_getFontResolution_basic.phpt]' + t='tests/266_ImagickDraw_getFontResolution_basic.phpt]' + t=tests/266_ImagickDraw_getFontResolution_basic.phpt + xfail tests/266_ImagickDraw_getFontResolution_basic.phpt + t=tests/266_ImagickDraw_getFontResolution_basic.phpt + >>tests/266_ImagickDraw_getFontResolution_basic.phpt + <<-EOF + cat + exit 0 Executing(%build): /bin/sh -e /tmp/B.k9VpwB/BUILD/tmp/rpm-tmp.77708 TMP=/home/users/builder/tmp HOME=/home/users/builder PATH=/home/users/builder/GNUstep/Tools:/usr/local/bin:/usr/bin:/bin:/home/users/builder/bin TMPDIR=/tmp/B.k9VpwB/BUILD/tmp + umask 022 + cd /tmp/B.k9VpwB/BUILD + cd php70-pecl-imagick-3.4.3 + phpize Configuring for: PHP Api Version: 20151012 Zend Module Api No: 20151012 Zend Extension Api No: 320151012 + ./configure 'LDFLAGS=-Wl,--as-needed -Wl,--no-copy-dt-needed-entries -Wl,-z,relro -Wl,-z,combreloc ' 'CFLAGS=-O2 -fwrapv -pipe -Wformat -Werror=format-security -gdwarf-4 -fno-debug-types-section -fvar-tracking-assignments -g2 -Wp,-D_FORTIFY_SOURCE=2 -fstack-protector-strong --param=ssp-buffer-size=4 -fPIC -march=x86-64 -gdwarf-4 -fno-debug-types-section -fvar-tracking-assignments -g2 ' 'CXXFLAGS=-O2 -fwrapv -pipe -Wformat -Werror=format-security -gdwarf-4 -fno-debug-types-section -fvar-tracking-assignments -g2 -Wp,-D_FORTIFY_SOURCE=2 -fstack-protector-strong --param=ssp-buffer-size=4 -fPIC -march=x86-64 -gdwarf-4 -fno-debug-types-section -fvar-tracking-assignments -g2 ' 'FFLAGS=-O2 -fwrapv -pipe -Wformat -Werror=format-security -gdwarf-4 -fno-debug-types-section -fvar-tracking-assignments -g2 -Wp,-D_FORTIFY_SOURCE=2 -fstack-protector-strong --param=ssp-buffer-size=4 -fPIC -march=x86-64 -gdwarf-4 -fno-debug-types-section -fvar-tracking-assignments -g2 ' 'FCFLAGS=-O2 -fwrapv -pipe -Wformat -Werror=format-security -gdwarf-4 -fno-debug-types-section -fvar-tracking-assignments -g2 -Wp,-D_FORTIFY_SOURCE=2 -fstack-protector-strong --param=ssp-buffer-size=4 -fPIC -march=x86-64 -gdwarf-4 -fno-debug-types-section -fvar-tracking-assignments -g2 ' 'CPPFLAGS=' 'CC=x86_64-pld-linux-gcc' 'CXX=x86_64-pld-linux-g++' '--host=x86_64-pld-linux' '--build=x86_64-pld-linux' '--prefix=/usr' '--exec-prefix=/usr' '--bindir=/usr/bin' '--sbindir=/usr/sbin' '--sysconfdir=/etc' '--datadir=/usr/share' '--includedir=/usr/include' '--libdir=/usr/lib64' '--libexecdir=/usr/libexec' '--localstatedir=/var' '--sharedstatedir=/var/lib' '--mandir=/usr/share/man' '--infodir=/usr/share/info' '--x-libraries=/usr/lib64' 'php_cv_cc_dashr=false' checking for grep that handles long lines and -e... /bin/grep checking for egrep... /bin/grep -E checking for a sed that does not truncate output... /bin/sed checking for x86_64-pld-linux-cc... x86_64-pld-linux-gcc checking whether the C compiler works... yes checking for C compiler default output file name... a.out checking for suffix of executables... checking whether we are cross compiling... no checking for suffix of object files... o checking whether we are using the GNU C compiler... yes checking whether x86_64-pld-linux-gcc accepts -g... yes checking for x86_64-pld-linux-gcc option to accept ISO C89... none needed checking how to run the C preprocessor... x86_64-pld-linux-gcc -E checking for icc... no checking for suncc... no checking whether x86_64-pld-linux-gcc and cc understand -c and -o together... yes checking for system library directory... lib checking if compiler supports -R... (cached) false checking if compiler supports -Wl,-rpath,... yes checking build system type... x86_64-pld-linux-gnu checking host system type... x86_64-pld-linux-gnu checking target system type... x86_64-pld-linux-gnu checking for PHP prefix... /usr checking for PHP includes... -I/usr/include/php -I/usr/include/php/main -I/usr/include/php/TSRM -I/usr/include/php/Zend -I/usr/include/php/ext -I/usr/include/php/ext/date/lib checking for PHP extension directory... /usr/lib64/php70 checking for PHP installed headers prefix... /usr/include/php checking if debug is enabled... no checking if zts is enabled... no checking for re2c... re2c checking for re2c version... 0.13.5 (ok) checking for gawk... gawk checking whether to enable the imagick extension... yes, shared checking for pkg-config... /usr/bin/pkg-config checking ImageMagick MagickWand API configuration program... checking Testing /usr/local/bin/MagickWand-config... Doesn't exist checking Testing /usr/bin/MagickWand-config... It exists found in /usr/bin/MagickWand-config checking if ImageMagick version is at least 6.2.4... found version 7.0.7 Q16 checking for MagickWand.h or magick-wand.h header... /usr/include/ImageMagick-7/MagickWand/MagickWand.h checking PHP version is at least 5.1.3... yes. found 7.0.26 libs -lMagickWand-7.Q16 -lMagickCore-7.Q16 checking for MagickGetVersion... yes checking for MagickSetImageInterpolateMethod... yes checking how to print strings... print -r checking for a sed that does not truncate output... (cached) /bin/sed checking for fgrep... /bin/grep -F checking for ld used by x86_64-pld-linux-gcc... /usr/bin/ld checking if the linker (/usr/bin/ld) is GNU ld... yes checking for BSD- or MS-compatible name lister (nm)... /usr/bin/nm -B checking the name lister (/usr/bin/nm -B) interface... BSD nm checking whether ln -s works... yes checking the maximum length of command line arguments... 1572864 checking how to convert x86_64-pld-linux-gnu file names to x86_64-pld-linux-gnu format... func_convert_file_noop checking how to convert x86_64-pld-linux-gnu file names to toolchain format... func_convert_file_noop checking for /usr/bin/ld option to reload object files... -r checking for x86_64-pld-linux-objdump... no checking for objdump... objdump checking how to recognize dependent libraries... pass_all checking for x86_64-pld-linux-dlltool... no checking for dlltool... no checking how to associate runtime and link libraries... print -r -- checking for x86_64-pld-linux-ar... no checking for ar... ar checking for archiver @FILE support... @ checking for x86_64-pld-linux-strip... no checking for strip... strip checking for x86_64-pld-linux-ranlib... no checking for ranlib... ranlib checking for mawk... (cached) gawk checking command to parse /usr/bin/nm -B output from x86_64-pld-linux-gcc object... ok checking for sysroot... no checking for a working dd... /bin/dd checking how to truncate binary pipes... /bin/dd bs=4096 count=1 checking for x86_64-pld-linux-mt... no checking for mt... no checking if : is a manifest tool... no checking for ANSI C header files... yes checking for sys/types.h... yes checking for sys/stat.h... yes checking for stdlib.h... yes checking for string.h... yes checking for memory.h... yes checking for strings.h... yes checking for inttypes.h... yes checking for stdint.h... yes checking for unistd.h... yes checking for dlfcn.h... yes checking for objdir... .libs checking if x86_64-pld-linux-gcc supports -fno-rtti -fno-exceptions... no checking for x86_64-pld-linux-gcc option to produce PIC... -fPIC -DPIC checking if x86_64-pld-linux-gcc PIC flag -fPIC -DPIC works... yes checking if x86_64-pld-linux-gcc static flag -static works... yes checking if x86_64-pld-linux-gcc supports -c -o file.o... yes checking if x86_64-pld-linux-gcc supports -c -o file.o... (cached) yes checking whether the x86_64-pld-linux-gcc linker (/usr/bin/ld -m elf_x86_64) supports shared libraries... yes checking whether -lc should be explicitly linked in... no checking dynamic linker characteristics... GNU/Linux ld.so checking how to hardcode library paths into programs... immediate checking whether stripping libraries is possible... yes checking if libtool supports shared libraries... yes checking whether to build shared libraries... yes checking whether to build static libraries... no configure: creating ./config.status config.status: creating config.h config.status: executing libtool commands + /usr/bin/make -Otarget -j5 'CFLAGS_CLEAN=-O2 -fwrapv -pipe -Wformat -Werror=format-security -gdwarf-4 -fno-debug-types-section -fvar-tracking-assignments -g2 -Wp,-D_FORTIFY_SOURCE=2 -fstack-protector-strong --param=ssp-buffer-size=4 -fPIC -march=x86-64 -gdwarf-4 -fno-debug-types-section -fvar-tracking-assignments -g2 ' /bin/sh /tmp/B.k9VpwB/BUILD/php70-pecl-imagick-3.4.3/libtool --mode=compile x86_64-pld-linux-gcc -fopenmp -DMAGICKCORE_HDRI_ENABLE=0 -DMAGICKCORE_QUANTUM_DEPTH=16 -fopenmp -DMAGICKCORE_HDRI_ENABLE=0 -DMAGICKCORE_QUANTUM_DEPTH=16 -I/usr/include/ImageMagick-7 -I. -I/tmp/B.k9VpwB/BUILD/php70-pecl-imagick-3.4.3 -DPHP_ATOM_INC -I/tmp/B.k9VpwB/BUILD/php70-pecl-imagick-3.4.3/include -I/tmp/B.k9VpwB/BUILD/php70-pecl-imagick-3.4.3/main -I/tmp/B.k9VpwB/BUILD/php70-pecl-imagick-3.4.3 -I/usr/include/php -I/usr/include/php/main -I/usr/include/php/TSRM -I/usr/include/php/Zend -I/usr/include/php/ext -I/usr/include/php/ext/date/lib -I/usr/include/ImageMagick-7 -DHAVE_CONFIG_H -O2 -fwrapv -pipe -Wformat -Werror=format-security -gdwarf-4 -fno-debug-types-section -fvar-tracking-assignments -g2 -Wp,-D_FORTIFY_SOURCE=2 -fstack-protector-strong --param=ssp-buffer-size=4 -fPIC -march=x86-64 -gdwarf-4 -fno-debug-types-section -fvar-tracking-assignments -g2 -c /tmp/B.k9VpwB/BUILD/php70-pecl-imagick-3.4.3/imagickpixel_class.c -o imagickpixel_class.lo libtool: compile: x86_64-pld-linux-gcc -fopenmp -DMAGICKCORE_HDRI_ENABLE=0 -DMAGICKCORE_QUANTUM_DEPTH=16 -fopenmp -DMAGICKCORE_HDRI_ENABLE=0 -DMAGICKCORE_QUANTUM_DEPTH=16 -I/usr/include/ImageMagick-7 -I. -I/tmp/B.k9VpwB/BUILD/php70-pecl-imagick-3.4.3 -DPHP_ATOM_INC -I/tmp/B.k9VpwB/BUILD/php70-pecl-imagick-3.4.3/include -I/tmp/B.k9VpwB/BUILD/php70-pecl-imagick-3.4.3/main -I/tmp/B.k9VpwB/BUILD/php70-pecl-imagick-3.4.3 -I/usr/include/php -I/usr/include/php/main -I/usr/include/php/TSRM -I/usr/include/php/Zend -I/usr/include/php/ext -I/usr/include/php/ext/date/lib -I/usr/include/ImageMagick-7 -DHAVE_CONFIG_H -O2 -fwrapv -pipe -Wformat -Werror=format-security -gdwarf-4 -fno-debug-types-section -fvar-tracking-assignments -g2 -Wp,-D_FORTIFY_SOURCE=2 -fstack-protector-strong --param=ssp-buffer-size=4 -fPIC -march=x86-64 -gdwarf-4 -fno-debug-types-section -fvar-tracking-assignments -g2 -c /tmp/B.k9VpwB/BUILD/php70-pecl-imagick-3.4.3/imagickpixel_class.c -fPIC -DPIC -o .libs/imagickpixel_class.o /bin/sh /tmp/B.k9VpwB/BUILD/php70-pecl-imagick-3.4.3/libtool --mode=compile x86_64-pld-linux-gcc -fopenmp -DMAGICKCORE_HDRI_ENABLE=0 -DMAGICKCORE_QUANTUM_DEPTH=16 -fopenmp -DMAGICKCORE_HDRI_ENABLE=0 -DMAGICKCORE_QUANTUM_DEPTH=16 -I/usr/include/ImageMagick-7 -I. -I/tmp/B.k9VpwB/BUILD/php70-pecl-imagick-3.4.3 -DPHP_ATOM_INC -I/tmp/B.k9VpwB/BUILD/php70-pecl-imagick-3.4.3/include -I/tmp/B.k9VpwB/BUILD/php70-pecl-imagick-3.4.3/main -I/tmp/B.k9VpwB/BUILD/php70-pecl-imagick-3.4.3 -I/usr/include/php -I/usr/include/php/main -I/usr/include/php/TSRM -I/usr/include/php/Zend -I/usr/include/php/ext -I/usr/include/php/ext/date/lib -I/usr/include/ImageMagick-7 -DHAVE_CONFIG_H -O2 -fwrapv -pipe -Wformat -Werror=format-security -gdwarf-4 -fno-debug-types-section -fvar-tracking-assignments -g2 -Wp,-D_FORTIFY_SOURCE=2 -fstack-protector-strong --param=ssp-buffer-size=4 -fPIC -march=x86-64 -gdwarf-4 -fno-debug-types-section -fvar-tracking-assignments -g2 -c /tmp/B.k9VpwB/BUILD/php70-pecl-imagick-3.4.3/imagick_file.c -o imagick_file.lo libtool: compile: x86_64-pld-linux-gcc -fopenmp -DMAGICKCORE_HDRI_ENABLE=0 -DMAGICKCORE_QUANTUM_DEPTH=16 -fopenmp -DMAGICKCORE_HDRI_ENABLE=0 -DMAGICKCORE_QUANTUM_DEPTH=16 -I/usr/include/ImageMagick-7 -I. -I/tmp/B.k9VpwB/BUILD/php70-pecl-imagick-3.4.3 -DPHP_ATOM_INC -I/tmp/B.k9VpwB/BUILD/php70-pecl-imagick-3.4.3/include -I/tmp/B.k9VpwB/BUILD/php70-pecl-imagick-3.4.3/main -I/tmp/B.k9VpwB/BUILD/php70-pecl-imagick-3.4.3 -I/usr/include/php -I/usr/include/php/main -I/usr/include/php/TSRM -I/usr/include/php/Zend -I/usr/include/php/ext -I/usr/include/php/ext/date/lib -I/usr/include/ImageMagick-7 -DHAVE_CONFIG_H -O2 -fwrapv -pipe -Wformat -Werror=format-security -gdwarf-4 -fno-debug-types-section -fvar-tracking-assignments -g2 -Wp,-D_FORTIFY_SOURCE=2 -fstack-protector-strong --param=ssp-buffer-size=4 -fPIC -march=x86-64 -gdwarf-4 -fno-debug-types-section -fvar-tracking-assignments -g2 -c /tmp/B.k9VpwB/BUILD/php70-pecl-imagick-3.4.3/imagick_file.c -fPIC -DPIC -o .libs/imagick_file.o /bin/sh /tmp/B.k9VpwB/BUILD/php70-pecl-imagick-3.4.3/libtool --mode=compile x86_64-pld-linux-gcc -fopenmp -DMAGICKCORE_HDRI_ENABLE=0 -DMAGICKCORE_QUANTUM_DEPTH=16 -fopenmp -DMAGICKCORE_HDRI_ENABLE=0 -DMAGICKCORE_QUANTUM_DEPTH=16 -I/usr/include/ImageMagick-7 -I. -I/tmp/B.k9VpwB/BUILD/php70-pecl-imagick-3.4.3 -DPHP_ATOM_INC -I/tmp/B.k9VpwB/BUILD/php70-pecl-imagick-3.4.3/include -I/tmp/B.k9VpwB/BUILD/php70-pecl-imagick-3.4.3/main -I/tmp/B.k9VpwB/BUILD/php70-pecl-imagick-3.4.3 -I/usr/include/php -I/usr/include/php/main -I/usr/include/php/TSRM -I/usr/include/php/Zend -I/usr/include/php/ext -I/usr/include/php/ext/date/lib -I/usr/include/ImageMagick-7 -DHAVE_CONFIG_H -O2 -fwrapv -pipe -Wformat -Werror=format-security -gdwarf-4 -fno-debug-types-section -fvar-tracking-assignments -g2 -Wp,-D_FORTIFY_SOURCE=2 -fstack-protector-strong --param=ssp-buffer-size=4 -fPIC -march=x86-64 -gdwarf-4 -fno-debug-types-section -fvar-tracking-assignments -g2 -c /tmp/B.k9VpwB/BUILD/php70-pecl-imagick-3.4.3/imagickpixeliterator_class.c -o imagickpixeliterator_class.lo libtool: compile: x86_64-pld-linux-gcc -fopenmp -DMAGICKCORE_HDRI_ENABLE=0 -DMAGICKCORE_QUANTUM_DEPTH=16 -fopenmp -DMAGICKCORE_HDRI_ENABLE=0 -DMAGICKCORE_QUANTUM_DEPTH=16 -I/usr/include/ImageMagick-7 -I. -I/tmp/B.k9VpwB/BUILD/php70-pecl-imagick-3.4.3 -DPHP_ATOM_INC -I/tmp/B.k9VpwB/BUILD/php70-pecl-imagick-3.4.3/include -I/tmp/B.k9VpwB/BUILD/php70-pecl-imagick-3.4.3/main -I/tmp/B.k9VpwB/BUILD/php70-pecl-imagick-3.4.3 -I/usr/include/php -I/usr/include/php/main -I/usr/include/php/TSRM -I/usr/include/php/Zend -I/usr/include/php/ext -I/usr/include/php/ext/date/lib -I/usr/include/ImageMagick-7 -DHAVE_CONFIG_H -O2 -fwrapv -pipe -Wformat -Werror=format-security -gdwarf-4 -fno-debug-types-section -fvar-tracking-assignments -g2 -Wp,-D_FORTIFY_SOURCE=2 -fstack-protector-strong --param=ssp-buffer-size=4 -fPIC -march=x86-64 -gdwarf-4 -fno-debug-types-section -fvar-tracking-assignments -g2 -c /tmp/B.k9VpwB/BUILD/php70-pecl-imagick-3.4.3/imagickpixeliterator_class.c -fPIC -DPIC -o .libs/imagickpixeliterator_class.o /bin/sh /tmp/B.k9VpwB/BUILD/php70-pecl-imagick-3.4.3/libtool --mode=compile x86_64-pld-linux-gcc -fopenmp -DMAGICKCORE_HDRI_ENABLE=0 -DMAGICKCORE_QUANTUM_DEPTH=16 -fopenmp -DMAGICKCORE_HDRI_ENABLE=0 -DMAGICKCORE_QUANTUM_DEPTH=16 -I/usr/include/ImageMagick-7 -I. -I/tmp/B.k9VpwB/BUILD/php70-pecl-imagick-3.4.3 -DPHP_ATOM_INC -I/tmp/B.k9VpwB/BUILD/php70-pecl-imagick-3.4.3/include -I/tmp/B.k9VpwB/BUILD/php70-pecl-imagick-3.4.3/main -I/tmp/B.k9VpwB/BUILD/php70-pecl-imagick-3.4.3 -I/usr/include/php -I/usr/include/php/main -I/usr/include/php/TSRM -I/usr/include/php/Zend -I/usr/include/php/ext -I/usr/include/php/ext/date/lib -I/usr/include/ImageMagick-7 -DHAVE_CONFIG_H -O2 -fwrapv -pipe -Wformat -Werror=format-security -gdwarf-4 -fno-debug-types-section -fvar-tracking-assignments -g2 -Wp,-D_FORTIFY_SOURCE=2 -fstack-protector-strong --param=ssp-buffer-size=4 -fPIC -march=x86-64 -gdwarf-4 -fno-debug-types-section -fvar-tracking-assignments -g2 -c /tmp/B.k9VpwB/BUILD/php70-pecl-imagick-3.4.3/imagickkernel_class.c -o imagickkernel_class.lo libtool: compile: x86_64-pld-linux-gcc -fopenmp -DMAGICKCORE_HDRI_ENABLE=0 -DMAGICKCORE_QUANTUM_DEPTH=16 -fopenmp -DMAGICKCORE_HDRI_ENABLE=0 -DMAGICKCORE_QUANTUM_DEPTH=16 -I/usr/include/ImageMagick-7 -I. -I/tmp/B.k9VpwB/BUILD/php70-pecl-imagick-3.4.3 -DPHP_ATOM_INC -I/tmp/B.k9VpwB/BUILD/php70-pecl-imagick-3.4.3/include -I/tmp/B.k9VpwB/BUILD/php70-pecl-imagick-3.4.3/main -I/tmp/B.k9VpwB/BUILD/php70-pecl-imagick-3.4.3 -I/usr/include/php -I/usr/include/php/main -I/usr/include/php/TSRM -I/usr/include/php/Zend -I/usr/include/php/ext -I/usr/include/php/ext/date/lib -I/usr/include/ImageMagick-7 -DHAVE_CONFIG_H -O2 -fwrapv -pipe -Wformat -Werror=format-security -gdwarf-4 -fno-debug-types-section -fvar-tracking-assignments -g2 -Wp,-D_FORTIFY_SOURCE=2 -fstack-protector-strong --param=ssp-buffer-size=4 -fPIC -march=x86-64 -gdwarf-4 -fno-debug-types-section -fvar-tracking-assignments -g2 -c /tmp/B.k9VpwB/BUILD/php70-pecl-imagick-3.4.3/imagickkernel_class.c -fPIC -DPIC -o .libs/imagickkernel_class.o /bin/sh /tmp/B.k9VpwB/BUILD/php70-pecl-imagick-3.4.3/libtool --mode=compile x86_64-pld-linux-gcc -fopenmp -DMAGICKCORE_HDRI_ENABLE=0 -DMAGICKCORE_QUANTUM_DEPTH=16 -fopenmp -DMAGICKCORE_HDRI_ENABLE=0 -DMAGICKCORE_QUANTUM_DEPTH=16 -I/usr/include/ImageMagick-7 -I. -I/tmp/B.k9VpwB/BUILD/php70-pecl-imagick-3.4.3 -DPHP_ATOM_INC -I/tmp/B.k9VpwB/BUILD/php70-pecl-imagick-3.4.3/include -I/tmp/B.k9VpwB/BUILD/php70-pecl-imagick-3.4.3/main -I/tmp/B.k9VpwB/BUILD/php70-pecl-imagick-3.4.3 -I/usr/include/php -I/usr/include/php/main -I/usr/include/php/TSRM -I/usr/include/php/Zend -I/usr/include/php/ext -I/usr/include/php/ext/date/lib -I/usr/include/ImageMagick-7 -DHAVE_CONFIG_H -O2 -fwrapv -pipe -Wformat -Werror=format-security -gdwarf-4 -fno-debug-types-section -fvar-tracking-assignments -g2 -Wp,-D_FORTIFY_SOURCE=2 -fstack-protector-strong --param=ssp-buffer-size=4 -fPIC -march=x86-64 -gdwarf-4 -fno-debug-types-section -fvar-tracking-assignments -g2 -c /tmp/B.k9VpwB/BUILD/php70-pecl-imagick-3.4.3/imagick.c -o imagick.lo libtool: compile: x86_64-pld-linux-gcc -fopenmp -DMAGICKCORE_HDRI_ENABLE=0 -DMAGICKCORE_QUANTUM_DEPTH=16 -fopenmp -DMAGICKCORE_HDRI_ENABLE=0 -DMAGICKCORE_QUANTUM_DEPTH=16 -I/usr/include/ImageMagick-7 -I. -I/tmp/B.k9VpwB/BUILD/php70-pecl-imagick-3.4.3 -DPHP_ATOM_INC -I/tmp/B.k9VpwB/BUILD/php70-pecl-imagick-3.4.3/include -I/tmp/B.k9VpwB/BUILD/php70-pecl-imagick-3.4.3/main -I/tmp/B.k9VpwB/BUILD/php70-pecl-imagick-3.4.3 -I/usr/include/php -I/usr/include/php/main -I/usr/include/php/TSRM -I/usr/include/php/Zend -I/usr/include/php/ext -I/usr/include/php/ext/date/lib -I/usr/include/ImageMagick-7 -DHAVE_CONFIG_H -O2 -fwrapv -pipe -Wformat -Werror=format-security -gdwarf-4 -fno-debug-types-section -fvar-tracking-assignments -g2 -Wp,-D_FORTIFY_SOURCE=2 -fstack-protector-strong --param=ssp-buffer-size=4 -fPIC -march=x86-64 -gdwarf-4 -fno-debug-types-section -fvar-tracking-assignments -g2 -c /tmp/B.k9VpwB/BUILD/php70-pecl-imagick-3.4.3/imagick.c -fPIC -DPIC -o .libs/imagick.o /bin/sh /tmp/B.k9VpwB/BUILD/php70-pecl-imagick-3.4.3/libtool --mode=compile x86_64-pld-linux-gcc -fopenmp -DMAGICKCORE_HDRI_ENABLE=0 -DMAGICKCORE_QUANTUM_DEPTH=16 -fopenmp -DMAGICKCORE_HDRI_ENABLE=0 -DMAGICKCORE_QUANTUM_DEPTH=16 -I/usr/include/ImageMagick-7 -I. -I/tmp/B.k9VpwB/BUILD/php70-pecl-imagick-3.4.3 -DPHP_ATOM_INC -I/tmp/B.k9VpwB/BUILD/php70-pecl-imagick-3.4.3/include -I/tmp/B.k9VpwB/BUILD/php70-pecl-imagick-3.4.3/main -I/tmp/B.k9VpwB/BUILD/php70-pecl-imagick-3.4.3 -I/usr/include/php -I/usr/include/php/main -I/usr/include/php/TSRM -I/usr/include/php/Zend -I/usr/include/php/ext -I/usr/include/php/ext/date/lib -I/usr/include/ImageMagick-7 -DHAVE_CONFIG_H -O2 -fwrapv -pipe -Wformat -Werror=format-security -gdwarf-4 -fno-debug-types-section -fvar-tracking-assignments -g2 -Wp,-D_FORTIFY_SOURCE=2 -fstack-protector-strong --param=ssp-buffer-size=4 -fPIC -march=x86-64 -gdwarf-4 -fno-debug-types-section -fvar-tracking-assignments -g2 -c /tmp/B.k9VpwB/BUILD/php70-pecl-imagick-3.4.3/imagick_helpers.c -o imagick_helpers.lo libtool: compile: x86_64-pld-linux-gcc -fopenmp -DMAGICKCORE_HDRI_ENABLE=0 -DMAGICKCORE_QUANTUM_DEPTH=16 -fopenmp -DMAGICKCORE_HDRI_ENABLE=0 -DMAGICKCORE_QUANTUM_DEPTH=16 -I/usr/include/ImageMagick-7 -I. -I/tmp/B.k9VpwB/BUILD/php70-pecl-imagick-3.4.3 -DPHP_ATOM_INC -I/tmp/B.k9VpwB/BUILD/php70-pecl-imagick-3.4.3/include -I/tmp/B.k9VpwB/BUILD/php70-pecl-imagick-3.4.3/main -I/tmp/B.k9VpwB/BUILD/php70-pecl-imagick-3.4.3 -I/usr/include/php -I/usr/include/php/main -I/usr/include/php/TSRM -I/usr/include/php/Zend -I/usr/include/php/ext -I/usr/include/php/ext/date/lib -I/usr/include/ImageMagick-7 -DHAVE_CONFIG_H -O2 -fwrapv -pipe -Wformat -Werror=format-security -gdwarf-4 -fno-debug-types-section -fvar-tracking-assignments -g2 -Wp,-D_FORTIFY_SOURCE=2 -fstack-protector-strong --param=ssp-buffer-size=4 -fPIC -march=x86-64 -gdwarf-4 -fno-debug-types-section -fvar-tracking-assignments -g2 -c /tmp/B.k9VpwB/BUILD/php70-pecl-imagick-3.4.3/imagick_helpers.c -fPIC -DPIC -o .libs/imagick_helpers.o /bin/sh /tmp/B.k9VpwB/BUILD/php70-pecl-imagick-3.4.3/libtool --mode=compile x86_64-pld-linux-gcc -fopenmp -DMAGICKCORE_HDRI_ENABLE=0 -DMAGICKCORE_QUANTUM_DEPTH=16 -fopenmp -DMAGICKCORE_HDRI_ENABLE=0 -DMAGICKCORE_QUANTUM_DEPTH=16 -I/usr/include/ImageMagick-7 -I. -I/tmp/B.k9VpwB/BUILD/php70-pecl-imagick-3.4.3 -DPHP_ATOM_INC -I/tmp/B.k9VpwB/BUILD/php70-pecl-imagick-3.4.3/include -I/tmp/B.k9VpwB/BUILD/php70-pecl-imagick-3.4.3/main -I/tmp/B.k9VpwB/BUILD/php70-pecl-imagick-3.4.3 -I/usr/include/php -I/usr/include/php/main -I/usr/include/php/TSRM -I/usr/include/php/Zend -I/usr/include/php/ext -I/usr/include/php/ext/date/lib -I/usr/include/ImageMagick-7 -DHAVE_CONFIG_H -O2 -fwrapv -pipe -Wformat -Werror=format-security -gdwarf-4 -fno-debug-types-section -fvar-tracking-assignments -g2 -Wp,-D_FORTIFY_SOURCE=2 -fstack-protector-strong --param=ssp-buffer-size=4 -fPIC -march=x86-64 -gdwarf-4 -fno-debug-types-section -fvar-tracking-assignments -g2 -c /tmp/B.k9VpwB/BUILD/php70-pecl-imagick-3.4.3/imagickdraw_class.c -o imagickdraw_class.lo libtool: compile: x86_64-pld-linux-gcc -fopenmp -DMAGICKCORE_HDRI_ENABLE=0 -DMAGICKCORE_QUANTUM_DEPTH=16 -fopenmp -DMAGICKCORE_HDRI_ENABLE=0 -DMAGICKCORE_QUANTUM_DEPTH=16 -I/usr/include/ImageMagick-7 -I. -I/tmp/B.k9VpwB/BUILD/php70-pecl-imagick-3.4.3 -DPHP_ATOM_INC -I/tmp/B.k9VpwB/BUILD/php70-pecl-imagick-3.4.3/include -I/tmp/B.k9VpwB/BUILD/php70-pecl-imagick-3.4.3/main -I/tmp/B.k9VpwB/BUILD/php70-pecl-imagick-3.4.3 -I/usr/include/php -I/usr/include/php/main -I/usr/include/php/TSRM -I/usr/include/php/Zend -I/usr/include/php/ext -I/usr/include/php/ext/date/lib -I/usr/include/ImageMagick-7 -DHAVE_CONFIG_H -O2 -fwrapv -pipe -Wformat -Werror=format-security -gdwarf-4 -fno-debug-types-section -fvar-tracking-assignments -g2 -Wp,-D_FORTIFY_SOURCE=2 -fstack-protector-strong --param=ssp-buffer-size=4 -fPIC -march=x86-64 -gdwarf-4 -fno-debug-types-section -fvar-tracking-assignments -g2 -c /tmp/B.k9VpwB/BUILD/php70-pecl-imagick-3.4.3/imagickdraw_class.c -fPIC -DPIC -o .libs/imagickdraw_class.o /bin/sh /tmp/B.k9VpwB/BUILD/php70-pecl-imagick-3.4.3/libtool --mode=compile x86_64-pld-linux-gcc -fopenmp -DMAGICKCORE_HDRI_ENABLE=0 -DMAGICKCORE_QUANTUM_DEPTH=16 -fopenmp -DMAGICKCORE_HDRI_ENABLE=0 -DMAGICKCORE_QUANTUM_DEPTH=16 -I/usr/include/ImageMagick-7 -I. -I/tmp/B.k9VpwB/BUILD/php70-pecl-imagick-3.4.3 -DPHP_ATOM_INC -I/tmp/B.k9VpwB/BUILD/php70-pecl-imagick-3.4.3/include -I/tmp/B.k9VpwB/BUILD/php70-pecl-imagick-3.4.3/main -I/tmp/B.k9VpwB/BUILD/php70-pecl-imagick-3.4.3 -I/usr/include/php -I/usr/include/php/main -I/usr/include/php/TSRM -I/usr/include/php/Zend -I/usr/include/php/ext -I/usr/include/php/ext/date/lib -I/usr/include/ImageMagick-7 -DHAVE_CONFIG_H -O2 -fwrapv -pipe -Wformat -Werror=format-security -gdwarf-4 -fno-debug-types-section -fvar-tracking-assignments -g2 -Wp,-D_FORTIFY_SOURCE=2 -fstack-protector-strong --param=ssp-buffer-size=4 -fPIC -march=x86-64 -gdwarf-4 -fno-debug-types-section -fvar-tracking-assignments -g2 -c /tmp/B.k9VpwB/BUILD/php70-pecl-imagick-3.4.3/shim_im6_to_im7.c -o shim_im6_to_im7.lo libtool: compile: x86_64-pld-linux-gcc -fopenmp -DMAGICKCORE_HDRI_ENABLE=0 -DMAGICKCORE_QUANTUM_DEPTH=16 -fopenmp -DMAGICKCORE_HDRI_ENABLE=0 -DMAGICKCORE_QUANTUM_DEPTH=16 -I/usr/include/ImageMagick-7 -I. -I/tmp/B.k9VpwB/BUILD/php70-pecl-imagick-3.4.3 -DPHP_ATOM_INC -I/tmp/B.k9VpwB/BUILD/php70-pecl-imagick-3.4.3/include -I/tmp/B.k9VpwB/BUILD/php70-pecl-imagick-3.4.3/main -I/tmp/B.k9VpwB/BUILD/php70-pecl-imagick-3.4.3 -I/usr/include/php -I/usr/include/php/main -I/usr/include/php/TSRM -I/usr/include/php/Zend -I/usr/include/php/ext -I/usr/include/php/ext/date/lib -I/usr/include/ImageMagick-7 -DHAVE_CONFIG_H -O2 -fwrapv -pipe -Wformat -Werror=format-security -gdwarf-4 -fno-debug-types-section -fvar-tracking-assignments -g2 -Wp,-D_FORTIFY_SOURCE=2 -fstack-protector-strong --param=ssp-buffer-size=4 -fPIC -march=x86-64 -gdwarf-4 -fno-debug-types-section -fvar-tracking-assignments -g2 -c /tmp/B.k9VpwB/BUILD/php70-pecl-imagick-3.4.3/shim_im6_to_im7.c -fPIC -DPIC -o .libs/shim_im6_to_im7.o /bin/sh /tmp/B.k9VpwB/BUILD/php70-pecl-imagick-3.4.3/libtool --mode=compile x86_64-pld-linux-gcc -fopenmp -DMAGICKCORE_HDRI_ENABLE=0 -DMAGICKCORE_QUANTUM_DEPTH=16 -fopenmp -DMAGICKCORE_HDRI_ENABLE=0 -DMAGICKCORE_QUANTUM_DEPTH=16 -I/usr/include/ImageMagick-7 -I. -I/tmp/B.k9VpwB/BUILD/php70-pecl-imagick-3.4.3 -DPHP_ATOM_INC -I/tmp/B.k9VpwB/BUILD/php70-pecl-imagick-3.4.3/include -I/tmp/B.k9VpwB/BUILD/php70-pecl-imagick-3.4.3/main -I/tmp/B.k9VpwB/BUILD/php70-pecl-imagick-3.4.3 -I/usr/include/php -I/usr/include/php/main -I/usr/include/php/TSRM -I/usr/include/php/Zend -I/usr/include/php/ext -I/usr/include/php/ext/date/lib -I/usr/include/ImageMagick-7 -DHAVE_CONFIG_H -O2 -fwrapv -pipe -Wformat -Werror=format-security -gdwarf-4 -fno-debug-types-section -fvar-tracking-assignments -g2 -Wp,-D_FORTIFY_SOURCE=2 -fstack-protector-strong --param=ssp-buffer-size=4 -fPIC -march=x86-64 -gdwarf-4 -fno-debug-types-section -fvar-tracking-assignments -g2 -c /tmp/B.k9VpwB/BUILD/php70-pecl-imagick-3.4.3/imagick_class.c -o imagick_class.lo libtool: compile: x86_64-pld-linux-gcc -fopenmp -DMAGICKCORE_HDRI_ENABLE=0 -DMAGICKCORE_QUANTUM_DEPTH=16 -fopenmp -DMAGICKCORE_HDRI_ENABLE=0 -DMAGICKCORE_QUANTUM_DEPTH=16 -I/usr/include/ImageMagick-7 -I. -I/tmp/B.k9VpwB/BUILD/php70-pecl-imagick-3.4.3 -DPHP_ATOM_INC -I/tmp/B.k9VpwB/BUILD/php70-pecl-imagick-3.4.3/include -I/tmp/B.k9VpwB/BUILD/php70-pecl-imagick-3.4.3/main -I/tmp/B.k9VpwB/BUILD/php70-pecl-imagick-3.4.3 -I/usr/include/php -I/usr/include/php/main -I/usr/include/php/TSRM -I/usr/include/php/Zend -I/usr/include/php/ext -I/usr/include/php/ext/date/lib -I/usr/include/ImageMagick-7 -DHAVE_CONFIG_H -O2 -fwrapv -pipe -Wformat -Werror=format-security -gdwarf-4 -fno-debug-types-section -fvar-tracking-assignments -g2 -Wp,-D_FORTIFY_SOURCE=2 -fstack-protector-strong --param=ssp-buffer-size=4 -fPIC -march=x86-64 -gdwarf-4 -fno-debug-types-section -fvar-tracking-assignments -g2 -c /tmp/B.k9VpwB/BUILD/php70-pecl-imagick-3.4.3/imagick_class.c -fPIC -DPIC -o .libs/imagick_class.o /bin/sh /tmp/B.k9VpwB/BUILD/php70-pecl-imagick-3.4.3/libtool --mode=link x86_64-pld-linux-gcc -DPHP_ATOM_INC -I/tmp/B.k9VpwB/BUILD/php70-pecl-imagick-3.4.3/include -I/tmp/B.k9VpwB/BUILD/php70-pecl-imagick-3.4.3/main -I/tmp/B.k9VpwB/BUILD/php70-pecl-imagick-3.4.3 -I/usr/include/php -I/usr/include/php/main -I/usr/include/php/TSRM -I/usr/include/php/Zend -I/usr/include/php/ext -I/usr/include/php/ext/date/lib -I/usr/include/ImageMagick-7 -DHAVE_CONFIG_H -O2 -fwrapv -pipe -Wformat -Werror=format-security -gdwarf-4 -fno-debug-types-section -fvar-tracking-assignments -g2 -Wp,-D_FORTIFY_SOURCE=2 -fstack-protector-strong --param=ssp-buffer-size=4 -fPIC -march=x86-64 -gdwarf-4 -fno-debug-types-section -fvar-tracking-assignments -g2 -Wl,--as-needed -Wl,--no-copy-dt-needed-entries -Wl,-z,relro -Wl,-z,combreloc -o imagick.la -export-dynamic -avoid-version -prefer-pic -module -rpath /tmp/B.k9VpwB/BUILD/php70-pecl-imagick-3.4.3/modules imagick_file.lo imagick_class.lo imagickdraw_class.lo imagickpixel_class.lo imagickpixeliterator_class.lo imagick_helpers.lo imagick.lo imagickkernel_class.lo shim_im6_to_im7.lo -lMagickWand-7.Q16 -lMagickCore-7.Q16 libtool: link: x86_64-pld-linux-gcc -shared -fPIC -DPIC -O2 -gdwarf-4 -g2 -fstack-protector-strong -march=x86-64 -gdwarf-4 -g2 -Wl,--as-needed -Wl,--no-copy-dt-needed-entries -Wl,-z -Wl,relro -Wl,-z -Wl,combreloc .libs/imagick_file.o .libs/imagick_class.o .libs/imagickdraw_class.o .libs/imagickpixel_class.o .libs/imagickpixeliterator_class.o .libs/imagick_helpers.o .libs/imagick.o .libs/imagickkernel_class.o .libs/shim_im6_to_im7.o -lMagickWand-7.Q16 -lMagickCore-7.Q16 -Wl,-soname -Wl,imagick.so -o .libs/imagick.so libtool: link: ( cd ".libs" && rm -f "imagick.la" && ln -s "../imagick.la" "imagick.la" ) /bin/sh /tmp/B.k9VpwB/BUILD/php70-pecl-imagick-3.4.3/libtool --mode=install cp ./imagick.la /tmp/B.k9VpwB/BUILD/php70-pecl-imagick-3.4.3/modules libtool: install: cp ./.libs/imagick.so /tmp/B.k9VpwB/BUILD/php70-pecl-imagick-3.4.3/modules/imagick.so libtool: install: cp ./.libs/imagick.lai /tmp/B.k9VpwB/BUILD/php70-pecl-imagick-3.4.3/modules/imagick.la libtool: finish: PATH="/home/users/builder/GNUstep/Tools:/usr/local/bin:/usr/bin:/bin:/home/users/builder/bin:/sbin" ldconfig -n /tmp/B.k9VpwB/BUILD/php70-pecl-imagick-3.4.3/modules ---------------------------------------------------------------------- Libraries have been installed in: /tmp/B.k9VpwB/BUILD/php70-pecl-imagick-3.4.3/modules If you ever happen to want to link against installed libraries in a given directory, LIBDIR, you must either use libtool, and specify the full pathname of the library, or use the '-LLIBDIR' flag during linking and do at least one of the following: - add LIBDIR to the 'LD_LIBRARY_PATH' environment variable during execution - add LIBDIR to the 'LD_RUN_PATH' environment variable during linking - use the '-Wl,-rpath -Wl,LIBDIR' linker flag - have your system administrator add LIBDIR to '/etc/ld.so.conf' See any operating system documentation about shared libraries for more information, such as the ld(1) and ld.so(8) manual pages. ---------------------------------------------------------------------- Build complete. Don't forget to run 'make test'. + >modules.log + /usr/bin/php70 -n -q -d 'extension_dir=modules' -d 'extension=/usr/lib64/php70/pcre.so' -d 'extension=/usr/lib64/php70/spl.so' -d 'extension=imagick.so' -m + grep imagick modules.log imagick + export 'NO_INTERACTION=1' 'REPORT_EXIT_STATUS=1' 'MALLOC_CHECK_=2' + /usr/bin/make -Otarget -j5 test 'PHP_EXECUTABLE=/usr/bin/php70' 'PHP_TEST_SHARED_SYSTEM_EXTENSIONS=pcre spl' Build complete. Don't forget to run 'make test'. ===================================================================== PHP : /usr/bin/php70 PHP_SAPI : cli PHP_VERSION : 7.0.26 ZEND_VERSION: 3.0.0 PHP_OS : Linux - Linux ymir-builder 4.1.45-1 #1 SMP Sat Oct 21 22:54:13 CEST 2017 x86_64 INI actual : /tmp/B.k9VpwB/BUILD/php70-pecl-imagick-3.4.3/tmp-php.ini More .INIs : CWD : /tmp/B.k9VpwB/BUILD/php70-pecl-imagick-3.4.3 Extra dirs : VALGRIND : Not used ===================================================================== TIME START 2017-12-26 13:18:53 ===================================================================== TEST 1/268 [tests/001_imagick_readimage.phpt] PASS Imagick::readImage test [tests/001_imagick_readimage.phpt] TEST 2/268 [tests/002_thumbnail.phpt] PASS Different types of thumbnailing [tests/002_thumbnail.phpt] TEST 3/268 [tests/003_cast_color_opacity.phpt] PASS Casting color and opacity to pixel [tests/003_cast_color_opacity.phpt] TEST 4/268 [tests/004_clone.phpt] PASS Testing clone keyword [tests/004_clone.phpt] TEST 5/268 [tests/005_bestfit.phpt] PASS Test thumbnail bestfit [tests/005_bestfit.phpt] TEST 6/268 [tests/006_cropthumbnail.phpt] PASS Test cropthumbnail [tests/006_cropthumbnail.phpt] TEST 7/268 [tests/007_thumbnail_fill.phpt] PASS Test filling thumbnail with color [tests/007_thumbnail_fill.phpt] TEST 8/268 [tests/008_newpseudoimage.phpt] PASS Test pseudo formats [tests/008_newpseudoimage.phpt] TEST 9/268 [tests/009_properties.phpt] PASS Test reading properties [tests/009_properties.phpt] TEST 10/268 [tests/010_importimagepixels.phpt] PASS Test importimagepixels [tests/010_importimagepixels.phpt] TEST 11/268 [tests/011_polygon.phpt] PASS Test polygon method arguments [tests/011_polygon.phpt] TEST 12/268 [tests/012-clone-separation.phpt] PASS Testing that cloned object does not affect the original [tests/012-clone-separation.phpt] TEST 13/268 [tests/013-read-filehandle.phpt] PASS Imagick::readImageFile test [tests/013-read-filehandle.phpt] TEST 14/268 [tests/014-setresourcelimit.phpt] PASS Imagick::setResourceLimit test [tests/014-setresourcelimit.phpt] TEST 15/268 [tests/015-imagickdrawsetresolution.phpt] PASS Test ImagickDraw->setResolution [tests/015-imagickdrawsetresolution.phpt] TEST 16/268 [tests/016-static-methods.phpt] PASS Test static methods [tests/016-static-methods.phpt] TEST 17/268 [tests/017-clear-destroy.phpt] PASS Clear and destroy aliases [tests/017-clear-destroy.phpt] TEST 18/268 [tests/018-clone-length.phpt] PASS Test clone length, this is expected upstream behaviour [tests/018-clone-length.phpt] TEST 19/268 [tests/019-readimages.phpt] PASS Imagick::readImages [tests/019-readimages.phpt] TEST 20/268 [tests/020-pixeliterator.phpt] PASS Pixel Iterator tests [tests/020-pixeliterator.phpt] TEST 21/268 [tests/021-countable.phpt] PASS Test countable interface [tests/021-countable.phpt] TEST 22/268 [tests/022-writeimagefileformat.phpt] PASS Test format support in writeImageFile [tests/022-writeimagefileformat.phpt] TEST 23/268 [tests/024-ispixelsimilar.phpt] PASS Test ImagickPixel::isPixelSimilar [tests/024-ispixelsimilar.phpt] TEST 24/268 [tests/025-function-image.phpt] SKIP Test functionimage [tests/025-function-image.phpt] reason: ImageMagick installed 707 >= limit check 700 TEST 25/268 [tests/025-get-color.phpt] PASS Test getColor and getColorQuantum [tests/025-get-color.phpt] TEST 26/268 [tests/026_phpinfo.phpt] PASS Test Imagick module hasn't broken phpinfo [tests/026_phpinfo.phpt] TEST 27/268 [tests/027_Imagick_adaptiveResizeImage_basic.phpt] PASS Test Imagick, adaptiveResizeImage [tests/027_Imagick_adaptiveResizeImage_basic.phpt] TEST 28/268 [tests/028_Imagick_adaptiveSharpenImage_basic.phpt] PASS Test Imagick, adaptiveSharpenImage [tests/028_Imagick_adaptiveSharpenImage_basic.phpt] TEST 29/268 [tests/029_Imagick_adaptiveBlurImage_basic.phpt] PASS Test Imagick, adaptiveBlurImage [tests/029_Imagick_adaptiveBlurImage_basic.phpt] TEST 30/268 [tests/030_Imagick_adaptiveThresholdImage_basic.phpt] PASS Test Imagick, adaptiveThresholdImage [tests/030_Imagick_adaptiveThresholdImage_basic.phpt] TEST 31/268 [tests/031_Imagick_affineTransformImage_basic.phpt] PASS Test Imagick, affineTransformImage [tests/031_Imagick_affineTransformImage_basic.phpt] TEST 32/268 [tests/032_Imagick_addNoiseImage_basic.phpt] PASS Test Imagick, addNoiseImage [tests/032_Imagick_addNoiseImage_basic.phpt] TEST 33/268 [tests/033_Imagick_autoLevelImage_basic.phpt] PASS Test Imagick, autoLevelImage [tests/033_Imagick_autoLevelImage_basic.phpt] TEST 34/268 [tests/034_Imagick_annotateImage_basic.phpt] XFAIL Test Imagick, annotateImage [tests/034_Imagick_annotateImage_basic.phpt] XFAIL REASON: Skip TEST 35/268 [tests/035_Imagick_blackThresholdImage_basic.phpt] PASS Test Imagick, blackThresholdImage [tests/035_Imagick_blackThresholdImage_basic.phpt] TEST 36/268 [tests/036_Imagick_blueShiftImage_basic.phpt] PASS Test Imagick, blueShiftImage [tests/036_Imagick_blueShiftImage_basic.phpt] TEST 37/268 [tests/037_Imagick_blurImage_basic.phpt] PASS Test Imagick, blurImage [tests/037_Imagick_blurImage_basic.phpt] TEST 38/268 [tests/038_Imagick_brightnessContrastImage_basic.phpt] PASS Test Imagick, brightnessContrastImage [tests/038_Imagick_brightnessContrastImage_basic.phpt] TEST 39/268 [tests/039_Imagick_borderImage_basic.phpt] PASS Test Imagick, borderImage [tests/039_Imagick_borderImage_basic.phpt] TEST 40/268 [tests/040_Imagick_charcoalImage_basic.phpt] PASS Test Imagick, charcoalImage [tests/040_Imagick_charcoalImage_basic.phpt] TEST 41/268 [tests/041_Imagick_chopImage_basic.phpt] PASS Test Imagick, chopImage [tests/041_Imagick_chopImage_basic.phpt] TEST 42/268 [tests/042_Imagick_clutImage_basic.phpt] PASS Test Imagick, clutImage [tests/042_Imagick_clutImage_basic.phpt] TEST 43/268 [tests/043_Imagick_colorizeImage_basic.phpt] PASS Test Imagick, colorizeImage [tests/043_Imagick_colorizeImage_basic.phpt] TEST 44/268 [tests/044_Imagick_colorMatrixImage_basic.phpt] PASS Test Imagick, colorMatrixImage [tests/044_Imagick_colorMatrixImage_basic.phpt] TEST 45/268 [tests/045_Imagick_compositeImage_basic.phpt] PASS Test Imagick, compositeImage [tests/045_Imagick_compositeImage_basic.phpt] TEST 46/268 [tests/046_Imagick_contrastImage_basic.phpt] PASS Test Imagick, contrastImage [tests/046_Imagick_contrastImage_basic.phpt] TEST 47/268 [tests/047_Imagick_convolveImage_6.phpt] SKIP Test Imagick, convolveImage [tests/047_Imagick_convolveImage_6.phpt] reason: ImageMagick installed 707 >= limit check 700 TEST 48/268 [tests/047_Imagick_convolveImage_7.phpt] PASS Test Imagick, convolveImage [tests/047_Imagick_convolveImage_7.phpt] TEST 49/268 [tests/048_Imagick_cropImage_basic.phpt] PASS Test Imagick, cropImage [tests/048_Imagick_cropImage_basic.phpt] TEST 50/268 [tests/049_Imagick_deskewImage_basic.phpt] PASS Test Imagick, deskewImage [tests/049_Imagick_deskewImage_basic.phpt] TEST 51/268 [tests/050_Imagick_distortImage_Affine.phpt] PASS Test Imagick, distortImage [tests/050_Imagick_distortImage_Affine.phpt] TEST 52/268 [tests/051_Imagick_distortImage_Projection.phpt] PASS Test Imagick, distortImage [tests/051_Imagick_distortImage_Projection.phpt] TEST 53/268 [tests/052_Imagick_distortImage_Arc.phpt] PASS Test Imagick, distortImage [tests/052_Imagick_distortImage_Arc.phpt] TEST 54/268 [tests/053_Imagick_distortImage_RotatedArc.phpt] PASS Test Imagick, distortImage [tests/053_Imagick_distortImage_RotatedArc.phpt] TEST 55/268 [tests/054_Imagick_distortImage_Bilinear.phpt] PASS Test Imagick, distortImage [tests/054_Imagick_distortImage_Bilinear.phpt] TEST 56/268 [tests/055_Imagick_distortImage_ScaleRotateTransform.phpt] PASS Test Imagick, distortImage [tests/055_Imagick_distortImage_ScaleRotateTransform.phpt] TEST 57/268 [tests/056_Imagick_distortImage_Perspective.phpt] PASS Test Imagick, distortImage [tests/056_Imagick_distortImage_Perspective.phpt] TEST 58/268 [tests/057_Imagick_distortImage_PerspectiveProjection.phpt] PASS Test Imagick, distortImage [tests/057_Imagick_distortImage_PerspectiveProjection.phpt] TEST 59/268 [tests/058_Imagick_distortImage_Polynomial.phpt] PASS Test Imagick, distortImage [tests/058_Imagick_distortImage_Polynomial.phpt] TEST 60/268 [tests/059_Imagick_distortImage_Polar.phpt] PASS Test Imagick, distortImage [tests/059_Imagick_distortImage_Polar.phpt] TEST 61/268 [tests/060_Imagick_distortImage_Polar.phpt] PASS Test Imagick, distortImage [tests/060_Imagick_distortImage_Polar.phpt] TEST 62/268 [tests/061_Imagick_distortImage_Barrel.phpt] PASS Test Imagick, distortImage [tests/061_Imagick_distortImage_Barrel.phpt] TEST 63/268 [tests/062_Imagick_distortImage_BarrelInverse.phpt] PASS Test Imagick, distortImage [tests/062_Imagick_distortImage_BarrelInverse.phpt] TEST 64/268 [tests/063_Imagick_distortImage_Shepards.phpt] PASS Test Imagick, distortImage [tests/063_Imagick_distortImage_Shepards.phpt] TEST 65/268 [tests/064_cropThumbNailImage.phpt] PASS Test for round issues [tests/064_cropThumbNailImage.phpt] TEST 66/268 [tests/065_Imagick_despeckleImage_basic.phpt] PASS Test Imagick, despeckleImage [tests/065_Imagick_despeckleImage_basic.phpt] TEST 67/268 [tests/066_Imagick_embossImage_basic.phpt] PASS Test Imagick, embossImage [tests/066_Imagick_embossImage_basic.phpt] TEST 68/268 [tests/067_Imagick_edgeImage_basic.phpt] PASS Test Imagick, edgeImage [tests/067_Imagick_edgeImage_basic.phpt] TEST 69/268 [tests/068_Imagick_enhanceImage_basic.phpt] PASS Test Imagick, enhanceImage [tests/068_Imagick_enhanceImage_basic.phpt] TEST 70/268 [tests/069_Imagick_equalizeImage_case1.phpt] PASS Test Imagick, equalizeImage [tests/069_Imagick_equalizeImage_case1.phpt] TEST 71/268 [tests/070_Imagick_equalizeImage_case2.phpt] PASS Test Imagick, equalizeImage [tests/070_Imagick_equalizeImage_case2.phpt] TEST 72/268 [tests/071_Imagick_flipImage_basic.phpt] PASS Test Imagick, flipImage [tests/071_Imagick_flipImage_basic.phpt] TEST 73/268 [tests/072_Imagick_evaluateImage_basic.phpt] PASS Test Imagick, evaluateImage [tests/072_Imagick_evaluateImage_basic.phpt] TEST 74/268 [tests/073_Imagick_forwardFourierTransformImage_basic.phpt] PASS Test Imagick, forwardFourierTransformImage [tests/073_Imagick_forwardFourierTransformImage_basic.phpt] TEST 75/268 [tests/074_Imagick_flopImage_basic.phpt] PASS Test Imagick, flopImage [tests/074_Imagick_flopImage_basic.phpt] TEST 76/268 [tests/075_Imagick_floodFillPaintImage_basic.phpt] PASS Test Imagick, floodFillPaintImage [tests/075_Imagick_floodFillPaintImage_basic.phpt] TEST 77/268 [tests/076_Imagick_fxImage_basic.phpt] PASS Test Imagick, fxImage [tests/076_Imagick_fxImage_basic.phpt] TEST 78/268 [tests/077_Imagick_frameImage_basic.phpt] PASS Test Imagick, frameImage [tests/077_Imagick_frameImage_basic.phpt] TEST 79/268 [tests/078_Imagick_gammaImage_basic.phpt] PASS Test Imagick, gammaImage [tests/078_Imagick_gammaImage_basic.phpt] TEST 80/268 [tests/079_Imagick_getImageGeometry_basic.phpt] PASS Test Imagick, getImageGeometry [tests/079_Imagick_getImageGeometry_basic.phpt] TEST 81/268 [tests/080_Imagick_gaussianBlurImage_basic.phpt] PASS Test Imagick, gaussianBlurImage [tests/080_Imagick_gaussianBlurImage_basic.phpt] TEST 82/268 [tests/081_Imagick_getImageHistogram_basic.phpt] PASS Test Imagick, getImageHistogram [tests/081_Imagick_getImageHistogram_basic.phpt] TEST 83/268 [tests/083_Imagick_getPixelIterator_basic.phpt] PASS Test Imagick, getPixelIterator [tests/083_Imagick_getPixelIterator_basic.phpt] TEST 84/268 [tests/084_Imagick_getPixelRegionIterator_basic.phpt] PASS Test Imagick, getPixelRegionIterator [tests/084_Imagick_getPixelRegionIterator_basic.phpt] TEST 85/268 [tests/085_Imagick_haldClutImage_basic.phpt] PASS Test Imagick, haldClutImage [tests/085_Imagick_haldClutImage_basic.phpt] TEST 86/268 [tests/086_Imagick_forwardFourierTransformImage_basic.phpt] PASS Test Imagick, forwardFourierTransformImage [tests/086_Imagick_forwardFourierTransformImage_basic.phpt] TEST 87/268 [tests/087_Imagick_levelImage_basic.phpt] PASS Test Imagick, levelImage [tests/087_Imagick_levelImage_basic.phpt] TEST 88/268 [tests/088_Imagick_implodeImage_basic.phpt] PASS Test Imagick, implodeImage [tests/088_Imagick_implodeImage_basic.phpt] TEST 89/268 [tests/089_Imagick_medianFilterImage_basic.phpt] SKIP Test Imagick, medianFilterImage [tests/089_Imagick_medianFilterImage_basic.phpt] reason: Class method Imagick::medianFilterImage not present TEST 90/268 [tests/090_Imagick_magnifyImage_basic.phpt] PASS Test Imagick, magnifyImage [tests/090_Imagick_magnifyImage_basic.phpt] TEST 91/268 [tests/091_Imagick_linearStretchImage_basic.phpt] PASS Test Imagick, linearStretchImage [tests/091_Imagick_linearStretchImage_basic.phpt] TEST 92/268 [tests/092_Imagick_mergeImageLayers_basic.phpt] PASS Test Imagick, mergeImageLayers [tests/092_Imagick_mergeImageLayers_basic.phpt] TEST 93/268 [tests/093_Imagick_modulateImage_basic.phpt] PASS Test Imagick, modulateImage [tests/093_Imagick_modulateImage_basic.phpt] TEST 94/268 [tests/094_Imagick_motionBlurImage_basic.phpt] PASS Test Imagick, motionBlurImage [tests/094_Imagick_motionBlurImage_basic.phpt] TEST 95/268 [tests/095_Imagick_normalizeImage_basic.phpt] PASS Test Imagick, normalizeImage [tests/095_Imagick_normalizeImage_basic.phpt] TEST 96/268 [tests/096_Imagick_negateImage_basic.phpt] PASS Test Imagick, negateImage [tests/096_Imagick_negateImage_basic.phpt] TEST 97/268 [tests/097_Imagick_newPseudoImage_basic.phpt] PASS Test Imagick, newPseudoImage [tests/097_Imagick_newPseudoImage_basic.phpt] TEST 98/268 [tests/098_Imagick_orderedPosterizeImage_basic.phpt] SKIP Test Imagick, orderedPosterizeImage [tests/098_Imagick_orderedPosterizeImage_basic.phpt] reason: Class method Imagick::orderedPosterizeImage not present TEST 99/268 [tests/099_Imagick_oilPaintImage_basic.phpt] PASS Test Imagick, oilPaintImage [tests/099_Imagick_oilPaintImage_basic.phpt] TEST 100/268 [tests/100_Imagick_posterizeImage_basic.phpt] PASS Test Imagick, posterizeImage [tests/100_Imagick_posterizeImage_basic.phpt] TEST 101/268 [tests/101_Imagick_quantizeImage_basic.phpt] PASS Test Imagick, quantizeImage [tests/101_Imagick_quantizeImage_basic.phpt] TEST 102/268 [tests/102_Imagick_radialBlurImage_basic.phpt] SKIP Test Imagick, radialBlurImage [tests/102_Imagick_radialBlurImage_basic.phpt] reason: Class method Imagick::radialBlurImage not present TEST 103/268 [tests/103_Imagick_readImageBlob_basic.phpt] PASS Test Imagick, readImageBlob [tests/103_Imagick_readImageBlob_basic.phpt] TEST 104/268 [tests/104_Imagick_randomThresholdImage_basic.phpt] PASS Test Imagick, randomThresholdImage [tests/104_Imagick_randomThresholdImage_basic.phpt] TEST 105/268 [tests/105_Imagick_raiseImage_basic.phpt] PASS Test Imagick, raiseImage [tests/105_Imagick_raiseImage_basic.phpt] TEST 106/268 [tests/106_Imagick_reduceNoiseImage_basic.phpt] SKIP Test Imagick, reduceNoiseImage [tests/106_Imagick_reduceNoiseImage_basic.phpt] reason: Class method Imagick::reduceNoiseImage not present TEST 107/268 [tests/107_Imagick_recolorImage_basic.phpt] SKIP Test Imagick, recolorImage [tests/107_Imagick_recolorImage_basic.phpt] reason: Class method Imagick::recolorImage not present TEST 108/268 [tests/108_Imagick_resampleImage_basic.phpt] PASS Test Imagick, resampleImage [tests/108_Imagick_resampleImage_basic.phpt] TEST 109/268 [tests/109_Imagick_rollImage_basic.phpt] PASS Test Imagick, rollImage [tests/109_Imagick_rollImage_basic.phpt] TEST 110/268 [tests/110_Imagick_resizeImage_basic.phpt] PASS Test Imagick, resizeImage [tests/110_Imagick_resizeImage_basic.phpt] TEST 111/268 [tests/111_Imagick_rotateImage_basic.phpt] PASS Test Imagick, rotateImage [tests/111_Imagick_rotateImage_basic.phpt] TEST 112/268 [tests/112_Imagick_roundCorners_basic.phpt] SKIP Test Imagick, roundCorners [tests/112_Imagick_roundCorners_basic.phpt] reason: Class method Imagick::roundCornersImage not present TEST 113/268 [tests/113_Imagick_rotationalBlurImage_basic.phpt] PASS Test Imagick, rotationalBlurImage [tests/113_Imagick_rotationalBlurImage_basic.phpt] TEST 114/268 [tests/114_Imagick_scaleImage_basic.phpt] PASS Test Imagick, scaleImage [tests/114_Imagick_scaleImage_basic.phpt] TEST 115/268 [tests/115_Imagick_selectiveBlurImage_basic.phpt] PASS Test Imagick, selectiveBlurImage [tests/115_Imagick_selectiveBlurImage_basic.phpt] TEST 116/268 [tests/116_Imagick_separateImageChannel_basic.phpt] PASS Test Imagick, separateImageChannel [tests/116_Imagick_separateImageChannel_basic.phpt] TEST 117/268 [tests/117_Imagick_segmentImage_basic.phpt] PASS Test Imagick, segmentImage [tests/117_Imagick_segmentImage_basic.phpt] TEST 118/268 [tests/118_Imagick_setImageArtifact_basic.phpt] PASS Test Imagick, setImageArtifact [tests/118_Imagick_setImageArtifact_basic.phpt] TEST 119/268 [tests/119_Imagick_sepiaToneImage_basic.phpt] PASS Test Imagick, sepiaToneImage [tests/119_Imagick_sepiaToneImage_basic.phpt] TEST 120/268 [tests/120_Imagick_setCompressionQuality_basic.phpt] PASS Test Imagick, setCompressionQuality [tests/120_Imagick_setCompressionQuality_basic.phpt] TEST 121/268 [tests/121_Imagick_setImageBias_basic.phpt] SKIP Test Imagick, setImageBias [tests/121_Imagick_setImageBias_basic.phpt] reason: Class method Imagick::setImageBias not present TEST 122/268 [tests/122_Imagick_setImageCompressionQuality_basic.phpt] PASS Test Imagick, setImageCompressionQuality [tests/122_Imagick_setImageCompressionQuality_basic.phpt] TEST 123/268 [tests/123_Imagick_setImageClipMask_basic.phpt] SKIP Test Imagick, setImageClipMask [tests/123_Imagick_setImageClipMask_basic.phpt] reason: Class method imagick::setImageClipMask not present TEST 124/268 [tests/125_Imagick_setImageOrientation_basic.phpt] PASS Test Imagick, setImageOrientation [tests/125_Imagick_setImageOrientation_basic.phpt] TEST 125/268 [tests/126_Imagick_getImageChannelStats_basic.phpt] PASS Test Imagick, getImageChannelStatistics [tests/126_Imagick_getImageChannelStats_basic.phpt] TEST 126/268 [tests/127_Imagick_progressMonitor_basic.phpt] PASS Test Imagick, progressMonitor [tests/127_Imagick_progressMonitor_basic.phpt] TEST 127/268 [tests/130_Imagick_setOption_case1.phpt] PASS Test Imagick, setOption [tests/130_Imagick_setOption_case1.phpt] TEST 128/268 [tests/131_Imagick_setOption_case2.phpt] PASS Test Imagick, setOption [tests/131_Imagick_setOption_case2.phpt] TEST 129/268 [tests/132_Imagick_setOption_case3.phpt] PASS Test Imagick, setOption [tests/132_Imagick_setOption_case3.phpt] TEST 130/268 [tests/133_Imagick_setSamplingFactors_basic.phpt] PASS Test Imagick, setSamplingFactors [tests/133_Imagick_setSamplingFactors_basic.phpt] TEST 131/268 [tests/134_Imagick_shadowImage_basic.phpt] PASS Test Imagick, shadowImage [tests/134_Imagick_shadowImage_basic.phpt] TEST 132/268 [tests/135_Imagick_sharpenImage_basic.phpt] PASS Test Imagick, sharpenImage [tests/135_Imagick_sharpenImage_basic.phpt] TEST 133/268 [tests/136_Imagick_shadeImage_basic.phpt] PASS Test Imagick, shadeImage [tests/136_Imagick_shadeImage_basic.phpt] TEST 134/268 [tests/137_Imagick_shearImage_basic.phpt] PASS Test Imagick, shearImage [tests/137_Imagick_shearImage_basic.phpt] TEST 135/268 [tests/138_Imagick_shaveImage_basic.phpt] PASS Test Imagick, shaveImage [tests/138_Imagick_shaveImage_basic.phpt] TEST 136/268 [tests/139_Imagick_sigmoidalContrastImage_basic.phpt] PASS Test Imagick, sigmoidalContrastImage [tests/139_Imagick_sigmoidalContrastImage_basic.phpt] TEST 137/268 [tests/141_Imagick_sketchImage_basic.phpt] PASS Test Imagick, sketchImage [tests/141_Imagick_sketchImage_basic.phpt] TEST 138/268 [tests/142_Imagick_solarizeImage_basic.phpt] PASS Test Imagick, solarizeImage [tests/142_Imagick_solarizeImage_basic.phpt] TEST 139/268 [tests/143_Imagick_spreadImage_basic.phpt] PASS Test Imagick, spreadImage [tests/143_Imagick_spreadImage_basic.phpt] TEST 140/268 [tests/144_Imagick_spliceImage_basic.phpt] PASS Test Imagick, spliceImage [tests/144_Imagick_spliceImage_basic.phpt] TEST 141/268 [tests/145_imagickkernel_coverage.phpt] PASS ImagickKernel::fromMatrix test [tests/145_imagickkernel_coverage.phpt] TEST 142/268 [tests/149_Imagick_sparseColorImage.phpt] PASS Test Imagick, sparseColorImage [tests/149_Imagick_sparseColorImage.phpt] TEST 143/268 [tests/150_Imagick_setregistry.phpt] FAIL Test Imagick, setRegistry and getRegistry [tests/150_Imagick_setregistry.phpt] TEST 144/268 [tests/151_Imagick_subImageMatch_basic.phpt] PASS Test Imagick, subImageMatch [tests/151_Imagick_subImageMatch_basic.phpt] TEST 145/268 [tests/152_Imagick_swirlImage_basic.phpt] PASS Test Imagick, swirlImage [tests/152_Imagick_swirlImage_basic.phpt] TEST 146/268 [tests/153_Imagick_statisticImage_basic.phpt] PASS Test Imagick, statisticImage [tests/153_Imagick_statisticImage_basic.phpt] TEST 147/268 [tests/154_Imagick_textureImage_basic.phpt] PASS Test Imagick, textureImage [tests/154_Imagick_textureImage_basic.phpt] TEST 148/268 [tests/155_Imagick_thresholdImage_basic.phpt] PASS Test Imagick, thresholdImage [tests/155_Imagick_thresholdImage_basic.phpt] TEST 149/268 [tests/156_Imagick_tintImage_basic.phpt] PASS Test Imagick, tintImage [tests/156_Imagick_tintImage_basic.phpt] TEST 150/268 [tests/157_Imagick_thumbnailImage_basic.phpt] PASS Test Imagick, thumbnailImage [tests/157_Imagick_thumbnailImage_basic.phpt] TEST 151/268 [tests/158_Imagick_transposeImage_basic.phpt] PASS Test Imagick, transposeImage [tests/158_Imagick_transposeImage_basic.phpt] TEST 152/268 [tests/159_Imagick_transformImage_basic.phpt] SKIP Test Imagick, transformImage [tests/159_Imagick_transformImage_basic.phpt] reason: Class method Imagick::transformimage not present TEST 153/268 [tests/160_Imagick_transparentPaintImage_basic.phpt] PASS Test Imagick, transparentPaintImage [tests/160_Imagick_transparentPaintImage_basic.phpt] TEST 154/268 [tests/161_Imagick_transformImageColorspace_basic.phpt] PASS Test Imagick, transformImageColorspace [tests/161_Imagick_transformImageColorspace_basic.phpt] TEST 155/268 [tests/162_Imagick_transverseImage_basic.phpt] PASS Test Imagick, transverseImage [tests/162_Imagick_transverseImage_basic.phpt] TEST 156/268 [tests/163_Imagick_uniqueImageColors_basic.phpt] PASS Test Imagick, uniqueImageColors [tests/163_Imagick_uniqueImageColors_basic.phpt] TEST 157/268 [tests/164_Imagick_trimImage_basic.phpt] PASS Test Imagick, trimImage [tests/164_Imagick_trimImage_basic.phpt] TEST 158/268 [tests/165_Imagick_unsharpMaskImage_basic.phpt] PASS Test Imagick, unsharpMaskImage [tests/165_Imagick_unsharpMaskImage_basic.phpt] TEST 159/268 [tests/166_Imagick_waveImage_basic.phpt] PASS Test Imagick, waveImage [tests/166_Imagick_waveImage_basic.phpt] TEST 160/268 [tests/167_Imagick_vignetteImage_basic.phpt] PASS Test Imagick, vignetteImage [tests/167_Imagick_vignetteImage_basic.phpt] TEST 161/268 [tests/168_Imagick_whiteThresholdImage_basic.phpt] PASS Test Imagick, whiteThresholdImage [tests/168_Imagick_whiteThresholdImage_basic.phpt] TEST 162/268 [tests/169_ImagickPixel_construct_basic.phpt] PASS Test ImagickPixel, construct [tests/169_ImagickPixel_construct_basic.phpt] TEST 163/268 [tests/170_ImagickPixel_setColor_basic.phpt] PASS Test ImagickPixel, setColor [tests/170_ImagickPixel_setColor_basic.phpt] TEST 164/268 [tests/171_ImagickPixel_setColorValue_basic.phpt] PASS Test ImagickPixel, setColorValue [tests/171_ImagickPixel_setColorValue_basic.phpt] TEST 165/268 [tests/172_ImagickPixel_setColorValueQuantum_basic.phpt] PASS Test ImagickPixel, setColorValueQuantum [tests/172_ImagickPixel_setColorValueQuantum_basic.phpt] TEST 166/268 [tests/173_ImagickDraw_bezier_basic.phpt] PASS Test ImagickDraw, bezier [tests/173_ImagickDraw_bezier_basic.phpt] TEST 167/268 [tests/174_ImagickDraw_affine_basic.phpt] PASS Test ImagickDraw, affine [tests/174_ImagickDraw_affine_basic.phpt] TEST 168/268 [tests/175_ImagickDraw_arc_basic.phpt] PASS Test ImagickDraw, arc [tests/175_ImagickDraw_arc_basic.phpt] TEST 169/268 [tests/176_ImagickDraw_ellipse_basic.phpt] PASS Test ImagickDraw, ellipse [tests/176_ImagickDraw_ellipse_basic.phpt] TEST 170/268 [tests/177_ImagickDraw_composite_basic.phpt] XFAIL Test ImagickDraw, composite [tests/177_ImagickDraw_composite_basic.phpt] XFAIL REASON: Skip TEST 171/268 [tests/178_ImagickDraw_circle_basic.phpt] PASS Test ImagickDraw, circle [tests/178_ImagickDraw_circle_basic.phpt] TEST 172/268 [tests/179_ImagickDraw_line_basic.phpt] PASS Test ImagickDraw, line [tests/179_ImagickDraw_line_basic.phpt] TEST 173/268 [tests/180_ImagickDraw_matte_basic.phpt] SKIP Test ImagickDraw, matte [tests/180_ImagickDraw_matte_basic.phpt] reason: Class method ImagickDraw::matte not present TEST 174/268 [tests/181_ImagickDraw_pathStart_basic.phpt] PASS Test ImagickDraw, pathStart [tests/181_ImagickDraw_pathStart_basic.phpt] TEST 175/268 [tests/182_ImagickDraw_pathCurveToQuadraticBezierAbsolute_basic.phpt] PASS Test ImagickDraw, pathCurveToQuadraticBezierAbsolute [tests/182_ImagickDraw_pathCurveToQuadraticBezierAbsolute_basic.phpt] TEST 176/268 [tests/183_ImagickDraw_pathCurveToQuadraticBezierAbsolute_basic.phpt] PASS Test ImagickDraw, pathCurveToQuadraticBezierAbsolute [tests/183_ImagickDraw_pathCurveToQuadraticBezierAbsolute_basic.phpt] TEST 177/268 [tests/184_ImagickDraw_polyline_basic.phpt] PASS Test ImagickDraw, polyline [tests/184_ImagickDraw_polyline_basic.phpt] TEST 178/268 [tests/185_ImagickDraw_point_basic.phpt] PASS Test ImagickDraw, point [tests/185_ImagickDraw_point_basic.phpt] TEST 179/268 [tests/186_ImagickDraw_polygon_basic.phpt] PASS Test ImagickDraw, polygon [tests/186_ImagickDraw_polygon_basic.phpt] TEST 180/268 [tests/187_ImagickDraw_push_basic.phpt] PASS Test ImagickDraw, push [tests/187_ImagickDraw_push_basic.phpt] TEST 181/268 [tests/188_ImagickDraw_pushPattern_basic.phpt] PASS Test ImagickDraw, pushPattern [tests/188_ImagickDraw_pushPattern_basic.phpt] TEST 182/268 [tests/189_ImagickDraw_setClipPath_basic.phpt] PASS Test ImagickDraw, setClipPath [tests/189_ImagickDraw_setClipPath_basic.phpt] TEST 183/268 [tests/190_ImagickDraw_popDefs_basic.phpt] PASS Test ImagickDraw, popDefs [tests/190_ImagickDraw_popDefs_basic.phpt] TEST 184/268 [tests/191_ImagickDraw_push_basic.phpt] PASS Test ImagickDraw, push [tests/191_ImagickDraw_push_basic.phpt] TEST 185/268 [tests/192_ImagickDraw_setClipPath_basic.phpt] PASS Test ImagickDraw, setClipPath [tests/192_ImagickDraw_setClipPath_basic.phpt] TEST 186/268 [tests/193_ImagickDraw_pushPattern_basic.phpt] PASS Test ImagickDraw, pushPattern [tests/193_ImagickDraw_pushPattern_basic.phpt] TEST 187/268 [tests/194_ImagickDraw_rectangle_basic.phpt] PASS Test ImagickDraw, rectangle [tests/194_ImagickDraw_rectangle_basic.phpt] TEST 188/268 [tests/195_ImagickDraw_rotate_basic.phpt] PASS Test ImagickDraw, rotate [tests/195_ImagickDraw_rotate_basic.phpt] TEST 189/268 [tests/196_ImagickDraw_scale_basic.phpt] PASS Test ImagickDraw, scale [tests/196_ImagickDraw_scale_basic.phpt] TEST 190/268 [tests/197_ImagickDraw_roundRectangle_basic.phpt] PASS Test ImagickDraw, roundRectangle [tests/197_ImagickDraw_roundRectangle_basic.phpt] TEST 191/268 [tests/198_ImagickDraw_setClipPath_basic.phpt] PASS Test ImagickDraw, setClipPath [tests/198_ImagickDraw_setClipPath_basic.phpt] TEST 192/268 [tests/199_ImagickDraw_setClipRule_basic.phpt] PASS Test ImagickDraw, setClipRule [tests/199_ImagickDraw_setClipRule_basic.phpt] TEST 193/268 [tests/200_ImagickDraw_setClipUnits_basic.phpt] PASS Test ImagickDraw, setClipUnits [tests/200_ImagickDraw_setClipUnits_basic.phpt] TEST 194/268 [tests/201_ImagickDraw_setFillAlpha_basic.phpt] PASS Test ImagickDraw, setFillAlpha [tests/201_ImagickDraw_setFillAlpha_basic.phpt] TEST 195/268 [tests/202_ImagickDraw_setFillColor_basic.phpt] PASS Test ImagickDraw, setFillColor [tests/202_ImagickDraw_setFillColor_basic.phpt] TEST 196/268 [tests/203_ImagickDraw_setFillRule_basic.phpt] PASS Test ImagickDraw, setFillRule [tests/203_ImagickDraw_setFillRule_basic.phpt] TEST 197/268 [tests/204_ImagickDraw_setFillOpacity_basic.phpt] PASS Test ImagickDraw, setFillOpacity [tests/204_ImagickDraw_setFillOpacity_basic.phpt] TEST 198/268 [tests/206_ImagickDraw_setFontSize_basic.phpt] XFAIL Test ImagickDraw, setFontSize [tests/206_ImagickDraw_setFontSize_basic.phpt] XFAIL REASON: Skip TEST 199/268 [tests/207_ImagickDraw_setFontFamily_basic.phpt] XFAIL Test ImagickDraw, setFontFamily [tests/207_ImagickDraw_setFontFamily_basic.phpt] XFAIL REASON: Skip TEST 200/268 [tests/208_ImagickDraw_setFontStretch_basic.phpt] XFAIL Test ImagickDraw, setFontStretch [tests/208_ImagickDraw_setFontStretch_basic.phpt] XFAIL REASON: Skip TEST 201/268 [tests/209_ImagickDraw_setFontWeight_basic.phpt] XFAIL Test ImagickDraw, setFontWeight [tests/209_ImagickDraw_setFontWeight_basic.phpt] XFAIL REASON: Skip TEST 202/268 [tests/210_ImagickDraw_setFontStyle_basic.phpt] XFAIL Test ImagickDraw, setFontStyle [tests/210_ImagickDraw_setFontStyle_basic.phpt] XFAIL REASON: Skip TEST 203/268 [tests/211_ImagickDraw_setStrokeAntialias_basic.phpt] PASS Test ImagickDraw, setStrokeAntialias [tests/211_ImagickDraw_setStrokeAntialias_basic.phpt] TEST 204/268 [tests/212_ImagickDraw_setGravity_basic.phpt] XFAIL Test ImagickDraw, setGravity [tests/212_ImagickDraw_setGravity_basic.phpt] XFAIL REASON: Skip TEST 205/268 [tests/213_ImagickDraw_setStrokeAlpha_basic.phpt] PASS Test ImagickDraw, setStrokeAlpha [tests/213_ImagickDraw_setStrokeAlpha_basic.phpt] TEST 206/268 [tests/214_ImagickDraw_setStrokeDashOffset_basic.phpt] PASS Test ImagickDraw, setStrokeDashOffset [tests/214_ImagickDraw_setStrokeDashOffset_basic.phpt] TEST 207/268 [tests/215_ImagickDraw_setStrokeColor_basic.phpt] PASS Test ImagickDraw, setStrokeColor [tests/215_ImagickDraw_setStrokeColor_basic.phpt] TEST 208/268 [tests/216_ImagickDraw_setStrokeDashArray_basic.phpt] PASS Test ImagickDraw, setStrokeDashArray [tests/216_ImagickDraw_setStrokeDashArray_basic.phpt] TEST 209/268 [tests/217_ImagickDraw_setStrokeMiterLimit_basic.phpt] PASS Test ImagickDraw, setStrokeMiterLimit [tests/217_ImagickDraw_setStrokeMiterLimit_basic.phpt] TEST 210/268 [tests/218_ImagickDraw_setStrokeLineCap_basic.phpt] PASS Test ImagickDraw, setStrokeLineCap [tests/218_ImagickDraw_setStrokeLineCap_basic.phpt] TEST 211/268 [tests/219_ImagickDraw_setStrokeLineJoin_basic.phpt] PASS Test ImagickDraw, setStrokeLineJoin [tests/219_ImagickDraw_setStrokeLineJoin_basic.phpt] TEST 212/268 [tests/220_ImagickDraw_setStrokeOpacity_basic.phpt] PASS Test ImagickDraw, setStrokeOpacity [tests/220_ImagickDraw_setStrokeOpacity_basic.phpt] TEST 213/268 [tests/221_ImagickDraw_setStrokeWidth_basic.phpt] PASS Test ImagickDraw, setStrokeWidth [tests/221_ImagickDraw_setStrokeWidth_basic.phpt] TEST 214/268 [tests/222_ImagickDraw_setTextAlignment_basic.phpt] XFAIL Test ImagickDraw, setTextAlignment [tests/222_ImagickDraw_setTextAlignment_basic.phpt] XFAIL REASON: Skip TEST 215/268 [tests/223_ImagickDraw_setTextAntialias_basic.phpt] XFAIL Test ImagickDraw, setTextAntialias [tests/223_ImagickDraw_setTextAntialias_basic.phpt] XFAIL REASON: Skip TEST 216/268 [tests/224_ImagickDraw_setTextUnderColor_basic.phpt] XFAIL Test ImagickDraw, setTextUnderColor [tests/224_ImagickDraw_setTextUnderColor_basic.phpt] XFAIL REASON: Skip TEST 217/268 [tests/225_ImagickDraw_setTextDecoration_basic.phpt] XFAIL Test ImagickDraw, setTextDecoration [tests/225_ImagickDraw_setTextDecoration_basic.phpt] XFAIL REASON: Skip TEST 218/268 [tests/226_ImagickDraw_setViewBox_basic.phpt] PASS Test ImagickDraw, setViewBox [tests/226_ImagickDraw_setViewBox_basic.phpt] TEST 219/268 [tests/227_ImagickDraw_skewY_basic.phpt] PASS Test ImagickDraw, skewY [tests/227_ImagickDraw_skewY_basic.phpt] TEST 220/268 [tests/228_ImagickDraw_skewX_basic.phpt] PASS Test ImagickDraw, skewX [tests/228_ImagickDraw_skewX_basic.phpt] TEST 221/268 [tests/229_Tutorial_fxAnalyzeImage_case1.phpt] PASS Test Tutorial, fxAnalyzeImage [tests/229_Tutorial_fxAnalyzeImage_case1.phpt] TEST 222/268 [tests/234_Tutorial_edgeExtend_basic.phpt] PASS Test Tutorial, edgeExtend [tests/234_Tutorial_edgeExtend_basic.phpt] TEST 223/268 [tests/235_ImagickDraw_translate_basic.phpt] PASS Test ImagickDraw, translate [tests/235_ImagickDraw_translate_basic.phpt] TEST 224/268 [tests/236_Imagick_identify_basic.phpt] PASS Test Imagick, identifyImage [tests/236_Imagick_identify_basic.phpt] TEST 225/268 [tests/237_Tutorial_deconstructGif_basic.phpt] PASS Test Tutorial, deconstructGif [tests/237_Tutorial_deconstructGif_basic.phpt] TEST 226/268 [tests/239_Tutorial_gradientReflection_basic.phpt] PASS Test Tutorial, gradientReflection [tests/239_Tutorial_gradientReflection_basic.phpt] TEST 227/268 [tests/240_Tutorial_imagickCompositeGen_basic.phpt] PASS Test Tutorial, imagickCompositeGen [tests/240_Tutorial_imagickCompositeGen_basic.phpt] TEST 228/268 [tests/241_Tutorial_psychedelicFont_basic.phpt] XFAIL Test Tutorial, psychedelicFont [tests/241_Tutorial_psychedelicFont_basic.phpt] XFAIL REASON: Skip TEST 229/268 [tests/242_Tutorial_levelizeImage_basic.phpt] PASS Test Tutorial, levelizeImage [tests/242_Tutorial_levelizeImage_basic.phpt] TEST 230/268 [tests/243_Tutorial_svgExample_basic.phpt] WARN Test Tutorial, svgExample [tests/243_Tutorial_svgExample_basic.phpt] (warn: XFAIL section but test passes) TEST 231/268 [tests/244_Tutorial_psychedelicFontGif_basic.phpt] XFAIL Test Tutorial, psychedelicFontGif [tests/244_Tutorial_psychedelicFontGif_basic.phpt] XFAIL REASON: Skip TEST 232/268 [tests/245_Tutorial_screenEmbed_basic.phpt] PASS Test Tutorial, screenEmbed [tests/245_Tutorial_screenEmbed_basic.phpt] TEST 233/268 [tests/246_antialias_image.phpt] PASS Test pseudo formats [tests/246_antialias_image.phpt] TEST 234/268 [tests/247_ImagickPixelIterator_construct_basic.phpt] PASS Test ImagickPixelIterator, construct [tests/247_ImagickPixelIterator_construct_basic.phpt] TEST 235/268 [tests/248_ImagickPixelIterator_clear_basic.phpt] PASS Test ImagickPixelIterator, clear [tests/248_ImagickPixelIterator_clear_basic.phpt] TEST 236/268 [tests/249_ImagickPixelIterator_getNextIteratorRow_basic.phpt] PASS Test ImagickPixelIterator, getNextIteratorRow [tests/249_ImagickPixelIterator_getNextIteratorRow_basic.phpt] TEST 237/268 [tests/250_ImagickPixelIterator_resetIterator_basic.phpt] PASS Test ImagickPixelIterator, resetIterator [tests/250_ImagickPixelIterator_resetIterator_basic.phpt] TEST 238/268 [tests/251_ImagickPixelIterator_setIteratorRow_basic.phpt] PASS Test ImagickPixelIterator, setIteratorRow [tests/251_ImagickPixelIterator_setIteratorRow_basic.phpt] TEST 239/268 [tests/252_ImagickPixelIterator_construct_basic.phpt] PASS Test ImagickPixelIterator, construct [tests/252_ImagickPixelIterator_construct_basic.phpt] TEST 240/268 [tests/253_getHdri.phpt] PASS Test ImagickPixelIterator, construct [tests/253_getHdri.phpt] TEST 241/268 [tests/254_getConfigureOptions.phpt] PASS Test Imagick::getConfigureOptions [tests/254_getConfigureOptions.phpt] TEST 242/268 [tests/255_getFeatures.phpt] PASS Test Imagick::getfeatures [tests/255_getFeatures.phpt] TEST 243/268 [tests/256_Imagick_exportImagePixels_basic.phpt] WARN Test Imagick, Imagick::exportImagePixels [tests/256_Imagick_exportImagePixels_basic.phpt] (warn: XFAIL section but test passes) TEST 244/268 [tests/257_Imagick_setImageChannelMask_basic.phpt] PASS Test Imagick, Imagick::exportImagePixels [tests/257_Imagick_setImageChannelMask_basic.phpt] TEST 245/268 [tests/258_Imagick_evaluateImages_basic.phpt] PASS Test Imagick, Imagick::evaluateImages [tests/258_Imagick_evaluateImages_basic.phpt] TEST 246/268 [tests/259_Imagick_colorPoints_basic.phpt] PASS Test Imagick, Imagick::evaluateImages [tests/259_Imagick_colorPoints_basic.phpt] TEST 247/268 [tests/260_localContrastImage.phpt] PASS Test localContrastImage [tests/260_localContrastImage.phpt] TEST 248/268 [tests/261_compositeImageGravity.phpt] PASS Test compositeImageGravity [tests/261_compositeImageGravity.phpt] TEST 249/268 [tests/262_autoOrient.phpt] PASS Test autoOrient [tests/262_autoOrient.phpt] TEST 250/268 [tests/263_autoGammaImage.phpt] PASS Test autoGammaImage [tests/263_autoGammaImage.phpt] TEST 251/268 [tests/264_ImagickDraw_getTextDirection_basic.phpt] XFAIL Test ImagickDraw, getTextDirection [tests/264_ImagickDraw_getTextDirection_basic.phpt] XFAIL REASON: Skip TEST 252/268 [tests/265_ImagickDraw_getOpacity_basic.phpt] PASS Test ImagickDraw, getOpacity [tests/265_ImagickDraw_getOpacity_basic.phpt] TEST 253/268 [tests/266_ImagickDraw_getFontResolution_basic.phpt] XFAIL Test ImagickDraw, getFontResolution [tests/266_ImagickDraw_getFontResolution_basic.phpt] XFAIL REASON: Skip TEST 254/268 [tests/267_ImagickDraw_getBorderColor_basic.phpt] PASS Test ImagickDraw, getBorderColor [tests/267_ImagickDraw_getBorderColor_basic.phpt] TEST 255/268 [tests/268_ImagickDraw_getDensity_basic.phpt] WARN Test ImagickDraw, getDensity [tests/268_ImagickDraw_getDensity_basic.phpt] (warn: XFAIL section but test passes) TEST 256/268 [tests/269_ImagickPixel_setColorFromPixel_basic.phpt] SKIP Test ImagickPixel, setColor [tests/269_ImagickPixel_setColorFromPixel_basic.phpt] reason: Class method Imagick::setColorFromPixel not present TEST 257/268 [tests/270_imagick_restoreErrorHandler.phpt] PASS Imagick don't borg the error handler [tests/270_imagick_restoreErrorHandler.phpt] TEST 258/268 [tests/271_imagick_constants.phpt] PASS Imagick::readImage test [tests/271_imagick_constants.phpt] TEST 259/268 [tests/272_imagick_identifyimagetype.phpt] PASS Test identifyImageType [tests/272_imagick_identifyimagetype.phpt] TEST 260/268 [tests/273_imagick_falsyimage.phpt] PASS Imagick::__construct false [tests/273_imagick_falsyimage.phpt] TEST 261/268 [tests/bug20636.phpt] SKIP Test PECL bug #20636 [tests/bug20636.phpt] reason: Class method Imagick::roundCorners not present TEST 262/268 [tests/bug21229.phpt] PASS Test PECL bug #21229 [tests/bug21229.phpt] TEST 263/268 [tests/bug59378.phpt] PASS Test PHP bug #59378 writing to php://memory is incomplete [tests/bug59378.phpt] TEST 264/268 [tests/bug64015.phpt] PASS Test PHP bug #64015 [tests/bug64015.phpt] TEST 265/268 [tests/bug_66098.phpt] PASS Bug #66098 Check that there is no segfault from zval_addref_p [tests/bug_66098.phpt] TEST 266/268 [tests/bug_71742.phpt] PASS Bug #71742 polyline touched by array_walk [tests/bug_71742.phpt] TEST 267/268 [tests/bug_72226.phpt] PASS Allow Imagick exceptions to be extended. [tests/bug_72226.phpt] TEST 268/268 [tests/github_174.phpt] PASS Imagick::resizeImage prevent 0 width/height images [tests/github_174.phpt] ===================================================================== TIME END 2017-12-26 13:20:21 ===================================================================== TEST RESULT SUMMARY --------------------------------------------------------------------- Exts skipped : 0 Exts tested : 8 --------------------------------------------------------------------- Number of tests : 268 254 Tests skipped : 14 ( 5.2%) -------- Tests warned : 3 ( 1.1%) ( 1.2%) Tests failed : 1 ( 0.4%) ( 0.4%) Expected fail : 16 ( 6.0%) ( 6.3%) Tests passed : 234 ( 87.3%) ( 92.1%) --------------------------------------------------------------------- Time taken : 88 seconds ===================================================================== ===================================================================== EXPECTED FAILED TEST SUMMARY --------------------------------------------------------------------- Test Imagick, annotateImage [tests/034_Imagick_annotateImage_basic.phpt] XFAIL REASON: Skip Test ImagickDraw, composite [tests/177_ImagickDraw_composite_basic.phpt] XFAIL REASON: Skip Test ImagickDraw, setFontSize [tests/206_ImagickDraw_setFontSize_basic.phpt] XFAIL REASON: Skip Test ImagickDraw, setFontFamily [tests/207_ImagickDraw_setFontFamily_basic.phpt] XFAIL REASON: Skip Test ImagickDraw, setFontStretch [tests/208_ImagickDraw_setFontStretch_basic.phpt] XFAIL REASON: Skip Test ImagickDraw, setFontWeight [tests/209_ImagickDraw_setFontWeight_basic.phpt] XFAIL REASON: Skip Test ImagickDraw, setFontStyle [tests/210_ImagickDraw_setFontStyle_basic.phpt] XFAIL REASON: Skip Test ImagickDraw, setGravity [tests/212_ImagickDraw_setGravity_basic.phpt] XFAIL REASON: Skip Test ImagickDraw, setTextAlignment [tests/222_ImagickDraw_setTextAlignment_basic.phpt] XFAIL REASON: Skip Test ImagickDraw, setTextAntialias [tests/223_ImagickDraw_setTextAntialias_basic.phpt] XFAIL REASON: Skip Test ImagickDraw, setTextUnderColor [tests/224_ImagickDraw_setTextUnderColor_basic.phpt] XFAIL REASON: Skip Test ImagickDraw, setTextDecoration [tests/225_ImagickDraw_setTextDecoration_basic.phpt] XFAIL REASON: Skip Test Tutorial, psychedelicFont [tests/241_Tutorial_psychedelicFont_basic.phpt] XFAIL REASON: Skip Test Tutorial, psychedelicFontGif [tests/244_Tutorial_psychedelicFontGif_basic.phpt] XFAIL REASON: Skip Test ImagickDraw, getTextDirection [tests/264_ImagickDraw_getTextDirection_basic.phpt] XFAIL REASON: Skip Test ImagickDraw, getFontResolution [tests/266_ImagickDraw_getFontResolution_basic.phpt] XFAIL REASON: Skip ===================================================================== ===================================================================== FAILED TEST SUMMARY --------------------------------------------------------------------- Test Imagick, setRegistry and getRegistry [tests/150_Imagick_setregistry.phpt] ===================================================================== ===================================================================== WARNED TEST SUMMARY --------------------------------------------------------------------- Test Tutorial, svgExample [tests/243_Tutorial_svgExample_basic.phpt] (warn: XFAIL section but test passes) Test Imagick, Imagick::exportImagePixels [tests/256_Imagick_exportImagePixels_basic.phpt] (warn: XFAIL section but test passes) Test ImagickDraw, getDensity [tests/268_ImagickDraw_getDensity_basic.phpt] (warn: XFAIL section but test passes) ===================================================================== make: *** [Makefile:151: test] Error 1 error: Bad exit status from /tmp/B.k9VpwB/BUILD/tmp/rpm-tmp.77708 (%build) RPM build errors: Bad exit status from /tmp/B.k9VpwB/BUILD/tmp/rpm-tmp.77708 (%build) ended at: Tue Dec 26 13:20:21 2017, done in 0:01:37.633052 error: No files produced. mesg: ttyname failed: Inappropriate ioctl for device + chmod -R u+rwX /tmp/B.k9VpwB/BUILD + rm -rf /tmp/B.k9VpwB/tmp /tmp/B.k9VpwB/BUILD mesg: ttyname failed: Inappropriate ioctl for device + rm -rf /tmp/B.k9VpwB Begin-PLD-Builder-Info Build-Time: user:125.89s sys:13.04s real:119.08s (faults io:0 non-io:2442455) End-PLD-Builder-Info
[Back to list of logs] [View rpm -qa of builder]