FailedOk

th/SRPMS[OK]
th/x32[OK]
th/i686[OK]
th/x86_64[OK]

ac/SRPMS[OK]
ac/i386[OK]
ac/i586[OK]
ac/i686[OK]
ac/alpha[OK]
ac/amd64[OK]
ac/athlon[OK]
ac/ppc[OK]
ac/sparc[OK]
ac/sparc64[OK]

Advanced Search
main()
Powered by PLD Linux
(c) 2002-2019 PLD Team
$Revision: 1.37 $
Powered by achelon.
Your IP: 100.26.182.28

php-pecl-memcache 0cd2bf67-2e6e-45ab-9595-86aabb4ba4ee

Status:Failed
Source URL:ftp://buildlogs.pld-linux.org/th/x86_64/FAIL/php-pecl-memcache,0cd2bf67-2e6e-45ab-9595-86aabb4ba4ee.bz2
text/plain URL:View!
full text:View!
rpm -qa of builder:View!
Date:2019/08/16 17:12:09
Runtime:0:00:02.352749

Toc:

  • error 1
  • rpm: error: Failed build dependencies:
  • error 2
  • error: vfff: Connection timed out
  • error 3
  • rpm: error: Failed build dependencies:
  • prep
  • Executing(%prep): /bin/sh -e /tmp/B.Q8flKZ/BUILD/tmp/rpm-tmp.59047
  • error 4
  • XFAIL: memcache->addServer() [tests/019.phpt]
  • error 5
  • XFAIL: memcache->set()/memcache->get() with multiple keys and load balancing [tests/020.phpt]
  • error 6
  • XFAIL: memcache->getExtendedStats() [tests/022.phpt]
  • error 7
  • XFAIL: memcache_get_extended_stats() [tests/022a.phpt]
  • error 8
  • XFAIL: memcache->delete() with load balancing [tests/023.phpt]
  • error 9
  • XFAIL: memcache->increment() with load balancing [tests/025.phpt]
  • error 10
  • XFAIL: memcache->delete() with load balancing [tests/026.phpt]
  • error 11
  • XFAIL: memcache->addServer() adding server in failed mode [tests/031.phpt]
  • error 12
  • XFAIL: memcache->getServerStatus(), memcache->setServerParams() [tests/032.phpt]
  • error 13
  • XFAIL: memcache::connect() with unix domain socket [tests/035.phpt]
  • error 14
  • XFAIL: ini_set('session.save_handler') [tests/036.phpt]
  • error 15
  • XFAIL: ini_set('session.save_path') [tests/036b.phpt]
  • error 16
  • XFAIL: memcache->increment()/decrement() with multiple keys [tests/040.phpt]
  • error 17
  • XFAIL: memcache->delete() with multiple keys [tests/041.phpt]
  • error 18
  • XFAIL: memcache->set() with multiple values [tests/042.phpt]
  • error 19
  • XFAIL: ini_set('memcache.redundancy') [tests/043.phpt]
  • error 20
  • XFAIL: ini_set('memcache.session_redundancy') [tests/044.phpt]
  • error 21
  • XFAIL: ini_set('memcache.session_redundancy') [tests/044b.phpt]
  • error 22
  • XFAIL: hash strategies and functions [tests/046.phpt]
  • error 23
  • XFAIL: ini_set('session.save_handler') with unix domain socket [tests/053.phpt]
  • error 24
  • XFAIL: memcache multi host save path function [tests/bug73539.phpt]
  • error 25
  • XFAIL: session_regenerate_id() should not cause fatal error [tests/githubbug13.phpt]
  • build
  • Executing(%build): /bin/sh -e /tmp/B.Q8flKZ/BUILD/tmp/rpm-tmp.59047
  • error 26
  • checking PHP version... configure: error: PHP 7.x required for pecl-php-memcache ver 4+. Use pecl-php-memcache ver 3.x for PHP 5.x.
  • error 27
  • error: Bad exit status from /tmp/B.Q8flKZ/BUILD/tmp/rpm-tmp.59047 (%build)
  • error 28
  • RPM build errors:
  • error 29
  • error: No files produced.

Content:

checking if we should skip the build
started at: Fri Aug 16 17:11:07 2019
killing old processes on a builder
sending signal 9 to pid -1
Killed
cleaning up /tmp
fetching https://srcbuilder.pld-linux.org/th//srpms/0cd2bf67-2e6e-45ab-9595-86aabb4ba4ee/php52-pecl-memcache-4.0.4-1.src.rpm
fetched 94691 bytes, 254.9 K/s
installing srpm: php52-pecl-memcache-4.0.4-1.src.rpm
+ install -d /tmp/B.Q8flKZ/BUILD /tmp/B.Q8flKZ/RPMS
+ LC_ALL=en_US.UTF-8
+ rpm -qp --changelog php52-pecl-memcache-4.0.4-1.src.rpm
* Fri Aug 16 2019 PLD Linux Team <feedback@pld-linux.org>
- For complete changelog see: http://git.pld-linux.org/?p=packages/php-pecl-memcache.git;a=log;h=dev-4.0.3
* Fri Aug 16 2019 Elan Ruusamäe <glen@pld-linux.org> f00d600
- up to 4.0.4 * Sat May 11 2019 Elan Ruusamäe <glen@pld-linux.org> 31f4af4
- update failed tests * Sat May 11 2019 Elan Ruusamäe <glen@pld-linux.org> 9600d33
- php 5.2 deps * Sat May 11 2019 Elan Ruusamäe <glen@pld-linux.org> 2847bd4
- reset failed tests * Fri May 10 2019 Elan Ruusamäe <glen@pld-linux.org> f148f58
- up to 4.0.3 * Tue Nov 13 2018 Elan Ruusamäe <glen@pld-linux.org> 2b5f773
- rel 3; php 7.3 support * Tue Nov 13 2018 Elan Ruusamäe <glen@pld-linux.org> 7b17d00
- [PATCH] fix for PHP 7.3 + fix build warnings * Tue Nov 13 2018 Elan Ruusamäe <glen@pld-linux.org> 4b53237
- [PATCH] Fix #23 Failed to read session data with 7.1/7.2 + rpm -Uhv --nodeps --define '_topdir /tmp/B.Q8flKZ' --define '_specdir %{_topdir}' --define '_sourcedir %{_specdir}' --define '_rpmdir %{_topdir}/RPMS' --define '_builddir %{_topdir}/BUILD' --without tests --define 'php_suffix 52' php52-pecl-memcache-4.0.4-1.src.rpm Preparing... ################################################## php52-pecl-memcache ################################################## + rm -f php52-pecl-memcache-4.0.4-1.src.rpm + install -m 700 -d /tmp/B.Q8flKZ/BUILD/tmp + TMPDIR=/tmp/B.Q8flKZ/BUILD/tmp + exec nice -n 0 rpmbuild -bp --short-circuit --nodeps --define '_topdir /tmp/B.Q8flKZ' --define '_specdir %{_topdir}' --define '_sourcedir %{_specdir}' --define '_rpmdir %{_topdir}/RPMS' --define '_builddir %{_topdir}/BUILD' --without tests --target x86_64-pld-linux --define 'php_suffix 52' --define 'prep exit 0' /tmp/B.Q8flKZ/php-pecl-memcache.spec Building target platforms: x86_64-pld-linux checking BuildConflict-ing packages no BuildConflicts found checking BR rpm: error: Failed build dependencies: rpm: php52-devel >= 3:7.0.0 is needed by php52-pecl-memcache-4.0.4-1.src rpm: php52-xml is needed by php52-pecl-memcache-4.0.4-1.src rpm: php-packagexml2cl is needed by php52-pecl-memcache-4.0.4-1.src rpm: Building target platforms: x86_64-pld-linux updating poldek cache... ready is up to date Retrieving th::packages.ndir.md... th is up to date Retrieving th::packages.ndir.md... th is up to date Retrieving th-ready::packages.ndir.md... th-ready is up to date Retrieving th-ready::packages.ndir.md... th-ready is up to date Retrieving th-test::packages.ndir.md... error: vfff: Connection timed out Retrying...(#2) th-test is up to date Retrieving th-test::packages.ndir.md... Retrieving th-test::packages.ndir.diff.toc.gz... ..............................done Retrieving diff::packages.ndir.2019.08.16-09.51.02.gz... Retrieving diff::packages.ndir.dscr.2019.08.16-09.51.02.gz... Loading [pndir]th-test... Applying packages.ndir.2019.08.16-09.51.02.gz... Writing /root/.poldek-cache/[...]/packages.ndir.gz... checking conflicting packages in BRed packages poldek: Loading [pndir]ready... poldek: Loading [pndir]th-test... poldek: Loading [pndir]th-test... poldek: Loading [pndir]th-ready... poldek: Loading [pndir]th-ready... poldek: Loading [pndir]th... poldek: Loading [pndir]th... poldek: 30255 packages read poldek: Removed 2601 duplicate packages from available set poldek: Processing dependencies... poldek: php52-xml-5.2.17-20130717.31.x86_64 marks php52-common-5.2.17-20130717.31.x86_64 (cap /etc/php52/conf.d) poldek: php-packagexml2cl-0.1-4.noarch marks php52-program-5.2.17-20130717.31.x86_64 (cap /usr/bin/php) poldek: php52-program-5.2.17-20130717.31.x86_64 marks php52-cli-5.2.17-20130717.31.x86_64 (cap php52-cli = 4:5.2.17-20130717.31) poldek: php-packagexml2cl-0.1-4.noarch marks php52-simplexml-5.2.17-20130717.31.x86_64 (cap php(simplexml)) poldek: php52-simplexml-5.2.17-20130717.31.x86_64 marks php52-spl-5.2.17-20130717.31.x86_64 (cap php52-spl = 4:5.2.17-20130717.31) poldek: php52-spl-5.2.17-20130717.31.x86_64 marks php52-pcre-5.2.17-20130717.31.x86_64 (cap php52-pcre = 4:5.2.17-20130717.31) poldek: There are 9 packages to install (6 marked by dependencies): poldek: I php-packagexml2cl-0.1-4.noarch php52-devel-5.2.17-20130717.31.x86_64 poldek: I php52-xml-5.2.17-20130717.31.x86_64 poldek: D php52-cli-5.2.17-20130717.31.x86_64 poldek: D php52-common-5.2.17-20130717.31.x86_64 poldek: D php52-pcre-5.2.17-20130717.31.x86_64 poldek: D php52-program-5.2.17-20130717.31.x86_64 poldek: D php52-simplexml-5.2.17-20130717.31.x86_64 poldek: D php52-spl-5.2.17-20130717.31.x86_64 poldek: This operation will use 5.4MB of disk space. poldek: Need to get 1.4MB of archives (1.4MB to download). poldek: poldek: Retrieving [1/9] th::php52-common-5.2.17-20130717.31.x86_64.rpm... poldek: ..............................done poldek: Retrieving [2/9] th::php52-cli-5.2.17-20130717.31.x86_64.rpm... poldek: ..............................done poldek: Retrieving [3/9] th::php52-program-5.2.17-20130717.31.x86_64.rpm... poldek: ..............................done poldek: Retrieving [4/9] th::php52-pcre-5.2.17-20130717.31.x86_64.rpm... poldek: ..............................done poldek: Retrieving [5/9] th::php52-spl-5.2.17-20130717.31.x86_64.rpm... poldek: ..............................done poldek: Retrieving [6/9] th::php52-simplexml-5.2.17-20130717.31.x86_64.rpm... poldek: ..............................done poldek: Retrieving [7/9] th::php52-devel-5.2.17-20130717.31.x86_64.rpm... poldek: ..............................done poldek: Retrieving [8/9] th::php52-xml-5.2.17-20130717.31.x86_64.rpm... poldek: ..............................done poldek: Retrieving [9/9] th::php-packagexml2cl-0.1-4.noarch.rpm... poldek: ..............................done poldek: Executing pm-command.sh --upgrade -vh --test --root / --define _check_dirname_deps 1... poldek: Preparing... ################################################## no conflicts found checking BR rpm: error: Failed build dependencies: rpm: php52-devel >= 3:7.0.0 is needed by php52-pecl-memcache-4.0.4-1.src rpm: php52-xml is needed by php52-pecl-memcache-4.0.4-1.src rpm: php-packagexml2cl is needed by php52-pecl-memcache-4.0.4-1.src rpm: Building target platforms: x86_64-pld-linux installing BR: php52\-xml php\-packagexml2cl php52\-devel + poldek --noask --caplookup -Q -v '--ignore=hhvm-*' '--ignore=php4-*' '--ignore=php53-*' '--ignore=php54-*' '--ignore=php55-*' '--ignore=php56-*' '--ignore=php70-*' '--ignore=php71-*' '--ignore=php72-*' '--ignore=php73-*' '--ignore=php74-*' --upgrade php52-xml php-packagexml2cl php52-devel Loading [pndir]ready... Loading [pndir]th-test... Loading [pndir]th-test... Loading [pndir]th-ready... Loading [pndir]th-ready... Loading [pndir]th... Loading [pndir]th... 30255 packages read Removed 2601 duplicate packages from available set Processing dependencies... php52-xml-5.2.17-20130717.31.x86_64 marks php52-common-5.2.17-20130717.31.x86_64 (cap /etc/php52/conf.d) There are 3 packages to install (1 marked by dependencies): I php52-devel-5.2.17-20130717.31.x86_64 I php52-xml-5.2.17-20130717.31.x86_64 D php52-common-5.2.17-20130717.31.x86_64 This operation will use 5.1MB of disk space. Need to get 1.2MB of archives. Executing pm-command.sh --upgrade -vh --root / --define _check_dirname_deps 1... Preparing... ################################################## php52-common ################################################## php52-devel ################################################## php52-xml ################################################## Installing set #2 Processing dependencies... php-packagexml2cl-0.1-4.noarch marks php52-program-5.2.17-20130717.31.x86_64 (cap /usr/bin/php) php52-program-5.2.17-20130717.31.x86_64 marks php52-cli-5.2.17-20130717.31.x86_64 (cap php52-cli = 4:5.2.17-20130717.31) php-packagexml2cl-0.1-4.noarch marks php52-simplexml-5.2.17-20130717.31.x86_64 (cap php(simplexml)) php52-simplexml-5.2.17-20130717.31.x86_64 marks php52-spl-5.2.17-20130717.31.x86_64 (cap php52-spl = 4:5.2.17-20130717.31) php52-spl-5.2.17-20130717.31.x86_64 marks php52-pcre-5.2.17-20130717.31.x86_64 (cap php52-pcre = 4:5.2.17-20130717.31) There are 6 packages to install (5 marked by dependencies): I php-packagexml2cl-0.1-4.noarch D php52-cli-5.2.17-20130717.31.x86_64 D php52-pcre-5.2.17-20130717.31.x86_64 D php52-program-5.2.17-20130717.31.x86_64 D php52-simplexml-5.2.17-20130717.31.x86_64 D php52-spl-5.2.17-20130717.31.x86_64 This operation will use 331.9KB of disk space. Need to get 159.6KB of archives. Executing pm-command.sh --upgrade -vh --root / --define _check_dirname_deps 1... Preparing... ################################################## php52-pcre ################################################## php52-cli ################################################## php52-spl ################################################## php52-program ################################################## php52-simplexml ################################################## php-packagexml2cl ################################################## building RPM using: set -ex; : build-id: 0cd2bf67-2e6e-45ab-9595-86aabb4ba4ee; TMPDIR=/tmp/B.Q8flKZ/BUILD/tmp exec nice -n 0 rpmbuild -bb --define '_smp_mflags -j9' --define '_make_opts -Otarget' --define '_pld_builder 1' --define '_topdir /tmp/B.Q8flKZ' --define '_specdir %{_topdir}' --define '_sourcedir %{_specdir}' --define '_rpmdir %{_topdir}/RPMS' --define '_builddir %{_topdir}/BUILD' --without tests --target x86_64-pld-linux --define 'php_suffix 52' /tmp/B.Q8flKZ/php-pecl-memcache.spec + : build-id: 0cd2bf67-2e6e-45ab-9595-86aabb4ba4ee + TMPDIR=/tmp/B.Q8flKZ/BUILD/tmp + exec nice -n 0 rpmbuild -bb --define '_smp_mflags -j9' --define '_make_opts -Otarget' --define '_pld_builder 1' --define '_topdir /tmp/B.Q8flKZ' --define '_specdir %{_topdir}' --define '_sourcedir %{_specdir}' --define '_rpmdir %{_topdir}/RPMS' --define '_builddir %{_topdir}/BUILD' --without tests --target x86_64-pld-linux --define 'php_suffix 52' /tmp/B.Q8flKZ/php-pecl-memcache.spec Building target platforms: x86_64-pld-linux Executing(%prep): /bin/sh -e /tmp/B.Q8flKZ/BUILD/tmp/rpm-tmp.59047 + umask 022 + cd /tmp/B.Q8flKZ/BUILD + cd /tmp/B.Q8flKZ/BUILD + rm -rf php52-pecl-memcache-4.0.4 + /bin/mkdir -p php52-pecl-memcache-4.0.4 + cd php52-pecl-memcache-4.0.4 + /usr/bin/gzip -dc /tmp/B.Q8flKZ/memcache-4.0.4.tar.gz + /bin/tar -xf - + STATUS=0 + '[' 0 -ne 0 ']' + /bin/id -u + '[' 1000 '=' 0 ']' + /bin/id -u + '[' 1000 '=' 0 ']' + /bin/chmod -Rf a+rX,u+w,g-w,o-w . + mv pecl-memcache-4.0.4/.gitignore pecl-memcache-4.0.4/CREDITS pecl-memcache-4.0.4/Dockerfile pecl-memcache-4.0.4/LICENSE pecl-memcache-4.0.4/README pecl-memcache-4.0.4/cloudbuild.yaml pecl-memcache-4.0.4/config.m4 pecl-memcache-4.0.4/config.w32 pecl-memcache-4.0.4/config9.m4 pecl-memcache-4.0.4/docker pecl-memcache-4.0.4/example.php pecl-memcache-4.0.4/memcache.php pecl-memcache-4.0.4/package.xml pecl-memcache-4.0.4/php7 pecl-memcache-4.0.4/profile.php pecl-memcache-4.0.4/tests . + echo 'Patch #0 (memcache-webapp.patch):' Patch #0 (memcache-webapp.patch): + '[' -f /tmp/B.Q8flKZ/memcache-webapp.patch ']' + /bin/cat /tmp/B.Q8flKZ/memcache-webapp.patch + /usr/bin/patch -s -p1 + <<"EOF" + xfail + set +x XFAIL: memcache->addServer() [tests/019.phpt] XFAIL: memcache->set()/memcache->get() with multiple keys and load balancing [tests/020.phpt] XFAIL: memcache->getExtendedStats() [tests/022.phpt] XFAIL: memcache_get_extended_stats() [tests/022a.phpt] XFAIL: memcache->delete() with load balancing [tests/023.phpt] XFAIL: memcache->increment() with load balancing [tests/025.phpt] XFAIL: memcache->delete() with load balancing [tests/026.phpt] XFAIL: memcache->addServer() adding server in failed mode [tests/031.phpt] XFAIL: memcache->getServerStatus(), memcache->setServerParams() [tests/032.phpt] XFAIL: memcache::connect() with unix domain socket [tests/035.phpt] XFAIL: ini_set('session.save_handler') [tests/036.phpt] XFAIL: ini_set('session.save_path') [tests/036b.phpt] XFAIL: memcache->increment()/decrement() with multiple keys [tests/040.phpt] XFAIL: memcache->delete() with multiple keys [tests/041.phpt] XFAIL: memcache->set() with multiple values [tests/042.phpt] XFAIL: ini_set('memcache.redundancy') [tests/043.phpt] XFAIL: ini_set('memcache.session_redundancy') [tests/044.phpt] XFAIL: ini_set('memcache.session_redundancy') [tests/044b.phpt] XFAIL: hash strategies and functions [tests/046.phpt] XFAIL: ini_set('session.save_handler') with unix domain socket [tests/053.phpt] XFAIL: memcache multi host save path function [tests/bug73539.phpt] XFAIL: session_regenerate_id() should not cause fatal error [tests/githubbug13.phpt] + exit 0 Executing(%build): /bin/sh -e /tmp/B.Q8flKZ/BUILD/tmp/rpm-tmp.59047 TMP=/home/users/builder/tmp HOME=/home/users/builder PATH=/home/users/builder/GNUstep/Tools:/usr/local/bin:/usr/bin:/bin:/home/users/builder/bin TMPDIR=/tmp/B.Q8flKZ/BUILD/tmp + umask 022 + cd /tmp/B.Q8flKZ/BUILD + cd php52-pecl-memcache-4.0.4 + >ChangeLog + packagexml2cl package.xml + phpize Configuring for: PHP Api Version: 20041225 Zend Module Api No: 20060613 Zend Extension Api No: 220060519 configure.in:3: warning: prefer named diversions configure.in:3: warning: prefer named diversions + ./configure 'LDFLAGS=-Wl,--as-needed -Wl,--no-copy-dt-needed-entries -Wl,-z,relro -Wl,-z,combreloc ' 'CFLAGS=-O2 -fwrapv -pipe -Wformat -Werror=format-security -gdwarf-4 -fno-debug-types-section -fvar-tracking-assignments -g2 -Wp,-D_FORTIFY_SOURCE=2 -fstack-protector-strong --param=ssp-buffer-size=4 -Werror=trampolines -fPIC -march=x86-64 -gdwarf-4 -fno-debug-types-section -fvar-tracking-assignments -g2 ' 'CXXFLAGS=-O2 -fwrapv -pipe -Wformat -Werror=format-security -gdwarf-4 -fno-debug-types-section -fvar-tracking-assignments -g2 -Wp,-D_FORTIFY_SOURCE=2 -fstack-protector-strong --param=ssp-buffer-size=4 -Werror=trampolines -fPIC -march=x86-64 -gdwarf-4 -fno-debug-types-section -fvar-tracking-assignments -g2 ' 'FFLAGS=-O2 -fwrapv -pipe -Wformat -Werror=format-security -gdwarf-4 -fno-debug-types-section -fvar-tracking-assignments -g2 -Wp,-D_FORTIFY_SOURCE=2 -fstack-protector-strong --param=ssp-buffer-size=4 -Werror=trampolines -fPIC -march=x86-64 -gdwarf-4 -fno-debug-types-section -fvar-tracking-assignments -g2 ' 'FCFLAGS=-O2 -fwrapv -pipe -Wformat -Werror=format-security -gdwarf-4 -fno-debug-types-section -fvar-tracking-assignments -g2 -Wp,-D_FORTIFY_SOURCE=2 -fstack-protector-strong --param=ssp-buffer-size=4 -Werror=trampolines -fPIC -march=x86-64 -gdwarf-4 -fno-debug-types-section -fvar-tracking-assignments -g2 ' 'CPPFLAGS=' 'CC=x86_64-pld-linux-gcc' 'CXX=x86_64-pld-linux-g++' '--host=x86_64-pld-linux' '--build=x86_64-pld-linux' '--prefix=/usr' '--exec-prefix=/usr' '--bindir=/usr/bin' '--sbindir=/usr/sbin' '--sysconfdir=/etc/webapps/memcache' '--datadir=/usr/share' '--includedir=/usr/include' '--libdir=/usr/lib64' '--libexecdir=/usr/libexec' '--localstatedir=/var' '--sharedstatedir=/var/lib' '--mandir=/usr/share/man' '--infodir=/usr/share/info' '--x-libraries=/usr/lib64' '--with-zlib-dir=/usr' checking for grep that handles long lines and -e... /bin/grep checking for egrep... /bin/grep -E checking for a sed that does not truncate output... /bin/sed checking for x86_64-pld-linux-cc... x86_64-pld-linux-gcc checking whether the C compiler works... yes checking for C compiler default output file name... a.out checking for suffix of executables... checking whether we are cross compiling... no checking for suffix of object files... o checking whether we are using the GNU C compiler... yes checking whether x86_64-pld-linux-gcc accepts -g... yes checking for x86_64-pld-linux-gcc option to accept ISO C89... none needed checking how to run the C preprocessor... x86_64-pld-linux-gcc -E checking for icc... no checking for suncc... no checking whether x86_64-pld-linux-gcc and cc understand -c and -o together... yes checking for system library directory... lib checking if compiler supports -R... no checking if compiler supports -Wl,-rpath,... yes checking build system type... x86_64-pld-linux-gnu checking host system type... x86_64-pld-linux-gnu checking target system type... x86_64-pld-linux-gnu checking for PHP prefix... /usr checking for PHP includes... -I/usr/include/php -I/usr/include/php/main -I/usr/include/php/TSRM -I/usr/include/php/Zend -I/usr/include/php/ext -I/usr/include/php/ext/date/lib checking for PHP extension directory... /usr/lib64/php52 checking for PHP installed headers prefix... /usr/include/php checking if debug is enabled... no checking if zts is enabled... no checking for re2c... re2c checking for re2c version... 1.2 (ok) checking for gawk... gawk checking whether to enable memcache support... yes, shared checking whether to enable memcache session handler support... yes checking for the location of ZLIB... /usr checking for the location of zlib... /usr checking PHP version... configure: error: PHP 7.x required for pecl-php-memcache ver 4+. Use pecl-php-memcache ver 3.x for PHP 5.x. error: Bad exit status from /tmp/B.Q8flKZ/BUILD/tmp/rpm-tmp.59047 (%build) RPM build errors: Bad exit status from /tmp/B.Q8flKZ/BUILD/tmp/rpm-tmp.59047 (%build) ended at: Fri Aug 16 17:12:09 2019, done in 0:00:02.352749 error: No files produced. + chmod -R u+rwX /tmp/B.Q8flKZ/BUILD + rm -rf /tmp/B.Q8flKZ/tmp /tmp/B.Q8flKZ/BUILD + rm -rf /tmp/B.Q8flKZ Begin-PLD-Builder-Info Build-Time: user:13.91s sys:2.37s real:61.56s (faults io:10 non-io:694066) End-PLD-Builder-Info
[Back to list of logs] [View rpm -qa of builder]