FailedOk

th/SRPMS[OK]
th/x32[OK]
th/i686[OK]
th/x86_64[OK]

ac/SRPMS[OK]
ac/i386[OK]
ac/i586[OK]
ac/i686[OK]
ac/alpha[OK]
ac/amd64[OK]
ac/athlon[OK]
ac/ppc[OK]
ac/sparc[OK]
ac/sparc64[OK]

Advanced Search
main()
Powered by PLD Linux
(c) 2002-2020 PLD Team
$Revision: 1.37 $
Powered by The Bad Thing.
Your IP: 34.238.248.103

php-pecl-msgpack 697290ab-d278-4766-84d8-3c569841cf0f

Status:Failed
Source URL:https://buildlogs.pld-linux.org/pld/th/x86_64/FAIL/php-pecl-msgpack,697290ab-d278-4766-84d8-3c569841cf0f.bz2
text/plain URL:View!
full text:View!
rpm -qa of builder:View!
Date:2020/07/15 18:33:40
Runtime:0:00:12.418281

Toc:

  • error 1
  • rpm: error: Failed build dependencies:
  • error 2
  • rpm: error: Failed build dependencies:
  • prep
  • Executing(%prep): /bin/sh -e /tmp/B.2Rh5Or/BUILD/tmp/rpm-tmp.45060
  • build
  • Executing(%build): /bin/sh -e /tmp/B.2Rh5Or/BUILD/tmp/rpm-tmp.45060
  • error 3
  • error: Bad exit status from /tmp/B.2Rh5Or/BUILD/tmp/rpm-tmp.45060 (%build)
  • error 4
  • RPM build errors:
  • error 5
  • error: No files produced.

Content:

checking if we should skip the build
started at: Wed Jul 15 18:33:09 2020
killing old processes on a builder
sending signal 9 to pid -1
Killed
cleaning up /tmp
fetching https://srcbuilder.pld-linux.org/th//srpms/697290ab-d278-4766-84d8-3c569841cf0f/php74-pecl-msgpack-2.1.0-1.src.rpm
fetched 73159 bytes, 111.7 K/s
installing srpm: php74-pecl-msgpack-2.1.0-1.src.rpm
+ install -d /tmp/B.2Rh5Or/BUILD /tmp/B.2Rh5Or/RPMS
+ LC_ALL=en_US.UTF-8
+ rpm -qp --changelog php74-pecl-msgpack-2.1.0-1.src.rpm
* Wed Jul 15 2020 PLD Linux Team <feedback@pld-linux.org>
- For complete changelog see: http://git.pld-linux.org/?p=packages/php-pecl-msgpack.git;a=log;h=master
* Wed Jul 15 2020 Elan Ruusamäe <glen@pld-linux.org> 4387247
- Up to 2.1.0 + rpm -Uhv --nodeps --define '_topdir /tmp/B.2Rh5Or' --define '_specdir %{_topdir}' --define '_sourcedir %{_specdir}' --define '_rpmdir %{_topdir}/RPMS' --define '_builddir %{_topdir}/BUILD' --define 'php_suffix 74' php74-pecl-msgpack-2.1.0-1.src.rpm Preparing... ################################################## php74-pecl-msgpack ################################################## + rm -f php74-pecl-msgpack-2.1.0-1.src.rpm + install -m 700 -d /tmp/B.2Rh5Or/BUILD/tmp + TMPDIR=/tmp/B.2Rh5Or/BUILD/tmp + exec nice -n 0 rpmbuild -bp --short-circuit --nodeps --define '_topdir /tmp/B.2Rh5Or' --define '_specdir %{_topdir}' --define '_sourcedir %{_specdir}' --define '_rpmdir %{_topdir}/RPMS' --define '_builddir %{_topdir}/BUILD' --target x86_64-pld-linux --define 'php_suffix 74' --define 'prep exit 0' /tmp/B.2Rh5Or/php-pecl-msgpack.spec sh: php-config: inaccessible or not found Building target platforms: x86_64-pld-linux checking BuildConflict-ing packages no BuildConflicts found checking BR rpm: sh: php-config: inaccessible or not found rpm: error: Failed build dependencies: rpm: php74-devel >= 4:7.0.0 is needed by php74-pecl-msgpack-2.1.0-1.src rpm: php74-cli is needed by php74-pecl-msgpack-2.1.0-1.src rpm: php74-pcre is needed by php74-pecl-msgpack-2.1.0-1.src rpm: php74-session is needed by php74-pecl-msgpack-2.1.0-1.src rpm: php74-spl is needed by php74-pecl-msgpack-2.1.0-1.src rpm: Building target platforms: x86_64-pld-linux updating poldek cache... ready is up to date th is up to date th is up to date th-ready is up to date th-ready is up to date th-test is up to date th-test is up to date checking conflicting packages in BRed packages poldek: Loading [pndir]ready... poldek: Loading [pndir]th-test... poldek: Loading [pndir]th-test... poldek: Loading [pndir]th-ready... poldek: Loading [pndir]th-ready... poldek: Loading [pndir]th... poldek: Loading [pndir]th... poldek: 30613 packages read poldek: Removed 2229 duplicate packages from available set poldek: Processing dependencies... poldek: There are 4 packages to install: poldek: A php74-cli-7.4.6-2.x86_64 php74-common-7.4.6-2.x86_64 poldek: A php74-devel-7.4.6-2.x86_64 php74-session-7.4.6-2.x86_64 poldek: This operation will use 9.8MB of disk space. poldek: Need to get 2.1MB of archives (2.1MB to download). poldek: poldek: Retrieving [1/4] th-ready::php74-common-7.4.6-2.x86_64.rpm.................................done poldek: Retrieving [2/4] th-ready::php74-cli-7.4.6-2.x86_64.rpm....................................done poldek: Retrieving [3/4] th-ready::php74-devel-7.4.6-2.x86_64.rpm..................................done poldek: Retrieving [4/4] th-ready::php74-session-7.4.6-2.x86_64.rpm................................done poldek: Executing pm-command.sh --upgrade -vh --test --root / --define _check_dirname_deps 1... poldek: Preparing... ################################################## no conflicts found checking BR rpm: sh: php-config: inaccessible or not found rpm: error: Failed build dependencies: rpm: php74-devel >= 4:7.0.0 is needed by php74-pecl-msgpack-2.1.0-1.src rpm: php74-cli is needed by php74-pecl-msgpack-2.1.0-1.src rpm: php74-pcre is needed by php74-pecl-msgpack-2.1.0-1.src rpm: php74-session is needed by php74-pecl-msgpack-2.1.0-1.src rpm: php74-spl is needed by php74-pecl-msgpack-2.1.0-1.src rpm: Building target platforms: x86_64-pld-linux installing BR: php74\-pcre php74\-devel php74\-spl php74\-cli php74\-session + poldek --noask --caplookup -Q -v '--ignore=hhvm-*' '--ignore=php4-*' '--ignore=php52-*' '--ignore=php53-*' '--ignore=php54-*' '--ignore=php55-*' '--ignore=php56-*' '--ignore=php70-*' '--ignore=php71-*' '--ignore=php72-*' '--ignore=php73-*' --upgrade php74-pcre php74-devel php74-spl php74-cli php74-session Loading [pndir]ready... Loading [pndir]th-test... Loading [pndir]th-test... Loading [pndir]th-ready... Loading [pndir]th-ready... Loading [pndir]th... Loading [pndir]th... 30613 packages read Removed 2229 duplicate packages from available set Processing dependencies... There are 4 packages to install: A php74-cli-7.4.6-2.x86_64 php74-common-7.4.6-2.x86_64 A php74-devel-7.4.6-2.x86_64 php74-session-7.4.6-2.x86_64 This operation will use 9.8MB of disk space. Need to get 2.1MB of archives. Executing pm-command.sh --upgrade -vh --root / --define _check_dirname_deps 1... Preparing... ################################################## php74-common ################################################## php74-cli ################################################## php74-devel ################################################## php74-session ################################################## building RPM using: set -ex; : build-id: 697290ab-d278-4766-84d8-3c569841cf0f; TMPDIR=/tmp/B.2Rh5Or/BUILD/tmp exec nice -n 0 rpmbuild -bb --define '_smp_mflags -j9' --define '_make_opts -Otarget' --define '_pld_builder 1' --define '_topdir /tmp/B.2Rh5Or' --define '_specdir %{_topdir}' --define '_sourcedir %{_specdir}' --define '_rpmdir %{_topdir}/RPMS' --define '_builddir %{_topdir}/BUILD' --target x86_64-pld-linux --define 'php_suffix 74' /tmp/B.2Rh5Or/php-pecl-msgpack.spec + : build-id: 697290ab-d278-4766-84d8-3c569841cf0f + TMPDIR=/tmp/B.2Rh5Or/BUILD/tmp + exec nice -n 0 rpmbuild -bb --define '_smp_mflags -j9' --define '_make_opts -Otarget' --define '_pld_builder 1' --define '_topdir /tmp/B.2Rh5Or' --define '_specdir %{_topdir}' --define '_sourcedir %{_specdir}' --define '_rpmdir %{_topdir}/RPMS' --define '_builddir %{_topdir}/BUILD' --target x86_64-pld-linux --define 'php_suffix 74' /tmp/B.2Rh5Or/php-pecl-msgpack.spec Building target platforms: x86_64-pld-linux Executing(%prep): /bin/sh -e /tmp/B.2Rh5Or/BUILD/tmp/rpm-tmp.45060 + umask 022 + cd /tmp/B.2Rh5Or/BUILD + cd /tmp/B.2Rh5Or/BUILD + rm -rf php74-pecl-msgpack-2.1.0 + /bin/mkdir -p php74-pecl-msgpack-2.1.0 + cd php74-pecl-msgpack-2.1.0 + /bin/gzip -dc /tmp/B.2Rh5Or/msgpack-2.1.0.tgz + /bin/tar -xf - + STATUS=0 + '[' 0 -ne 0 ']' + /bin/id -u + '[' 1000 '=' 0 ']' + /bin/id -u + '[' 1000 '=' 0 ']' + /bin/chmod -Rf a+rX,u+w,g-w,o-w . + mv msgpack-2.1.0/CREDITS msgpack-2.1.0/EXPERIMENTAL msgpack-2.1.0/LICENSE msgpack-2.1.0/README.md msgpack-2.1.0/config.m4 msgpack-2.1.0/config.w32 msgpack-2.1.0/msgpack msgpack-2.1.0/msgpack.c msgpack-2.1.0/msgpack_class.c msgpack-2.1.0/msgpack_class.h msgpack-2.1.0/msgpack_convert.c msgpack-2.1.0/msgpack_convert.h msgpack-2.1.0/msgpack_errors.h msgpack-2.1.0/msgpack_pack.c msgpack-2.1.0/msgpack_pack.h msgpack-2.1.0/msgpack_unpack.c msgpack-2.1.0/msgpack_unpack.h msgpack-2.1.0/php_msgpack.h msgpack-2.1.0/tests . + rm tests/040.phpt tests/040b.phpt tests/040c.phpt tests/040d.phpt + exit 0 Executing(%build): /bin/sh -e /tmp/B.2Rh5Or/BUILD/tmp/rpm-tmp.45060 TMP=/home/users/builder/tmp HOME=/home/users/builder PATH=/home/users/builder/GNUstep/Tools:/bin:/usr/bin:/usr/local/bin:/home/users/builder/bin TMPDIR=/tmp/B.2Rh5Or/BUILD/tmp + umask 022 + cd /tmp/B.2Rh5Or/BUILD + cd php74-pecl-msgpack-2.1.0 + phpize Configuring for: PHP Api Version: 20190902 Zend Module Api No: 20190902 Zend Extension Api No: 320190902 + ./configure 'LDFLAGS=-Wl,--as-needed -Wl,--no-copy-dt-needed-entries -Wl,-z,relro -Wl,-z,combreloc ' 'CFLAGS=-O2 -fwrapv -pipe -Wformat -Werror=format-security -gdwarf-4 -fno-debug-types-section -fvar-tracking-assignments -g2 -Wp,-D_FORTIFY_SOURCE=2 -fstack-protector-strong --param=ssp-buffer-size=4 -Werror=trampolines -fPIC -march=x86-64 -gdwarf-4 -fno-debug-types-section -fvar-tracking-assignments -g2 ' 'CXXFLAGS=-O2 -fwrapv -pipe -Wformat -Werror=format-security -gdwarf-4 -fno-debug-types-section -fvar-tracking-assignments -g2 -Wp,-D_FORTIFY_SOURCE=2 -fstack-protector-strong --param=ssp-buffer-size=4 -Werror=trampolines -fPIC -march=x86-64 -gdwarf-4 -fno-debug-types-section -fvar-tracking-assignments -g2 ' 'FFLAGS=-O2 -fwrapv -pipe -Wformat -Werror=format-security -gdwarf-4 -fno-debug-types-section -fvar-tracking-assignments -g2 -Wp,-D_FORTIFY_SOURCE=2 -fstack-protector-strong --param=ssp-buffer-size=4 -Werror=trampolines -fPIC -march=x86-64 -gdwarf-4 -fno-debug-types-section -fvar-tracking-assignments -g2 ' 'FCFLAGS=-O2 -fwrapv -pipe -Wformat -Werror=format-security -gdwarf-4 -fno-debug-types-section -fvar-tracking-assignments -g2 -Wp,-D_FORTIFY_SOURCE=2 -fstack-protector-strong --param=ssp-buffer-size=4 -Werror=trampolines -fPIC -march=x86-64 -gdwarf-4 -fno-debug-types-section -fvar-tracking-assignments -g2 ' 'CPPFLAGS=' 'CC=x86_64-pld-linux-gcc' 'CXX=x86_64-pld-linux-g++' '--host=x86_64-pld-linux' '--build=x86_64-pld-linux' '--prefix=/usr' '--exec-prefix=/usr' '--bindir=/usr/bin' '--sbindir=/usr/sbin' '--sysconfdir=/etc' '--datadir=/usr/share' '--includedir=/usr/include' '--libdir=/usr/lib64' '--libexecdir=/usr/libexec' '--localstatedir=/var' '--sharedstatedir=/var/lib' '--mandir=/usr/share/man' '--infodir=/usr/share/info' '--x-libraries=/usr/lib64' checking for grep that handles long lines and -e... /bin/grep checking for egrep... /bin/grep -E checking for a sed that does not truncate output... /bin/sed checking for x86_64-pld-linux-pkg-config... no checking for pkg-config... /usr/bin/pkg-config checking pkg-config is at least version 0.9.0... yes checking for x86_64-pld-linux-cc... x86_64-pld-linux-gcc checking whether the C compiler works... yes checking for C compiler default output file name... a.out checking for suffix of executables... checking whether we are cross compiling... no checking for suffix of object files... o checking whether we are using the GNU C compiler... yes checking whether x86_64-pld-linux-gcc accepts -g... yes checking for x86_64-pld-linux-gcc option to accept ISO C89... none needed checking how to run the C preprocessor... x86_64-pld-linux-gcc -E checking for icc... no checking for suncc... no checking for system library directory... lib checking if compiler supports -R... no checking if compiler supports -Wl,-rpath,... yes checking build system type... x86_64-pld-linux-gnu checking host system type... x86_64-pld-linux-gnu checking target system type... x86_64-pld-linux-gnu checking for PHP prefix... /usr checking for PHP includes... -I/usr/include/php -I/usr/include/php/main -I/usr/include/php/TSRM -I/usr/include/php/Zend -I/usr/include/php/ext -I/usr/include/php/ext/date/lib checking for PHP extension directory... /usr/lib64/php74 checking for PHP installed headers prefix... /usr/include/php checking if debug is enabled... no checking if zts is enabled... no checking for gawk... gawk checking for msgpack support... yes, shared checking how to print strings... print -r checking for a sed that does not truncate output... (cached) /bin/sed checking for fgrep... /bin/grep -F checking for ld used by x86_64-pld-linux-gcc... /usr/bin/ld checking if the linker (/usr/bin/ld) is GNU ld... yes checking for BSD- or MS-compatible name lister (nm)... /usr/bin/nm -B checking the name lister (/usr/bin/nm -B) interface... BSD nm checking whether ln -s works... yes checking the maximum length of command line arguments... 1572864 checking how to convert x86_64-pld-linux-gnu file names to x86_64-pld-linux-gnu format... func_convert_file_noop checking how to convert x86_64-pld-linux-gnu file names to toolchain format... func_convert_file_noop checking for /usr/bin/ld option to reload object files... -r checking for x86_64-pld-linux-objdump... no checking for objdump... objdump checking how to recognize dependent libraries... pass_all checking for x86_64-pld-linux-dlltool... no checking for dlltool... no checking how to associate runtime and link libraries... print -r -- checking for x86_64-pld-linux-ar... no checking for ar... ar checking for archiver @FILE support... @ checking for x86_64-pld-linux-strip... no checking for strip... strip checking for x86_64-pld-linux-ranlib... no checking for ranlib... ranlib checking for mawk... (cached) gawk checking command to parse /usr/bin/nm -B output from x86_64-pld-linux-gcc object... ok checking for sysroot... no checking for a working dd... /bin/dd checking how to truncate binary pipes... /bin/dd bs=4096 count=1 checking for x86_64-pld-linux-mt... no checking for mt... no checking if : is a manifest tool... no checking for ANSI C header files... yes checking for sys/types.h... yes checking for sys/stat.h... yes checking for stdlib.h... yes checking for string.h... yes checking for memory.h... yes checking for strings.h... yes checking for inttypes.h... yes checking for stdint.h... yes checking for unistd.h... yes checking for dlfcn.h... yes checking for objdir... .libs checking if x86_64-pld-linux-gcc supports -fno-rtti -fno-exceptions... no checking for x86_64-pld-linux-gcc option to produce PIC... -fPIC -DPIC checking if x86_64-pld-linux-gcc PIC flag -fPIC -DPIC works... yes checking if x86_64-pld-linux-gcc static flag -static works... yes checking if x86_64-pld-linux-gcc supports -c -o file.o... yes checking if x86_64-pld-linux-gcc supports -c -o file.o... (cached) yes checking whether the x86_64-pld-linux-gcc linker (/usr/bin/ld -m elf_x86_64) supports shared libraries... yes checking whether -lc should be explicitly linked in... no checking dynamic linker characteristics... GNU/Linux ld.so checking how to hardcode library paths into programs... immediate checking whether stripping libraries is possible... yes checking if libtool supports shared libraries... yes checking whether to build shared libraries... yes checking whether to build static libraries... no configure: patching config.h.in configure: creating ./config.status config.status: creating config.h config.status: executing libtool commands + /usr/bin/make -Otarget -j9 /bin/sh /tmp/B.2Rh5Or/BUILD/php74-pecl-msgpack-2.1.0/libtool --mode=compile x86_64-pld-linux-gcc -I. -I/tmp/B.2Rh5Or/BUILD/php74-pecl-msgpack-2.1.0 -DPHP_ATOM_INC -I/tmp/B.2Rh5Or/BUILD/php74-pecl-msgpack-2.1.0/include -I/tmp/B.2Rh5Or/BUILD/php74-pecl-msgpack-2.1.0/main -I/tmp/B.2Rh5Or/BUILD/php74-pecl-msgpack-2.1.0 -I/usr/include/php -I/usr/include/php/main -I/usr/include/php/TSRM -I/usr/include/php/Zend -I/usr/include/php/ext -I/usr/include/php/ext/date/lib -DHAVE_CONFIG_H -O2 -fwrapv -pipe -Wformat -Werror=format-security -gdwarf-4 -fno-debug-types-section -fvar-tracking-assignments -g2 -Wp,-D_FORTIFY_SOURCE=2 -fstack-protector-strong --param=ssp-buffer-size=4 -Werror=trampolines -fPIC -march=x86-64 -gdwarf-4 -fno-debug-types-section -fvar-tracking-assignments -g2 -c /tmp/B.2Rh5Or/BUILD/php74-pecl-msgpack-2.1.0/msgpack_convert.c -o msgpack_convert.lo libtool: compile: x86_64-pld-linux-gcc -I. -I/tmp/B.2Rh5Or/BUILD/php74-pecl-msgpack-2.1.0 -DPHP_ATOM_INC -I/tmp/B.2Rh5Or/BUILD/php74-pecl-msgpack-2.1.0/include -I/tmp/B.2Rh5Or/BUILD/php74-pecl-msgpack-2.1.0/main -I/tmp/B.2Rh5Or/BUILD/php74-pecl-msgpack-2.1.0 -I/usr/include/php -I/usr/include/php/main -I/usr/include/php/TSRM -I/usr/include/php/Zend -I/usr/include/php/ext -I/usr/include/php/ext/date/lib -DHAVE_CONFIG_H -O2 -fwrapv -pipe -Wformat -Werror=format-security -gdwarf-4 -fno-debug-types-section -fvar-tracking-assignments -g2 -Wp,-D_FORTIFY_SOURCE=2 -fstack-protector-strong --param=ssp-buffer-size=4 -Werror=trampolines -fPIC -march=x86-64 -gdwarf-4 -fno-debug-types-section -fvar-tracking-assignments -g2 -c /tmp/B.2Rh5Or/BUILD/php74-pecl-msgpack-2.1.0/msgpack_convert.c -fPIC -DPIC -o .libs/msgpack_convert.o /bin/sh /tmp/B.2Rh5Or/BUILD/php74-pecl-msgpack-2.1.0/libtool --mode=compile x86_64-pld-linux-gcc -I. -I/tmp/B.2Rh5Or/BUILD/php74-pecl-msgpack-2.1.0 -DPHP_ATOM_INC -I/tmp/B.2Rh5Or/BUILD/php74-pecl-msgpack-2.1.0/include -I/tmp/B.2Rh5Or/BUILD/php74-pecl-msgpack-2.1.0/main -I/tmp/B.2Rh5Or/BUILD/php74-pecl-msgpack-2.1.0 -I/usr/include/php -I/usr/include/php/main -I/usr/include/php/TSRM -I/usr/include/php/Zend -I/usr/include/php/ext -I/usr/include/php/ext/date/lib -DHAVE_CONFIG_H -O2 -fwrapv -pipe -Wformat -Werror=format-security -gdwarf-4 -fno-debug-types-section -fvar-tracking-assignments -g2 -Wp,-D_FORTIFY_SOURCE=2 -fstack-protector-strong --param=ssp-buffer-size=4 -Werror=trampolines -fPIC -march=x86-64 -gdwarf-4 -fno-debug-types-section -fvar-tracking-assignments -g2 -c /tmp/B.2Rh5Or/BUILD/php74-pecl-msgpack-2.1.0/msgpack.c -o msgpack.lo libtool: compile: x86_64-pld-linux-gcc -I. -I/tmp/B.2Rh5Or/BUILD/php74-pecl-msgpack-2.1.0 -DPHP_ATOM_INC -I/tmp/B.2Rh5Or/BUILD/php74-pecl-msgpack-2.1.0/include -I/tmp/B.2Rh5Or/BUILD/php74-pecl-msgpack-2.1.0/main -I/tmp/B.2Rh5Or/BUILD/php74-pecl-msgpack-2.1.0 -I/usr/include/php -I/usr/include/php/main -I/usr/include/php/TSRM -I/usr/include/php/Zend -I/usr/include/php/ext -I/usr/include/php/ext/date/lib -DHAVE_CONFIG_H -O2 -fwrapv -pipe -Wformat -Werror=format-security -gdwarf-4 -fno-debug-types-section -fvar-tracking-assignments -g2 -Wp,-D_FORTIFY_SOURCE=2 -fstack-protector-strong --param=ssp-buffer-size=4 -Werror=trampolines -fPIC -march=x86-64 -gdwarf-4 -fno-debug-types-section -fvar-tracking-assignments -g2 -c /tmp/B.2Rh5Or/BUILD/php74-pecl-msgpack-2.1.0/msgpack.c -fPIC -DPIC -o .libs/msgpack.o /bin/sh /tmp/B.2Rh5Or/BUILD/php74-pecl-msgpack-2.1.0/libtool --mode=compile x86_64-pld-linux-gcc -I. -I/tmp/B.2Rh5Or/BUILD/php74-pecl-msgpack-2.1.0 -DPHP_ATOM_INC -I/tmp/B.2Rh5Or/BUILD/php74-pecl-msgpack-2.1.0/include -I/tmp/B.2Rh5Or/BUILD/php74-pecl-msgpack-2.1.0/main -I/tmp/B.2Rh5Or/BUILD/php74-pecl-msgpack-2.1.0 -I/usr/include/php -I/usr/include/php/main -I/usr/include/php/TSRM -I/usr/include/php/Zend -I/usr/include/php/ext -I/usr/include/php/ext/date/lib -DHAVE_CONFIG_H -O2 -fwrapv -pipe -Wformat -Werror=format-security -gdwarf-4 -fno-debug-types-section -fvar-tracking-assignments -g2 -Wp,-D_FORTIFY_SOURCE=2 -fstack-protector-strong --param=ssp-buffer-size=4 -Werror=trampolines -fPIC -march=x86-64 -gdwarf-4 -fno-debug-types-section -fvar-tracking-assignments -g2 -c /tmp/B.2Rh5Or/BUILD/php74-pecl-msgpack-2.1.0/msgpack_pack.c -o msgpack_pack.lo libtool: compile: x86_64-pld-linux-gcc -I. -I/tmp/B.2Rh5Or/BUILD/php74-pecl-msgpack-2.1.0 -DPHP_ATOM_INC -I/tmp/B.2Rh5Or/BUILD/php74-pecl-msgpack-2.1.0/include -I/tmp/B.2Rh5Or/BUILD/php74-pecl-msgpack-2.1.0/main -I/tmp/B.2Rh5Or/BUILD/php74-pecl-msgpack-2.1.0 -I/usr/include/php -I/usr/include/php/main -I/usr/include/php/TSRM -I/usr/include/php/Zend -I/usr/include/php/ext -I/usr/include/php/ext/date/lib -DHAVE_CONFIG_H -O2 -fwrapv -pipe -Wformat -Werror=format-security -gdwarf-4 -fno-debug-types-section -fvar-tracking-assignments -g2 -Wp,-D_FORTIFY_SOURCE=2 -fstack-protector-strong --param=ssp-buffer-size=4 -Werror=trampolines -fPIC -march=x86-64 -gdwarf-4 -fno-debug-types-section -fvar-tracking-assignments -g2 -c /tmp/B.2Rh5Or/BUILD/php74-pecl-msgpack-2.1.0/msgpack_pack.c -fPIC -DPIC -o .libs/msgpack_pack.o In file included from /usr/include/string.h:495, from /usr/include/php/main/../main/php_config.h:2332, from /usr/include/php/Zend/zend_config.h:1, from /usr/include/php/Zend/zend_portability.h:43, from /usr/include/php/Zend/zend_types.h:25, from /usr/include/php/Zend/zend.h:27, from /usr/include/php/main/php.h:33, from /tmp/B.2Rh5Or/BUILD/php74-pecl-msgpack-2.1.0/msgpack_pack.c:2: In function 'memcpy', inlined from 'smart_str_appendl_ex' at /usr/include/php/Zend/zend_smart_str.h:121:2, inlined from 'msgpack_pack_long' at /tmp/B.2Rh5Or/BUILD/php74-pecl-msgpack-2.1.0/msgpack/pack_template.h:468:5: /usr/include/bits/string_fortified.h:34:10: warning: writing 2 bytes into a region of size 1 [-Wstringop-overflow=] 34 | return __builtin___memcpy_chk (__dest, __src, __len, __bos0 (__dest)); | ^~~~~~~~~~~~~~~~~~~~~~~~~~~~~~~~~~~~~~~~~~~~~~~~~~~~~~~~~~~~~~ In function 'memcpy', inlined from 'smart_str_appendl_ex' at /usr/include/php/Zend/zend_smart_str.h:121:2, inlined from 'msgpack_pack_long' at /tmp/B.2Rh5Or/BUILD/php74-pecl-msgpack-2.1.0/msgpack/pack_template.h:468:5: /usr/include/bits/string_fortified.h:34:10: warning: writing 2 bytes into a region of size 1 [-Wstringop-overflow=] 34 | return __builtin___memcpy_chk (__dest, __src, __len, __bos0 (__dest)); | ^~~~~~~~~~~~~~~~~~~~~~~~~~~~~~~~~~~~~~~~~~~~~~~~~~~~~~~~~~~~~~ In function 'memcpy', inlined from 'smart_str_appendl_ex' at /usr/include/php/Zend/zend_smart_str.h:121:2, inlined from 'msgpack_pack_str' at /tmp/B.2Rh5Or/BUILD/php74-pecl-msgpack-2.1.0/msgpack/pack_template.h:763:9: /usr/include/bits/string_fortified.h:34:10: warning: writing 2 bytes into a region of size 1 [-Wstringop-overflow=] 34 | return __builtin___memcpy_chk (__dest, __src, __len, __bos0 (__dest)); | ^~~~~~~~~~~~~~~~~~~~~~~~~~~~~~~~~~~~~~~~~~~~~~~~~~~~~~~~~~~~~~ /bin/sh /tmp/B.2Rh5Or/BUILD/php74-pecl-msgpack-2.1.0/libtool --mode=compile x86_64-pld-linux-gcc -I. -I/tmp/B.2Rh5Or/BUILD/php74-pecl-msgpack-2.1.0 -DPHP_ATOM_INC -I/tmp/B.2Rh5Or/BUILD/php74-pecl-msgpack-2.1.0/include -I/tmp/B.2Rh5Or/BUILD/php74-pecl-msgpack-2.1.0/main -I/tmp/B.2Rh5Or/BUILD/php74-pecl-msgpack-2.1.0 -I/usr/include/php -I/usr/include/php/main -I/usr/include/php/TSRM -I/usr/include/php/Zend -I/usr/include/php/ext -I/usr/include/php/ext/date/lib -DHAVE_CONFIG_H -O2 -fwrapv -pipe -Wformat -Werror=format-security -gdwarf-4 -fno-debug-types-section -fvar-tracking-assignments -g2 -Wp,-D_FORTIFY_SOURCE=2 -fstack-protector-strong --param=ssp-buffer-size=4 -Werror=trampolines -fPIC -march=x86-64 -gdwarf-4 -fno-debug-types-section -fvar-tracking-assignments -g2 -c /tmp/B.2Rh5Or/BUILD/php74-pecl-msgpack-2.1.0/msgpack_unpack.c -o msgpack_unpack.lo libtool: compile: x86_64-pld-linux-gcc -I. -I/tmp/B.2Rh5Or/BUILD/php74-pecl-msgpack-2.1.0 -DPHP_ATOM_INC -I/tmp/B.2Rh5Or/BUILD/php74-pecl-msgpack-2.1.0/include -I/tmp/B.2Rh5Or/BUILD/php74-pecl-msgpack-2.1.0/main -I/tmp/B.2Rh5Or/BUILD/php74-pecl-msgpack-2.1.0 -I/usr/include/php -I/usr/include/php/main -I/usr/include/php/TSRM -I/usr/include/php/Zend -I/usr/include/php/ext -I/usr/include/php/ext/date/lib -DHAVE_CONFIG_H -O2 -fwrapv -pipe -Wformat -Werror=format-security -gdwarf-4 -fno-debug-types-section -fvar-tracking-assignments -g2 -Wp,-D_FORTIFY_SOURCE=2 -fstack-protector-strong --param=ssp-buffer-size=4 -Werror=trampolines -fPIC -march=x86-64 -gdwarf-4 -fno-debug-types-section -fvar-tracking-assignments -g2 -c /tmp/B.2Rh5Or/BUILD/php74-pecl-msgpack-2.1.0/msgpack_unpack.c -fPIC -DPIC -o .libs/msgpack_unpack.o /bin/sh /tmp/B.2Rh5Or/BUILD/php74-pecl-msgpack-2.1.0/libtool --mode=compile x86_64-pld-linux-gcc -I. -I/tmp/B.2Rh5Or/BUILD/php74-pecl-msgpack-2.1.0 -DPHP_ATOM_INC -I/tmp/B.2Rh5Or/BUILD/php74-pecl-msgpack-2.1.0/include -I/tmp/B.2Rh5Or/BUILD/php74-pecl-msgpack-2.1.0/main -I/tmp/B.2Rh5Or/BUILD/php74-pecl-msgpack-2.1.0 -I/usr/include/php -I/usr/include/php/main -I/usr/include/php/TSRM -I/usr/include/php/Zend -I/usr/include/php/ext -I/usr/include/php/ext/date/lib -DHAVE_CONFIG_H -O2 -fwrapv -pipe -Wformat -Werror=format-security -gdwarf-4 -fno-debug-types-section -fvar-tracking-assignments -g2 -Wp,-D_FORTIFY_SOURCE=2 -fstack-protector-strong --param=ssp-buffer-size=4 -Werror=trampolines -fPIC -march=x86-64 -gdwarf-4 -fno-debug-types-section -fvar-tracking-assignments -g2 -c /tmp/B.2Rh5Or/BUILD/php74-pecl-msgpack-2.1.0/msgpack_class.c -o msgpack_class.lo libtool: compile: x86_64-pld-linux-gcc -I. -I/tmp/B.2Rh5Or/BUILD/php74-pecl-msgpack-2.1.0 -DPHP_ATOM_INC -I/tmp/B.2Rh5Or/BUILD/php74-pecl-msgpack-2.1.0/include -I/tmp/B.2Rh5Or/BUILD/php74-pecl-msgpack-2.1.0/main -I/tmp/B.2Rh5Or/BUILD/php74-pecl-msgpack-2.1.0 -I/usr/include/php -I/usr/include/php/main -I/usr/include/php/TSRM -I/usr/include/php/Zend -I/usr/include/php/ext -I/usr/include/php/ext/date/lib -DHAVE_CONFIG_H -O2 -fwrapv -pipe -Wformat -Werror=format-security -gdwarf-4 -fno-debug-types-section -fvar-tracking-assignments -g2 -Wp,-D_FORTIFY_SOURCE=2 -fstack-protector-strong --param=ssp-buffer-size=4 -Werror=trampolines -fPIC -march=x86-64 -gdwarf-4 -fno-debug-types-section -fvar-tracking-assignments -g2 -c /tmp/B.2Rh5Or/BUILD/php74-pecl-msgpack-2.1.0/msgpack_class.c -fPIC -DPIC -o .libs/msgpack_class.o /bin/sh /tmp/B.2Rh5Or/BUILD/php74-pecl-msgpack-2.1.0/libtool --mode=link x86_64-pld-linux-gcc -DPHP_ATOM_INC -I/tmp/B.2Rh5Or/BUILD/php74-pecl-msgpack-2.1.0/include -I/tmp/B.2Rh5Or/BUILD/php74-pecl-msgpack-2.1.0/main -I/tmp/B.2Rh5Or/BUILD/php74-pecl-msgpack-2.1.0 -I/usr/include/php -I/usr/include/php/main -I/usr/include/php/TSRM -I/usr/include/php/Zend -I/usr/include/php/ext -I/usr/include/php/ext/date/lib -DHAVE_CONFIG_H -O2 -fwrapv -pipe -Wformat -Werror=format-security -gdwarf-4 -fno-debug-types-section -fvar-tracking-assignments -g2 -Wp,-D_FORTIFY_SOURCE=2 -fstack-protector-strong --param=ssp-buffer-size=4 -Werror=trampolines -fPIC -march=x86-64 -gdwarf-4 -fno-debug-types-section -fvar-tracking-assignments -g2 -Wl,--as-needed -Wl,--no-copy-dt-needed-entries -Wl,-z,relro -Wl,-z,combreloc -o msgpack.la -export-dynamic -avoid-version -prefer-pic -module -rpath /tmp/B.2Rh5Or/BUILD/php74-pecl-msgpack-2.1.0/modules msgpack.lo msgpack_pack.lo msgpack_unpack.lo msgpack_class.lo msgpack_convert.lo libtool: link: x86_64-pld-linux-gcc -shared -fPIC -DPIC -O2 -gdwarf-4 -g2 -fstack-protector-strong -march=x86-64 -gdwarf-4 -g2 -Wl,--as-needed -Wl,--no-copy-dt-needed-entries -Wl,-z -Wl,relro -Wl,-z -Wl,combreloc .libs/msgpack.o .libs/msgpack_pack.o .libs/msgpack_unpack.o .libs/msgpack_class.o .libs/msgpack_convert.o -Wl,-soname -Wl,msgpack.so -o .libs/msgpack.so libtool: link: ( cd ".libs" && rm -f "msgpack.la" && ln -s "../msgpack.la" "msgpack.la" ) /bin/sh /tmp/B.2Rh5Or/BUILD/php74-pecl-msgpack-2.1.0/libtool --mode=install cp ./msgpack.la /tmp/B.2Rh5Or/BUILD/php74-pecl-msgpack-2.1.0/modules libtool: install: cp ./.libs/msgpack.so /tmp/B.2Rh5Or/BUILD/php74-pecl-msgpack-2.1.0/modules/msgpack.so libtool: install: cp ./.libs/msgpack.lai /tmp/B.2Rh5Or/BUILD/php74-pecl-msgpack-2.1.0/modules/msgpack.la libtool: finish: PATH="/home/users/builder/GNUstep/Tools:/bin:/usr/bin:/usr/local/bin:/home/users/builder/bin:/sbin" ldconfig -n /tmp/B.2Rh5Or/BUILD/php74-pecl-msgpack-2.1.0/modules ---------------------------------------------------------------------- Libraries have been installed in: /tmp/B.2Rh5Or/BUILD/php74-pecl-msgpack-2.1.0/modules If you ever happen to want to link against installed libraries in a given directory, LIBDIR, you must either use libtool, and specify the full pathname of the library, or use the '-LLIBDIR' flag during linking and do at least one of the following: - add LIBDIR to the 'LD_LIBRARY_PATH' environment variable during execution - add LIBDIR to the 'LD_RUN_PATH' environment variable during linking - use the '-Wl,-rpath -Wl,LIBDIR' linker flag - have your system administrator add LIBDIR to '/etc/ld.so.conf' See any operating system documentation about shared libraries for more information, such as the ld(1) and ld.so(8) manual pages. ---------------------------------------------------------------------- Build complete. Don't forget to run 'make test'. + >modules.log + /usr/bin/php74 -n -q -d 'extension_dir=modules' -d 'extension=/usr/lib64/php74/pcre.so' -d 'extension=/usr/lib64/php74/spl.so' -d 'extension=/usr/lib64/php74/session.so' -d 'extension=msgpack.so' -m PHP Warning: PHP Startup: Unable to load dynamic library '/usr/lib64/php74/pcre.so' (tried: /usr/lib64/php74/pcre.so (/usr/lib64/php74/pcre.so: cannot open shared object file: No such file or directory), modules//usr/lib64/php74/pcre.so.so (modules//usr/lib64/php74/pcre.so.so: cannot open shared object file: No such file or directory)) in Unknown on line 0 PHP Warning: PHP Startup: Unable to load dynamic library '/usr/lib64/php74/spl.so' (tried: /usr/lib64/php74/spl.so (/usr/lib64/php74/spl.so: cannot open shared object file: No such file or directory), modules//usr/lib64/php74/spl.so.so (modules//usr/lib64/php74/spl.so.so: cannot open shared object file: No such file or directory)) in Unknown on line 0 + grep msgpack modules.log msgpack + <<"EOF" + >run-tests.sh + cat + chmod +x run-tests.sh + ./run-tests.sh Build complete. Don't forget to run 'make test'. PHP Warning: PHP Startup: Unable to load dynamic library '/usr/lib64/php74/pcre.so' (tried: /usr/lib64/php74/pcre.so (/usr/lib64/php74/pcre.so: cannot open shared object file: No such file or directory), /tmp/B.2Rh5Or/BUILD/php74-pecl-msgpack-2.1.0/modules///usr/lib64/php74/pcre.so.so (/tmp/B.2Rh5Or/BUILD/php74-pecl-msgpack-2.1.0/modules///usr/lib64/php74/pcre.so.so: cannot open shared object file: No such file or directory)) in Unknown on line 0 PHP Warning: PHP Startup: Unable to load dynamic library '/usr/lib64/php74/spl.so' (tried: /usr/lib64/php74/spl.so (/usr/lib64/php74/spl.so: cannot open shared object file: No such file or directory), /tmp/B.2Rh5Or/BUILD/php74-pecl-msgpack-2.1.0/modules///usr/lib64/php74/spl.so.so (/tmp/B.2Rh5Or/BUILD/php74-pecl-msgpack-2.1.0/modules///usr/lib64/php74/spl.so.so: cannot open shared object file: No such file or directory)) in Unknown on line 0 PHP Warning: PHP Startup: Unable to load dynamic library '/usr/lib64/php74/pcre.so' (tried: /usr/lib64/php74/pcre.so (/usr/lib64/php74/pcre.so: cannot open shared object file: No such file or directory), /tmp/B.2Rh5Or/BUILD/php74-pecl-msgpack-2.1.0/modules///usr/lib64/php74/pcre.so.so (/tmp/B.2Rh5Or/BUILD/php74-pecl-msgpack-2.1.0/modules///usr/lib64/php74/pcre.so.so: cannot open shared object file: No such file or directory)) in Unknown on line 0 PHP Warning: PHP Startup: Unable to load dynamic library '/usr/lib64/php74/spl.so' (tried: /usr/lib64/php74/spl.so (/usr/lib64/php74/spl.so: cannot open shared object file: No such file or directory), /tmp/B.2Rh5Or/BUILD/php74-pecl-msgpack-2.1.0/modules///usr/lib64/php74/spl.so.so (/tmp/B.2Rh5Or/BUILD/php74-pecl-msgpack-2.1.0/modules///usr/lib64/php74/spl.so.so: cannot open shared object file: No such file or directory)) in Unknown on line 0 ===================================================================== PHP : /usr/bin/php74 Warning: PHP Startup: Unable to load dynamic library '/usr/lib64/php74/pcre.so' (tried: /usr/lib64/php74/pcre.so (/usr/lib64/php74/pcre.so: cannot open shared object file: No such file or directory), /tmp/B.2Rh5Or/BUILD/php74-pecl-msgpack-2.1.0/modules///usr/lib64/php74/pcre.so.so (/tmp/B.2Rh5Or/BUILD/php74-pecl-msgpack-2.1.0/modules///usr/lib64/php74/pcre.so.so: cannot open shared object file: No such file or directory)) in Unknown on line 0 Warning: PHP Startup: Unable to load dynamic library '/usr/lib64/php74/spl.so' (tried: /usr/lib64/php74/spl.so (/usr/lib64/php74/spl.so: cannot open shared object file: No such file or directory), /tmp/B.2Rh5Or/BUILD/php74-pecl-msgpack-2.1.0/modules///usr/lib64/php74/spl.so.so (/tmp/B.2Rh5Or/BUILD/php74-pecl-msgpack-2.1.0/modules///usr/lib64/php74/spl.so.so: cannot open shared object file: No such file or directory)) in Unknown on line 0 PHP_SAPI : cli PHP_VERSION : 7.4.6 ZEND_VERSION: 3.4.0 PHP_OS : Linux - Linux ymir-builder 4.9.208-1 #1 SMP Sat Jan 4 19:36:41 CET 2020 x86_64 INI actual : /tmp/B.2Rh5Or/BUILD/php74-pecl-msgpack-2.1.0/tmp-php.ini More .INIs : CWD : /tmp/B.2Rh5Or/BUILD/php74-pecl-msgpack-2.1.0 Extra dirs : VALGRIND : Not used ===================================================================== TIME START 2020-07-15 18:33:33 ===================================================================== TEST 1/128 [tests/001.phpt] FAIL Check for msgpack presence [tests/001.phpt] TEST 2/128 [tests/002.phpt] FAIL Check for null serialisation [tests/002.phpt] TEST 3/128 [tests/003.phpt] FAIL Check for bool serialisation [tests/003.phpt] TEST 4/128 [tests/004.phpt] FAIL Check for integer serialisation [tests/004.phpt] TEST 5/128 [tests/005.phpt] FAIL Check for double serialisation [tests/005.phpt] TEST 6/128 [tests/006.phpt] FAIL Check for simple string serialization [tests/006.phpt] TEST 7/128 [tests/007.phpt] FAIL Check for simple array serialization [tests/007.phpt] TEST 8/128 [tests/008.phpt] FAIL Check for array+string serialization [tests/008.phpt] TEST 9/128 [tests/009.phpt] FAIL Check for reference serialization [tests/009.phpt] TEST 10/128 [tests/010.phpt] FAIL Array test [tests/010.phpt] TEST 11/128 [tests/012.phpt] FAIL Object test [tests/012.phpt] TEST 12/128 [tests/013.phpt] FAIL Object-Array test [tests/013.phpt] TEST 13/128 [tests/014.phpt] FAIL Object-Reference test [tests/014.phpt] TEST 14/128 [tests/015.phpt] FAIL Check for serialization handler [tests/015.phpt] TEST 15/128 [tests/015b.phpt] FAIL Check for serialization handler, ini-directive [tests/015b.phpt] TEST 16/128 [tests/015e.phpt] FAIL Check for serialization handler, broken [tests/015e.phpt] TEST 17/128 [tests/016.phpt] FAIL Object test, __sleep [tests/016.phpt] TEST 18/128 [tests/017.phpt] FAIL Object test, __wakeup [tests/017.phpt] TEST 19/128 [tests/018.phpt] FAIL Object test, __sleep error cases [tests/018.phpt] TEST 20/128 [tests/019.phpt] FAIL Object test, __autoload [tests/019.phpt] TEST 21/128 [tests/020.phpt] FAIL Object test, incomplete class [tests/020.phpt] TEST 22/128 [tests/021.phpt] FAIL Object Serializable interface [tests/021.phpt] TEST 23/128 [tests/022.phpt] FAIL Object test, unserialize_callback_func [tests/022.phpt] TEST 24/128 [tests/023.phpt] FAIL Resource [tests/023.phpt] TEST 25/128 [tests/024.phpt] FAIL Recursive objects [tests/024.phpt] TEST 26/128 [tests/025.phpt] FAIL Object test, array of objects with __sleep [tests/025.phpt] TEST 27/128 [tests/026.phpt] FAIL Cyclic array test [tests/026.phpt] TEST 28/128 [tests/027.phpt] FAIL Check for serialization handler [tests/027.phpt] TEST 29/128 [tests/028.phpt] FAIL Serialize object into session, full set [tests/028.phpt] TEST 30/128 [tests/029.phpt] FAIL Msgpack module info [tests/029.phpt] TEST 31/128 [tests/030.phpt] FAIL Unserialize invalid data [tests/030.phpt] TEST 32/128 [tests/031.phpt] FAIL Object Serializable interface throws exceptions [tests/031.phpt] TEST 33/128 [tests/032.phpt] FAIL Object test, __sleep and __wakeup exceptions [tests/032.phpt] TEST 34/128 [tests/033.phpt] FAIL Object test, cyclic references [tests/033.phpt] TEST 35/128 [tests/034.phpt] XFAIL Unserialize invalid random data [tests/034.phpt] XFAIL REASON: REGRESSION TEST 36/128 [tests/035.phpt] FAIL Profiling perf test. [tests/035.phpt] TEST 37/128 [tests/041.phpt] FAIL Check for double NaN, Inf, -Inf, 0, and -0 [tests/041.phpt] TEST 38/128 [tests/042.phpt] FAIL Closure [tests/042.phpt] TEST 39/128 [tests/050.phpt] FAIL Check for array unserialization [tests/050.phpt] TEST 40/128 [tests/060.phpt] FAIL Check for buffered streaming unserialization [tests/060.phpt] TEST 41/128 [tests/061.phpt] FAIL Check for unbuffered streaming unserialization [tests/061.phpt] TEST 42/128 [tests/062.phpt] FAIL Extra bytes buffered streaming unserialization [tests/062.phpt] TEST 43/128 [tests/063.phpt] FAIL Extra bytes unbuffered streaming unserialization [tests/063.phpt] TEST 44/128 [tests/064.phpt] FAIL Check for buffered streaming unserialization (single) [tests/064.phpt] TEST 45/128 [tests/065.phpt] FAIL Check for unbuffered streaming unserialization (single) [tests/065.phpt] TEST 46/128 [tests/066.phpt] FAIL Extra bytes buffered streaming unserialization (single) [tests/066.phpt] TEST 47/128 [tests/067.phpt] FAIL Extra bytes unbuffered streaming unserialization (single) [tests/067.phpt] TEST 48/128 [tests/070.phpt] FAIL Check for alias functions [tests/070.phpt] TEST 49/128 [tests/071.phpt] FAIL Check for class methods [tests/071.phpt] TEST 50/128 [tests/072.phpt] FAIL Check for class methods unpacker [tests/072.phpt] TEST 51/128 [tests/073.phpt] FAIL Check for class unpacker [tests/073.phpt] TEST 52/128 [tests/080.phpt] FAIL disabled php only (ini_set) [tests/080.phpt] TEST 53/128 [tests/081.phpt] FAIL disabled php only for class methods (ini_set) [tests/081.phpt] TEST 54/128 [tests/082.phpt] FAIL disabled php only for class methods unpacker (ini_set) [tests/082.phpt] TEST 55/128 [tests/083.phpt] FAIL disabled php only for class unpacker (ini_set) [tests/083.phpt] TEST 56/128 [tests/084.phpt] FAIL disabled php only for class methods (constract) [tests/084.phpt] TEST 57/128 [tests/085.phpt] FAIL disabled php only for class methods unpacker (constract) [tests/085.phpt] TEST 58/128 [tests/086.phpt] FAIL disabled php only for class unpacker (constract) [tests/086.phpt] TEST 59/128 [tests/087.phpt] FAIL disabled php only for class methods (set option) [tests/087.phpt] TEST 60/128 [tests/088.phpt] FAIL disabled php only for class methods unpacker (set option) [tests/088.phpt] TEST 61/128 [tests/089.phpt] FAIL disabled php only for class unpacker (set option) [tests/089.phpt] TEST 62/128 [tests/090.phpt] FAIL unpack of object converter (string) [tests/090.phpt] TEST 63/128 [tests/091.phpt] FAIL unpack of object converter (object) [tests/091.phpt] TEST 64/128 [tests/092.phpt] FAIL unpack of object converter (string: php_only=0) [tests/092.phpt] TEST 65/128 [tests/093.phpt] FAIL unpack of object converter (object: php_only=0) [tests/093.phpt] TEST 66/128 [tests/094.phpt] FAIL unpack of object converter : class unpack (string) [tests/094.phpt] TEST 67/128 [tests/095.phpt] FAIL unpack of object converter : class unpack (object) [tests/095.phpt] TEST 68/128 [tests/096.phpt] FAIL unpack of object converter : class unpack (string: php_only=0) [tests/096.phpt] TEST 69/128 [tests/097.phpt] FAIL unpack of object converter : class unpack (object: php_only=0) [tests/097.phpt] TEST 70/128 [tests/098.phpt] FAIL unpack of object converter: class unpack (string: OPT_PHPONLY=false) [tests/098.phpt] TEST 71/128 [tests/099.phpt] FAIL unpack of object converter : class unpacker (string) [tests/099.phpt] TEST 72/128 [tests/100.phpt] FAIL unpack of object converter : class unpacker (object) [tests/100.phpt] TEST 73/128 [tests/101.phpt] FAIL unpack of object converter : class unpacker (string: php_only=0) [tests/101.phpt] TEST 74/128 [tests/102.phpt] FAIL unpack of object converter : class unpacker (object: php_only=0) [tests/102.phpt] TEST 75/128 [tests/103.phpt] FAIL unpack of object converter: class unpacker (string: OPT_PHPONLY=false) [tests/103.phpt] TEST 76/128 [tests/104.phpt] FAIL unpack of template converter: class unpacker (array: string) [tests/104.phpt] TEST 77/128 [tests/105.phpt] FAIL unpack of template converter: class unpacker (array: object) [tests/105.phpt] TEST 78/128 [tests/106.phpt] FAIL unpack of template converter: class unpacker (string) [tests/106.phpt] TEST 79/128 [tests/107.phpt] FAIL unpack of template converter: class unpacker (object) [tests/107.phpt] TEST 80/128 [tests/108.phpt] FAIL unpack of template converter: multiple class: class unpacker (array: string) [tests/108.phpt] TEST 81/128 [tests/109.phpt] FAIL unpack of template converter: multiple class: class unpacker (array: object) [tests/109.phpt] TEST 82/128 [tests/110.phpt] FAIL unpack of template converter: multiple variable: class unpacker (array: string) [tests/110.phpt] TEST 83/128 [tests/111.phpt] FAIL unpack of template converter: multiple variable: class unpacker (array: object) [tests/111.phpt] TEST 84/128 [tests/112.phpt] FAIL unpack of template converter: multiple class/variable: class unpacker (array: string) [tests/112.phpt] TEST 85/128 [tests/113.phpt] FAIL unpack of template converter: multiple class/variable: class unpacker (array: object) [tests/113.phpt] TEST 86/128 [tests/114.phpt] FAIL unpack of template converter: multiple class/variable: class unpacker (array) [tests/114.phpt] TEST 87/128 [tests/115.phpt] FAIL unpack of template converter: class unpacker (array: string: OPT_PHPONLY=false) [tests/115.phpt] TEST 88/128 [tests/116.phpt] FAIL unpack of template converter: class unpacker (array: object: OPT_PHPONLY=false) [tests/116.phpt] TEST 89/128 [tests/117.phpt] FAIL unpack of template converter: class unpacker (string: OPT_PHPONLY=false) [tests/117.phpt] TEST 90/128 [tests/118.phpt] FAIL unpack of template converter: class unpacker (object: OPT_PHPONLY=false) [tests/118.phpt] TEST 91/128 [tests/119.phpt] FAIL unpack of template converter: multiple class: class unpacker (array: string: OPT_PHPONLY=false) [tests/119.phpt] TEST 92/128 [tests/120.phpt] FAIL unpack of template converter: multiple class: class unpacker (array: object: OPT_PHPONLY=false) [tests/120.phpt] TEST 93/128 [tests/121.phpt] FAIL unpack of template converter: multiple variable: class unpacker (array: string: OPT_PHPONLY=false) [tests/121.phpt] TEST 94/128 [tests/122.phpt] FAIL unpack of template converter: multiple variable: class unpacker (array: object: OPT_PHPONLY=false) [tests/122.phpt] TEST 95/128 [tests/123.phpt] FAIL unpack of template converter: multiple class/variable: class unpacker (array: string: OPT_PHPONLY=false) [tests/123.phpt] TEST 96/128 [tests/124.phpt] FAIL unpack of template converter: multiple class/variable: class unpacker (array: object: OPT_PHPONLY=false) [tests/124.phpt] TEST 97/128 [tests/125.phpt] FAIL unpack of template converter: multiple class/variable: class unpacker (array: OPT_PHPONLY=false) [tests/125.phpt] TEST 98/128 [tests/126.phpt] FAIL unpack of template converter (array: string) [tests/126.phpt] TEST 99/128 [tests/127.phpt] FAIL unpack of template converter (array: object) [tests/127.phpt] TEST 100/128 [tests/128.phpt] FAIL unpack of template converter (string) [tests/128.phpt] TEST 101/128 [tests/129.phpt] FAIL unpack of template converter (object) [tests/129.phpt] TEST 102/128 [tests/130.phpt] FAIL unpack of template converter: multiple class: (array: string) [tests/130.phpt] TEST 103/128 [tests/131.phpt] FAIL unpack of template converter: multiple class: (array: object) [tests/131.phpt] TEST 104/128 [tests/132.phpt] FAIL unpack of template converter: multiple variable: (array: string) [tests/132.phpt] TEST 105/128 [tests/133.phpt] FAIL unpack of template converter: multiple variable: (array: object) [tests/133.phpt] TEST 106/128 [tests/134.phpt] FAIL unpack of template converter: multiple class/variable: (array: string) [tests/134.phpt] TEST 107/128 [tests/135.phpt] FAIL unpack of template converter: multiple class/variable: (array: object) [tests/135.phpt] TEST 108/128 [tests/136.phpt] FAIL unpack of template converter: multiple class/variable: (array) [tests/136.phpt] TEST 109/128 [tests/137.phpt] FAIL unpack/pack str8 [tests/137.phpt] TEST 110/128 [tests/138.phpt] FAIL unpack bin format family [tests/138.phpt] TEST 111/128 [tests/139.phpt] FAIL Null byte key position while unpacking objects [tests/139.phpt] TEST 112/128 [tests/140.phpt] FAIL Null byte key position while unpacking objects [tests/140.phpt] TEST 113/128 [tests/bug002.phpt] FAIL Bug #2 (Deserializing a large array of nested objects gives "zend_mm_heap corrupted") [tests/bug002.phpt] TEST 114/128 [tests/bug006.phpt] FAIL Bug #6 (bug with incorrect packing of mixed arrays) [tests/bug006.phpt] TEST 115/128 [tests/bug011.phpt] FAIL Bug #011 (Check for segfault with empty array structures) [tests/bug011.phpt] TEST 116/128 [tests/bug012.phpt] FAIL Bug #12 (msgpack_seriallize interfere with php serialize) [tests/bug012.phpt] TEST 117/128 [tests/bug013.phpt] FAIL Bug #13 (ensure that __get/__set aren't called when packing/unpacking) [tests/bug013.phpt] TEST 118/128 [tests/issue023.phpt] FAIL Issue #23 (Empty objects get serialized with incorrect type) [tests/issue023.phpt] TEST 119/128 [tests/issue067.phpt] FAIL Issue #67 (uint64_t) [tests/issue067.phpt] TEST 120/128 [tests/issue080.phpt] FAIL Issue #80 (Serialized failed on unseted value) [tests/issue080.phpt] TEST 121/128 [tests/issue081.phpt] FAIL Issue #81 (Ignore IS_UNDEF) [tests/issue081.phpt] TEST 122/128 [tests/issue083.phpt] FAIL Issue #83 (Arrays and negative index) [tests/issue083.phpt] TEST 123/128 [tests/issue091.phpt] FAIL Issue #91 (private property in base class) [tests/issue091.phpt] TEST 124/128 [tests/issue094.phpt] FAIL Issue #94 (PHP7 segmentation fault with references) [tests/issue094.phpt] TEST 125/128 [tests/issue107.phpt] FAIL Issue #107 ($unpacker->execute() bug) [tests/issue107.phpt] TEST 126/128 [tests/issue132.phpt] FAIL Issue #132 (Segmentation fault when using cloned unpacker) [tests/issue132.phpt] TEST 127/128 [tests/issue137.phpt] FAIL Issue #137 (DateTime(Immutable) serialization doesn't work with php 7.4) [tests/issue137.phpt] TEST 128/128 [tests/issue139.phpt] FAIL Issue #139 (Segmentation fault when using cloned unpacker) [tests/issue139.phpt] ===================================================================== TIME END 2020-07-15 18:33:39 ===================================================================== TEST RESULT SUMMARY --------------------------------------------------------------------- Exts skipped : 0 Exts tested : 12 --------------------------------------------------------------------- Number of tests : 128 128 Tests skipped : 0 ( 0.0%) -------- Tests warned : 0 ( 0.0%) ( 0.0%) Tests failed : 127 ( 99.2%) ( 99.2%) Expected fail : 1 ( 0.8%) ( 0.8%) Tests passed : 0 ( 0.0%) ( 0.0%) --------------------------------------------------------------------- Time taken : 6 seconds ===================================================================== ===================================================================== EXPECTED FAILED TEST SUMMARY --------------------------------------------------------------------- Unserialize invalid random data [tests/034.phpt] XFAIL REASON: REGRESSION ===================================================================== ===================================================================== FAILED TEST SUMMARY --------------------------------------------------------------------- Check for msgpack presence [tests/001.phpt] Check for null serialisation [tests/002.phpt] Check for bool serialisation [tests/003.phpt] Check for integer serialisation [tests/004.phpt] Check for double serialisation [tests/005.phpt] Check for simple string serialization [tests/006.phpt] Check for simple array serialization [tests/007.phpt] Check for array+string serialization [tests/008.phpt] Check for reference serialization [tests/009.phpt] Array test [tests/010.phpt] Object test [tests/012.phpt] Object-Array test [tests/013.phpt] Object-Reference test [tests/014.phpt] Check for serialization handler [tests/015.phpt] Check for serialization handler, ini-directive [tests/015b.phpt] Check for serialization handler, broken [tests/015e.phpt] Object test, __sleep [tests/016.phpt] Object test, __wakeup [tests/017.phpt] Object test, __sleep error cases [tests/018.phpt] Object test, __autoload [tests/019.phpt] Object test, incomplete class [tests/020.phpt] Object Serializable interface [tests/021.phpt] Object test, unserialize_callback_func [tests/022.phpt] Resource [tests/023.phpt] Recursive objects [tests/024.phpt] Object test, array of objects with __sleep [tests/025.phpt] Cyclic array test [tests/026.phpt] Check for serialization handler [tests/027.phpt] Serialize object into session, full set [tests/028.phpt] Msgpack module info [tests/029.phpt] Unserialize invalid data [tests/030.phpt] Object Serializable interface throws exceptions [tests/031.phpt] Object test, __sleep and __wakeup exceptions [tests/032.phpt] Object test, cyclic references [tests/033.phpt] Profiling perf test. [tests/035.phpt] Check for double NaN, Inf, -Inf, 0, and -0 [tests/041.phpt] Closure [tests/042.phpt] Check for array unserialization [tests/050.phpt] Check for buffered streaming unserialization [tests/060.phpt] Check for unbuffered streaming unserialization [tests/061.phpt] Extra bytes buffered streaming unserialization [tests/062.phpt] Extra bytes unbuffered streaming unserialization [tests/063.phpt] Check for buffered streaming unserialization (single) [tests/064.phpt] Check for unbuffered streaming unserialization (single) [tests/065.phpt] Extra bytes buffered streaming unserialization (single) [tests/066.phpt] Extra bytes unbuffered streaming unserialization (single) [tests/067.phpt] Check for alias functions [tests/070.phpt] Check for class methods [tests/071.phpt] Check for class methods unpacker [tests/072.phpt] Check for class unpacker [tests/073.phpt] disabled php only (ini_set) [tests/080.phpt] disabled php only for class methods (ini_set) [tests/081.phpt] disabled php only for class methods unpacker (ini_set) [tests/082.phpt] disabled php only for class unpacker (ini_set) [tests/083.phpt] disabled php only for class methods (constract) [tests/084.phpt] disabled php only for class methods unpacker (constract) [tests/085.phpt] disabled php only for class unpacker (constract) [tests/086.phpt] disabled php only for class methods (set option) [tests/087.phpt] disabled php only for class methods unpacker (set option) [tests/088.phpt] disabled php only for class unpacker (set option) [tests/089.phpt] unpack of object converter (string) [tests/090.phpt] unpack of object converter (object) [tests/091.phpt] unpack of object converter (string: php_only=0) [tests/092.phpt] unpack of object converter (object: php_only=0) [tests/093.phpt] unpack of object converter : class unpack (string) [tests/094.phpt] unpack of object converter : class unpack (object) [tests/095.phpt] unpack of object converter : class unpack (string: php_only=0) [tests/096.phpt] unpack of object converter : class unpack (object: php_only=0) [tests/097.phpt] unpack of object converter: class unpack (string: OPT_PHPONLY=false) [tests/098.phpt] unpack of object converter : class unpacker (string) [tests/099.phpt] unpack of object converter : class unpacker (object) [tests/100.phpt] unpack of object converter : class unpacker (string: php_only=0) [tests/101.phpt] unpack of object converter : class unpacker (object: php_only=0) [tests/102.phpt] unpack of object converter: class unpacker (string: OPT_PHPONLY=false) [tests/103.phpt] unpack of template converter: class unpacker (array: string) [tests/104.phpt] unpack of template converter: class unpacker (array: object) [tests/105.phpt] unpack of template converter: class unpacker (string) [tests/106.phpt] unpack of template converter: class unpacker (object) [tests/107.phpt] unpack of template converter: multiple class: class unpacker (array: string) [tests/108.phpt] unpack of template converter: multiple class: class unpacker (array: object) [tests/109.phpt] unpack of template converter: multiple variable: class unpacker (array: string) [tests/110.phpt] unpack of template converter: multiple variable: class unpacker (array: object) [tests/111.phpt] unpack of template converter: multiple class/variable: class unpacker (array: string) [tests/112.phpt] unpack of template converter: multiple class/variable: class unpacker (array: object) [tests/113.phpt] unpack of template converter: multiple class/variable: class unpacker (array) [tests/114.phpt] unpack of template converter: class unpacker (array: string: OPT_PHPONLY=false) [tests/115.phpt] unpack of template converter: class unpacker (array: object: OPT_PHPONLY=false) [tests/116.phpt] unpack of template converter: class unpacker (string: OPT_PHPONLY=false) [tests/117.phpt] unpack of template converter: class unpacker (object: OPT_PHPONLY=false) [tests/118.phpt] unpack of template converter: multiple class: class unpacker (array: string: OPT_PHPONLY=false) [tests/119.phpt] unpack of template converter: multiple class: class unpacker (array: object: OPT_PHPONLY=false) [tests/120.phpt] unpack of template converter: multiple variable: class unpacker (array: string: OPT_PHPONLY=false) [tests/121.phpt] unpack of template converter: multiple variable: class unpacker (array: object: OPT_PHPONLY=false) [tests/122.phpt] unpack of template converter: multiple class/variable: class unpacker (array: string: OPT_PHPONLY=false) [tests/123.phpt] unpack of template converter: multiple class/variable: class unpacker (array: object: OPT_PHPONLY=false) [tests/124.phpt] unpack of template converter: multiple class/variable: class unpacker (array: OPT_PHPONLY=false) [tests/125.phpt] unpack of template converter (array: string) [tests/126.phpt] unpack of template converter (array: object) [tests/127.phpt] unpack of template converter (string) [tests/128.phpt] unpack of template converter (object) [tests/129.phpt] unpack of template converter: multiple class: (array: string) [tests/130.phpt] unpack of template converter: multiple class: (array: object) [tests/131.phpt] unpack of template converter: multiple variable: (array: string) [tests/132.phpt] unpack of template converter: multiple variable: (array: object) [tests/133.phpt] unpack of template converter: multiple class/variable: (array: string) [tests/134.phpt] unpack of template converter: multiple class/variable: (array: object) [tests/135.phpt] unpack of template converter: multiple class/variable: (array) [tests/136.phpt] unpack/pack str8 [tests/137.phpt] unpack bin format family [tests/138.phpt] Null byte key position while unpacking objects [tests/139.phpt] Null byte key position while unpacking objects [tests/140.phpt] Bug #2 (Deserializing a large array of nested objects gives "zend_mm_heap corrupted") [tests/bug002.phpt] Bug #6 (bug with incorrect packing of mixed arrays) [tests/bug006.phpt] Bug #011 (Check for segfault with empty array structures) [tests/bug011.phpt] Bug #12 (msgpack_seriallize interfere with php serialize) [tests/bug012.phpt] Bug #13 (ensure that __get/__set aren't called when packing/unpacking) [tests/bug013.phpt] Issue #23 (Empty objects get serialized with incorrect type) [tests/issue023.phpt] Issue #67 (uint64_t) [tests/issue067.phpt] Issue #80 (Serialized failed on unseted value) [tests/issue080.phpt] Issue #81 (Ignore IS_UNDEF) [tests/issue081.phpt] Issue #83 (Arrays and negative index) [tests/issue083.phpt] Issue #91 (private property in base class) [tests/issue091.phpt] Issue #94 (PHP7 segmentation fault with references) [tests/issue094.phpt] Issue #107 ($unpacker->execute() bug) [tests/issue107.phpt] Issue #132 (Segmentation fault when using cloned unpacker) [tests/issue132.phpt] Issue #137 (DateTime(Immutable) serialization doesn't work with php 7.4) [tests/issue137.phpt] Issue #139 (Segmentation fault when using cloned unpacker) [tests/issue139.phpt] ===================================================================== make: *** [Makefile:148: test] Error 1 error: Bad exit status from /tmp/B.2Rh5Or/BUILD/tmp/rpm-tmp.45060 (%build) RPM build errors: Bad exit status from /tmp/B.2Rh5Or/BUILD/tmp/rpm-tmp.45060 (%build) ended at: Wed Jul 15 18:33:39 2020, done in 0:00:12.418281 error: No files produced. + chmod -R u+rwX /tmp/B.2Rh5Or/BUILD + rm -rf /tmp/B.2Rh5Or/tmp /tmp/B.2Rh5Or/BUILD + rm -rf /tmp/B.2Rh5Or Begin-PLD-Builder-Info Build-Time: user:17.80s sys:3.14s real:31.33s (faults io:0 non-io:1123192) End-PLD-Builder-Info
[Back to list of logs] [View rpm -qa of builder]