FailedOk

th/SRPMS[OK]
th/x32[OK]
th/i686[OK]
th/x86_64[OK]

ac/SRPMS[OK]
ac/i386[OK]
ac/i586[OK]
ac/i686[OK]
ac/alpha[OK]
ac/amd64[OK]
ac/athlon[OK]
ac/ppc[OK]
ac/sparc[OK]
ac/sparc64[OK]

Advanced Search
main()
Powered by PLD Linux
(c) 2002-2020 PLD Team
$Revision: 1.37 $
Powered by Neo.
Your IP: 18.232.146.10

php-pecl-mysql 8cdb0722-e62f-4233-9bf6-614e96be8e37

Status:Failed
Source URL:https://buildlogs.pld-linux.org/pld/th/x86_64/FAIL/php-pecl-mysql,8cdb0722-e62f-4233-9bf6-614e96be8e37.bz2
text/plain URL:View!
rpm -qa of builder:View!
Date:2020/11/19 15:18:38
Runtime:0:00:04.090171

Toc:

  • error 1
  • rpm: error: Failed build dependencies:
  • error 2
  • rpm: error: Failed build dependencies:
  • prep
  • Executing(%prep): /bin/sh -e /tmp/B.1YCKGR/BUILD/tmp/rpm-tmp.57329
  • build
  • Executing(%build): /bin/sh -e /tmp/B.1YCKGR/BUILD/tmp/rpm-tmp.57329
  • error 3
  • /tmp/B.1YCKGR/BUILD/php80-pecl-mysql-1.0.0/php_mysql.c:2271:7: error: 'zend_fcall_info' {aka 'struct _zend_fcall_info'} has no member named 'no_separation'
  • error 4
  • error: Bad exit status from /tmp/B.1YCKGR/BUILD/tmp/rpm-tmp.57329 (%build)
  • error 5
  • RPM build errors:
  • error 6
  • error: No files produced.

Content:

request from: glen
checking if we should skip the build
started at: Thu Nov 19 15:18:21 2020
killing old processes on a builder
sending signal 9 to pid -1
Killed
cleaning up /tmp
fetching https://srcbuilder.pld-linux.org/th//srpms/8cdb0722-e62f-4233-9bf6-614e96be8e37/php80-pecl-mysql-1.0.0-4.2.d7643af.src.rpm
fetched 71865 bytes, 203.2 K/s
installing srpm: php80-pecl-mysql-1.0.0-4.2.d7643af.src.rpm
+ install -d /tmp/B.1YCKGR/BUILD /tmp/B.1YCKGR/RPMS
+ LC_ALL=en_US.UTF-8
+ rpm -qp --changelog php80-pecl-mysql-1.0.0-4.2.d7643af.src.rpm
* Thu Nov 19 2020 PLD Linux Team <feedback@pld-linux.org>
- For complete changelog see: http://git.pld-linux.org/?p=packages/php-pecl-mysql.git;a=log;h=master
+ rpm -Uhv --nodeps --define '_topdir /tmp/B.1YCKGR' --define '_specdir %{_topdir}' --define '_sourcedir %{_specdir}' --define '_rpmdir %{_topdir}/RPMS' --define '_builddir %{_topdir}/BUILD' --define 'php_suffix 80' php80-pecl-mysql-1.0.0-4.2.d7643af.src.rpm Preparing... ################################################## php80-pecl-mysql ################################################## + rm -f php80-pecl-mysql-1.0.0-4.2.d7643af.src.rpm + install -m 700 -d /tmp/B.1YCKGR/BUILD/tmp + TMPDIR=/tmp/B.1YCKGR/BUILD/tmp + exec nice -n 0 rpmbuild -bp --short-circuit --nodeps --define '_topdir /tmp/B.1YCKGR' --define '_specdir %{_topdir}' --define '_sourcedir %{_specdir}' --define '_rpmdir %{_topdir}/RPMS' --define '_builddir %{_topdir}/BUILD' --target x86_64-pld-linux --define 'php_suffix 80' --define 'prep exit 0' /tmp/B.1YCKGR/php-pecl-mysql.spec Building target platforms: x86_64-pld-linux checking BuildConflict-ing packages no BuildConflicts found checking BR rpm: error: Failed build dependencies: rpm: php80-mysqlnd is needed by php80-pecl-mysql-1.0.0-4.2.d7643af.src rpm: Building target platforms: x86_64-pld-linux updating poldek cache... ready is up to date th is up to date th is up to date th-ready is up to date th-ready is up to date th-test is up to date th-test is up to date checking conflicting packages in BRed packages poldek: Loading [pndir]ready... poldek: Loading [pndir]th-test... poldek: Loading [pndir]th-test... poldek: Loading [pndir]th-ready... poldek: Loading [pndir]th-ready... poldek: Loading [pndir]th... poldek: Loading [pndir]th... poldek: 30337 packages read poldek: Removed 1779 duplicate packages from available set poldek: Processing dependencies... poldek: There are 1 package to install: poldek: A php80-mysqlnd-8.0.0-1.RC5.1.x86_64 poldek: This operation will use 255.3KB of disk space. poldek: Need to get 90.6KB of archives. poldek: Executing pm-command.sh --upgrade -vh --test --root / --define _check_dirname_deps 1... poldek: Preparing... ################################################## no conflicts found checking BR rpm: error: Failed build dependencies: rpm: php80-mysqlnd is needed by php80-pecl-mysql-1.0.0-4.2.d7643af.src rpm: Building target platforms: x86_64-pld-linux installing BR: php80\-mysqlnd + poldek --noask --caplookup -Q -v '--ignore=hhvm-*' '--ignore=php4-*' '--ignore=php52-*' '--ignore=php53-*' '--ignore=php54-*' '--ignore=php55-*' '--ignore=php56-*' '--ignore=php70-*' '--ignore=php71-*' '--ignore=php72-*' '--ignore=php73-*' '--ignore=php74-*' --upgrade php80-mysqlnd Loading [pndir]ready... Loading [pndir]th-test... Loading [pndir]th-test... Loading [pndir]th-ready... Loading [pndir]th-ready... Loading [pndir]th... Loading [pndir]th... 30337 packages read Removed 1779 duplicate packages from available set Processing dependencies... There are 1 package to install: A php80-mysqlnd-8.0.0-1.RC5.1.x86_64 This operation will use 255.3KB of disk space. Need to get 90.6KB of archives. Executing pm-command.sh --upgrade -vh --root / --define _check_dirname_deps 1... Preparing... ################################################## php80-mysqlnd ################################################## building RPM using: set -ex; : build-id: 8cdb0722-e62f-4233-9bf6-614e96be8e37; TMPDIR=/tmp/B.1YCKGR/BUILD/tmp exec nice -n 0 rpmbuild -bb --define '_smp_mflags -j9' --define '_make_opts -Otarget' --define '_pld_builder 1' --define '_topdir /tmp/B.1YCKGR' --define '_specdir %{_topdir}' --define '_sourcedir %{_specdir}' --define '_rpmdir %{_topdir}/RPMS' --define '_builddir %{_topdir}/BUILD' --target x86_64-pld-linux --define 'php_suffix 80' /tmp/B.1YCKGR/php-pecl-mysql.spec + : build-id: 8cdb0722-e62f-4233-9bf6-614e96be8e37 + TMPDIR=/tmp/B.1YCKGR/BUILD/tmp + exec nice -n 0 rpmbuild -bb --define '_smp_mflags -j9' --define '_make_opts -Otarget' --define '_pld_builder 1' --define '_topdir /tmp/B.1YCKGR' --define '_specdir %{_topdir}' --define '_sourcedir %{_specdir}' --define '_rpmdir %{_topdir}/RPMS' --define '_builddir %{_topdir}/BUILD' --target x86_64-pld-linux --define 'php_suffix 80' /tmp/B.1YCKGR/php-pecl-mysql.spec Building target platforms: x86_64-pld-linux Executing(%prep): /bin/sh -e /tmp/B.1YCKGR/BUILD/tmp/rpm-tmp.57329 + umask 022 + cd /tmp/B.1YCKGR/BUILD + cd /tmp/B.1YCKGR/BUILD + rm -rf php80-pecl-mysql-1.0.0 + /bin/mkdir -p php80-pecl-mysql-1.0.0 + cd php80-pecl-mysql-1.0.0 + /bin/gzip -dc /tmp/B.1YCKGR/php-pecl-mysql-1.0.0-d7643af.tar.gz + /bin/tar -xf - + STATUS=0 + '[' 0 -ne 0 ']' + /bin/id -u + '[' 1000 '=' 0 ']' + /bin/id -u + '[' 1000 '=' 0 ']' + /bin/chmod -Rf a+rX,u+w,g-w,o-w . + mv mysql-d7643af/CREDITS mysql-d7643af/LICENSE mysql-d7643af/README.md mysql-d7643af/config.m4 mysql-d7643af/config.w32 mysql-d7643af/mysql.mak mysql-d7643af/mysql_mysqlnd.h mysql-d7643af/package.xml mysql-d7643af/php_mysql.c mysql-d7643af/php_mysql.h mysql-d7643af/php_mysql_structs.h mysql-d7643af/tests . + echo 'Patch #0 (revert-deprecate-ext-mysql.patch):' Patch #0 (revert-deprecate-ext-mysql.patch): + '[' -f /tmp/B.1YCKGR/revert-deprecate-ext-mysql.patch ']' + /bin/cat /tmp/B.1YCKGR/revert-deprecate-ext-mysql.patch + /usr/bin/patch -s -p1 + exit 0 Executing(%build): /bin/sh -e /tmp/B.1YCKGR/BUILD/tmp/rpm-tmp.57329 TMP=/home/users/builder/tmp HOME=/home/users/builder PATH=/home/users/builder/GNUstep/Tools:/bin:/usr/bin:/usr/local/bin:/home/users/builder/bin TMPDIR=/tmp/B.1YCKGR/BUILD/tmp + umask 022 + cd /tmp/B.1YCKGR/BUILD + cd php80-pecl-mysql-1.0.0 + phpize Configuring for: PHP Api Version: 20200930 Zend Module Api No: 20200930 Zend Extension Api No: 420200930 + ./configure 'LDFLAGS=-Wl,--as-needed -Wl,--no-copy-dt-needed-entries -Wl,-z,relro -Wl,-z,combreloc ' 'CFLAGS=-O2 -fwrapv -pipe -Wformat -Werror=format-security -gdwarf-4 -fno-debug-types-section -fvar-tracking-assignments -g2 -Wp,-D_FORTIFY_SOURCE=2 -fstack-protector-strong --param=ssp-buffer-size=4 -Werror=trampolines -fPIC -march=x86-64 -gdwarf-4 -fno-debug-types-section -fvar-tracking-assignments -g2 ' 'CXXFLAGS=-O2 -fwrapv -pipe -Wformat -Werror=format-security -gdwarf-4 -fno-debug-types-section -fvar-tracking-assignments -g2 -Wp,-D_FORTIFY_SOURCE=2 -fstack-protector-strong --param=ssp-buffer-size=4 -Werror=trampolines -fPIC -march=x86-64 -gdwarf-4 -fno-debug-types-section -fvar-tracking-assignments -g2 ' 'FFLAGS=-O2 -fwrapv -pipe -Wformat -Werror=format-security -gdwarf-4 -fno-debug-types-section -fvar-tracking-assignments -g2 -Wp,-D_FORTIFY_SOURCE=2 -fstack-protector-strong --param=ssp-buffer-size=4 -Werror=trampolines -fPIC -march=x86-64 -gdwarf-4 -fno-debug-types-section -fvar-tracking-assignments -g2 ' 'FCFLAGS=-O2 -fwrapv -pipe -Wformat -Werror=format-security -gdwarf-4 -fno-debug-types-section -fvar-tracking-assignments -g2 -Wp,-D_FORTIFY_SOURCE=2 -fstack-protector-strong --param=ssp-buffer-size=4 -Werror=trampolines -fPIC -march=x86-64 -gdwarf-4 -fno-debug-types-section -fvar-tracking-assignments -g2 ' 'CPPFLAGS=' 'CC=x86_64-pld-linux-gcc' 'CXX=x86_64-pld-linux-g++' '--host=x86_64-pld-linux' '--build=x86_64-pld-linux' '--prefix=/usr' '--exec-prefix=/usr' '--bindir=/usr/bin' '--sbindir=/usr/sbin' '--sysconfdir=/etc' '--datadir=/usr/share' '--includedir=/usr/include' '--libdir=/usr/lib64' '--libexecdir=/usr/libexec' '--localstatedir=/var' '--sharedstatedir=/var/lib' '--mandir=/usr/share/man' '--infodir=/usr/share/info' '--x-libraries=/usr/lib64' '--with-mysql=shared,mysqlnd' '--with-mysql-sock=/var/lib/mysql/mysql.sock' '--with-zlib-dir=shared,/usr' checking for grep that handles long lines and -e... /bin/grep checking for egrep... /bin/grep -E checking for a sed that does not truncate output... /bin/sed checking for x86_64-pld-linux-pkg-config... no checking for pkg-config... /usr/bin/pkg-config checking pkg-config is at least version 0.9.0... yes checking for x86_64-pld-linux-cc... x86_64-pld-linux-gcc checking whether the C compiler works... yes checking for C compiler default output file name... a.out checking for suffix of executables... checking whether we are cross compiling... no checking for suffix of object files... o checking whether we are using the GNU C compiler... yes checking whether x86_64-pld-linux-gcc accepts -g... yes checking for x86_64-pld-linux-gcc option to accept ISO C89... none needed checking how to run the C preprocessor... x86_64-pld-linux-gcc -E checking for icc... no checking for suncc... no checking for system library directory... lib checking if compiler supports -R... no checking if compiler supports -Wl,-rpath,... yes checking build system type... x86_64-pld-linux-gnu checking host system type... x86_64-pld-linux-gnu checking target system type... x86_64-pld-linux-gnu checking for PHP prefix... /usr checking for PHP includes... -I/usr/include/php -I/usr/include/php/main -I/usr/include/php/TSRM -I/usr/include/php/Zend -I/usr/include/php/ext -I/usr/include/php/ext/date/lib checking for PHP extension directory... /usr/lib64/php80 checking for PHP installed headers prefix... /usr/include/php checking if debug is enabled... no checking if zts is enabled... no checking for gawk... gawk checking for MySQL support... yes, shared checking for specified location of the MySQL UNIX socket... /var/lib/mysql/mysql.sock checking for the location of libz... shared,/usr checking for MySQL UNIX socket location... /var/lib/mysql/mysql.sock checking how to print strings... print -r checking for a sed that does not truncate output... (cached) /bin/sed checking for fgrep... /bin/grep -F checking for ld used by x86_64-pld-linux-gcc... /usr/bin/ld checking if the linker (/usr/bin/ld) is GNU ld... yes checking for BSD- or MS-compatible name lister (nm)... /usr/bin/nm -B checking the name lister (/usr/bin/nm -B) interface... BSD nm checking whether ln -s works... yes checking the maximum length of command line arguments... 1572864 checking how to convert x86_64-pld-linux-gnu file names to x86_64-pld-linux-gnu format... func_convert_file_noop checking how to convert x86_64-pld-linux-gnu file names to toolchain format... func_convert_file_noop checking for /usr/bin/ld option to reload object files... -r checking for x86_64-pld-linux-objdump... no checking for objdump... objdump checking how to recognize dependent libraries... pass_all checking for x86_64-pld-linux-dlltool... no checking for dlltool... no checking how to associate runtime and link libraries... print -r -- checking for x86_64-pld-linux-ar... no checking for ar... ar checking for archiver @FILE support... @ checking for x86_64-pld-linux-strip... no checking for strip... strip checking for x86_64-pld-linux-ranlib... no checking for ranlib... ranlib checking for mawk... (cached) gawk checking command to parse /usr/bin/nm -B output from x86_64-pld-linux-gcc object... ok checking for sysroot... no checking for a working dd... /bin/dd checking how to truncate binary pipes... /bin/dd bs=4096 count=1 checking for x86_64-pld-linux-mt... no checking for mt... no checking if : is a manifest tool... no checking for ANSI C header files... yes checking for sys/types.h... yes checking for sys/stat.h... yes checking for stdlib.h... yes checking for string.h... yes checking for memory.h... yes checking for strings.h... yes checking for inttypes.h... yes checking for stdint.h... yes checking for unistd.h... yes checking for dlfcn.h... yes checking for objdir... .libs checking if x86_64-pld-linux-gcc supports -fno-rtti -fno-exceptions... no checking for x86_64-pld-linux-gcc option to produce PIC... -fPIC -DPIC checking if x86_64-pld-linux-gcc PIC flag -fPIC -DPIC works... yes checking if x86_64-pld-linux-gcc static flag -static works... yes checking if x86_64-pld-linux-gcc supports -c -o file.o... yes checking if x86_64-pld-linux-gcc supports -c -o file.o... (cached) yes checking whether the x86_64-pld-linux-gcc linker (/usr/bin/ld -m elf_x86_64) supports shared libraries... yes checking whether -lc should be explicitly linked in... no checking dynamic linker characteristics... GNU/Linux ld.so checking how to hardcode library paths into programs... immediate checking whether stripping libraries is possible... yes checking if libtool supports shared libraries... yes checking whether to build shared libraries... yes checking whether to build static libraries... no configure: patching config.h.in configure: creating ./config.status config.status: creating config.h config.status: executing libtool commands + /usr/bin/make -Otarget -j9 /bin/sh /tmp/B.1YCKGR/BUILD/php80-pecl-mysql-1.0.0/libtool --mode=compile x86_64-pld-linux-gcc -I. -I/tmp/B.1YCKGR/BUILD/php80-pecl-mysql-1.0.0 -I/tmp/B.1YCKGR/BUILD/php80-pecl-mysql-1.0.0/include -I/tmp/B.1YCKGR/BUILD/php80-pecl-mysql-1.0.0/main -I/tmp/B.1YCKGR/BUILD/php80-pecl-mysql-1.0.0 -I/usr/include/php -I/usr/include/php/main -I/usr/include/php/TSRM -I/usr/include/php/Zend -I/usr/include/php/ext -I/usr/include/php/ext/date/lib -DHAVE_CONFIG_H -O2 -fwrapv -pipe -Wformat -Werror=format-security -gdwarf-4 -fno-debug-types-section -fvar-tracking-assignments -g2 -Wp,-D_FORTIFY_SOURCE=2 -fstack-protector-strong --param=ssp-buffer-size=4 -Werror=trampolines -fPIC -march=x86-64 -gdwarf-4 -fno-debug-types-section -fvar-tracking-assignments -g2 -DZEND_ENABLE_STATIC_TSRMLS_CACHE=1 -c /tmp/B.1YCKGR/BUILD/php80-pecl-mysql-1.0.0/php_mysql.c -o php_mysql.lo libtool: compile: x86_64-pld-linux-gcc -I. -I/tmp/B.1YCKGR/BUILD/php80-pecl-mysql-1.0.0 -I/tmp/B.1YCKGR/BUILD/php80-pecl-mysql-1.0.0/include -I/tmp/B.1YCKGR/BUILD/php80-pecl-mysql-1.0.0/main -I/tmp/B.1YCKGR/BUILD/php80-pecl-mysql-1.0.0 -I/usr/include/php -I/usr/include/php/main -I/usr/include/php/TSRM -I/usr/include/php/Zend -I/usr/include/php/ext -I/usr/include/php/ext/date/lib -DHAVE_CONFIG_H -O2 -fwrapv -pipe -Wformat -Werror=format-security -gdwarf-4 -fno-debug-types-section -fvar-tracking-assignments -g2 -Wp,-D_FORTIFY_SOURCE=2 -fstack-protector-strong --param=ssp-buffer-size=4 -Werror=trampolines -fPIC -march=x86-64 -gdwarf-4 -fno-debug-types-section -fvar-tracking-assignments -g2 -DZEND_ENABLE_STATIC_TSRMLS_CACHE=1 -c /tmp/B.1YCKGR/BUILD/php80-pecl-mysql-1.0.0/php_mysql.c -fPIC -DPIC -o .libs/php_mysql.o /tmp/B.1YCKGR/BUILD/php80-pecl-mysql-1.0.0/php_mysql.c: In function 'php_mysql_fetch_hash': /tmp/B.1YCKGR/BUILD/php80-pecl-mysql-1.0.0/php_mysql.c:2271:7: error: 'zend_fcall_info' {aka 'struct _zend_fcall_info'} has no member named 'no_separation' 2271 | fci.no_separation = 1; | ^ make: *** [Makefile:228: php_mysql.lo] Error 1 error: Bad exit status from /tmp/B.1YCKGR/BUILD/tmp/rpm-tmp.57329 (%build) RPM build errors: Bad exit status from /tmp/B.1YCKGR/BUILD/tmp/rpm-tmp.57329 (%build) ended at: Thu Nov 19 15:18:38 2020, done in 0:00:04.090171 error: No files produced. + chmod -R u+rwX /tmp/B.1YCKGR/BUILD + rm -rf /tmp/B.1YCKGR/tmp /tmp/B.1YCKGR/BUILD + rm -rf /tmp/B.1YCKGR Begin-PLD-Builder-Info Build-Time: user:11.89s sys:2.86s real:17.05s (faults io:46395 non-io:704912) End-PLD-Builder-Info
[Back to list of logs] [View rpm -qa of builder]