FailedOk

th/SRPMS[OK]
th/x32[OK]
th/i686[OK]
th/x86_64[OK]

ac/SRPMS[OK]
ac/i386[OK]
ac/i586[OK]
ac/i686[OK]
ac/alpha[OK]
ac/amd64[OK]
ac/athlon[OK]
ac/ppc[OK]
ac/sparc[OK]
ac/sparc64[OK]

Advanced Search
main()
Powered by PLD Linux
(c) 2002-2018 PLD Team
$Revision: 1.37 $
Powered by VAX.
Your IP: 3.80.177.176

php-pecl-propro afa135ce-698f-4fca-ad7f-2ccc0c5e760f

Status:Failed
Source URL:ftp://buildlogs.pld-linux.org/th/x86_64/FAIL/php-pecl-propro,afa135ce-698f-4fca-ad7f-2ccc0c5e760f.bz2
text/plain URL:View!
rpm -qa of builder:View!
Date:2018/10/11 18:48:41
Runtime:0:00:04.800040

Toc:

  • error 1
  • rpm: error: Failed build dependencies:
  • error 2
  • rpm: error: Failed build dependencies:
  • prep
  • Executing(%prep): /bin/sh -e /tmp/B.VdlWi5/BUILD/tmp/rpm-tmp.53626
  • build
  • Executing(%build): /bin/sh -e /tmp/B.VdlWi5/BUILD/tmp/rpm-tmp.53626
  • error 3
  • /tmp/B.VdlWi5/BUILD/php53-pecl-propro-2.1.0/src/php_propro_api.h:27:2: error: unknown type name 'zend_string'
  • error 4
  • /tmp/B.VdlWi5/BUILD/php53-pecl-propro-2.1.0/src/php_propro_api.h:89:3: error: unknown type name 'zend_string'; did you mean 'zend_stream'?
  • error 5
  • /tmp/B.VdlWi5/BUILD/php53-pecl-propro-2.1.0/src/php_propro_api.c:30:8: error: unknown type name 'ZEND_RESULT_CODE'
  • error 6
  • /tmp/B.VdlWi5/BUILD/php53-pecl-propro-2.1.0/src/php_propro_api.c:162:64: error: unknown type name 'zend_string'; did you mean 'zend_stream'?
  • error 7
  • /tmp/B.VdlWi5/BUILD/php53-pecl-propro-2.1.0/src/php_propro_api.c:227:50: error: 'zend_class_entry' {aka 'struct _zend_class_entry'} has no member named 'default_properties_count'; did you mean 'default_properties'?
  • error 8
  • /tmp/B.VdlWi5/BUILD/php53-pecl-propro-2.1.0/src/php_propro_api.c:232:7: error: 'zend_object' {aka 'struct _zend_object'} has no member named 'handlers'
  • error 9
  • ./php_propro.h:33:54: error: 'zend_object' {aka 'struct _zend_object'} has no member named 'handlers'
  • error 10
  • ./php_propro.h:33:54: error: invalid type argument of '->' (have 'int')
  • error 11
  • /tmp/B.VdlWi5/BUILD/php53-pecl-propro-2.1.0/src/php_propro_api.c:299:8: error: unknown type name 'ZEND_RESULT_CODE'
  • error 12
  • /usr/include/php/Zend/zend_API.h:575:18: error: lvalue required as unary '&' operand
  • error 13
  • /usr/include/php/Zend/zend_operators.h:436:35: error: invalid type argument of unary '*' (have 'zval' {aka 'struct _zval_struct'})
  • error 14
  • /usr/include/php/Zend/zend.h:694:20: error: incompatible type for argument 1 of 'zval_isref_p'
  • error 15
  • /usr/include/php/Zend/zend.h:681:20: error: incompatible types when initializing type 'zval *' {aka 'struct _zval_struct *'} using type 'zval' {aka 'struct _zval_struct'}
  • error 16
  • /usr/include/php/Zend/zend_gc.h:206:7: error: incompatible types when assigning to type 'zval' {aka 'struct _zval_struct'} from type 'zval *' {aka 'struct _zval_struct *'}
  • error 17
  • /tmp/B.VdlWi5/BUILD/php53-pecl-propro-2.1.0/src/php_propro_api.c:310:3: error: cannot convert to a pointer type
  • error 18
  • /usr/include/php/Zend/zend.h:686:4: error: invalid type argument of unary '*' (have 'zval' {aka 'struct _zval_struct'})
  • error 19
  • /usr/include/php/Zend/zend.h:687:19: error: incompatible type for argument 1 of '_zval_copy_ctor'
  • error 20
  • /usr/include/php/Zend/zend.h:325:53: error: incompatible type for argument 1 of 'zval_set_refcount_p'
  • error 21
  • /usr/include/php/Zend/zend.h:330:48: error: incompatible type for argument 1 of 'zval_unset_isref_p'
  • error 22
  • /usr/include/php/Zend/zend_operators.h:369:28: error: incompatible type for argument 1 of 'convert_to_null'
  • error 23
  • /usr/include/php/Zend/zend_operators.h:369:28: error: incompatible type for argument 1 of 'convert_to_long'
  • error 24
  • /usr/include/php/Zend/zend_operators.h:369:28: error: incompatible type for argument 1 of 'convert_to_double'
  • error 25
  • /usr/include/php/Zend/zend_operators.h:369:28: error: incompatible type for argument 1 of 'convert_to_boolean'
  • error 26
  • /usr/include/php/Zend/zend_operators.h:369:28: error: incompatible type for argument 1 of 'convert_to_array'
  • error 27
  • /usr/include/php/Zend/zend_operators.h:369:28: error: incompatible type for argument 1 of 'convert_to_object'
  • error 28
  • /usr/include/php/Zend/zend_operators.h:294:39: error: invalid type argument of '->' (have 'zval' {aka 'struct _zval_struct'})
  • error 29
  • /usr/include/php/Zend/zend_operators.h:369:28: error: incompatible type for argument 1 of '_convert_to_string'
  • error 30
  • /usr/include/php/Zend/zend_API.h:575:18: error: lvalue required as unary '&' operand
  • error 31
  • /tmp/B.VdlWi5/BUILD/php53-pecl-propro-2.1.0/src/php_propro_api.c:360:58: error: unknown type name 'zend_string'; did you mean 'zend_stream'?
  • error 32
  • /tmp/B.VdlWi5/BUILD/php53-pecl-propro-2.1.0/src/php_propro_api.c:402:7: error: 'IS_UNDEF' undeclared (first use in this function); did you mean 'IS_UNUSED'?
  • error 33
  • /usr/include/php/Zend/zend.h:681:20: error: incompatible types when initializing type 'zval *' {aka 'struct _zval_struct *'} using type 'zval' {aka 'struct _zval_struct'}
  • error 34
  • /usr/include/php/Zend/zend_gc.h:206:7: error: incompatible types when assigning to type 'zval' {aka 'struct _zval_struct'} from type 'zval *' {aka 'struct _zval_struct *'}
  • error 35
  • /tmp/B.VdlWi5/BUILD/php53-pecl-propro-2.1.0/src/php_propro_api.c:407:3: error: cannot convert to a pointer type
  • error 36
  • /usr/include/php/Zend/zend.h:686:4: error: invalid type argument of unary '*' (have 'zval' {aka 'struct _zval_struct'})
  • error 37
  • /usr/include/php/Zend/zend.h:687:19: error: incompatible type for argument 1 of '_zval_copy_ctor'
  • error 38
  • /usr/include/php/Zend/zend.h:325:53: error: incompatible type for argument 1 of 'zval_set_refcount_p'
  • error 39
  • /usr/include/php/Zend/zend.h:330:48: error: incompatible type for argument 1 of 'zval_unset_isref_p'
  • error 40
  • /tmp/B.VdlWi5/BUILD/php53-pecl-propro-2.1.0/src/php_propro_api.c:416:58: error: unknown type name 'zend_string'; did you mean 'zend_stream'?
  • error 41
  • /tmp/B.VdlWi5/BUILD/php53-pecl-propro-2.1.0/src/php_propro_api.c:430:68: error: macro "zend_hash_next_index_insert" requires 4 arguments, but only 2 given
  • error 42
  • /tmp/B.VdlWi5/BUILD/php53-pecl-propro-2.1.0/src/php_propro_api.c:493:2: error: unknown type name 'zend_string'; did you mean 'zend_stream'?
  • error 43
  • /usr/include/php/Zend/zend_API.h:567:10: error: invalid type argument of unary '*' (have 'int')
  • error 44
  • /usr/include/php/Zend/zend_operators.h:435:33: error: invalid type argument of unary '*' (have 'int')
  • error 45
  • /usr/include/php/Zend/zend_API.h:575:18: error: lvalue required as unary '&' operand
  • error 46
  • /tmp/B.VdlWi5/BUILD/php53-pecl-propro-2.1.0/src/php_propro_api.c:556:3: error: unknown type name 'zend_string'; did you mean 'zend_stream'?
  • error 47
  • /tmp/B.VdlWi5/BUILD/php53-pecl-propro-2.1.0/src/php_propro_api.c:560:19: error: too few arguments to function 'zend_symtable_find'
  • error 48
  • /tmp/B.VdlWi5/BUILD/php53-pecl-propro-2.1.0/src/php_propro_api.c:582:2: error: unknown type name 'zend_string'; did you mean 'zend_stream'?
  • error 49
  • /tmp/B.VdlWi5/BUILD/php53-pecl-propro-2.1.0/src/php_propro_api.c:617:3: error: unknown type name 'zend_string'; did you mean 'zend_stream'?
  • error 50
  • /tmp/B.VdlWi5/BUILD/php53-pecl-propro-2.1.0/src/php_propro_api.c:620:3: error: too few arguments to function 'zend_symtable_del'
  • error 51
  • /tmp/B.VdlWi5/BUILD/php53-pecl-propro-2.1.0/src/php_propro_api.c:638:2: error: unknown type name 'zend_string'; did you mean 'zend_stream'?
  • error 52
  • /tmp/B.VdlWi5/BUILD/php53-pecl-propro-2.1.0/src/php_propro_api.c:678:37: error: 'zend_object_handlers' {aka 'struct _zend_object_handlers'} has no member named 'offset'; did you mean 'set'?
  • error 53
  • /tmp/B.VdlWi5/BUILD/php53-pecl-propro-2.1.0/src/php_propro_api.c:679:37: error: 'zend_object_handlers' {aka 'struct _zend_object_handlers'} has no member named 'free_obj'; did you mean 'clone_obj'?
  • error 54
  • /tmp/B.VdlWi5/BUILD/php53-pecl-propro-2.1.0/src/php_propro_api.c:680:37: error: 'zend_object_handlers' {aka 'struct _zend_object_handlers'} has no member named 'get_gc'; did you mean 'get'?
  • error 55
  • error: Bad exit status from /tmp/B.VdlWi5/BUILD/tmp/rpm-tmp.53626 (%build)
  • error 56
  • RPM build errors:
  • error 57
  • error: No files produced.

Content:

request from: adamg
checking if we should skip the build
started at: Thu Oct 11 18:48:13 2018
killing old processes on a builder
mesg: ttyname failed: Inappropriate ioctl for device
sending signal 9 to pid -1
Killed
cleaning up /tmp
mesg: ttyname failed: Inappropriate ioctl for device
fetching https://srcbuilder.pld-linux.org/th//srpms/afa135ce-698f-4fca-ad7f-2ccc0c5e760f/php53-pecl-propro-2.1.0-1.src.rpm
fetched 24970 bytes, 66.2 K/s
installing srpm: php53-pecl-propro-2.1.0-1.src.rpm
mesg: ttyname failed: Inappropriate ioctl for device
+ install -d /tmp/B.VdlWi5/BUILD /tmp/B.VdlWi5/RPMS
+ LC_ALL=en_US.UTF-8
+ rpm -qp --changelog php53-pecl-propro-2.1.0-1.src.rpm
* Thu Oct 11 2018 PLD Linux Team <feedback@pld-linux.org>
- For complete changelog see: http://git.pld-linux.org/?p=packages/php-pecl-propro.git;a=log;h=auto/th/php-pecl-propro-2.1.0-1
* Mon Oct 08 2018 Adam Gołębiowski <adamg@pld-linux.org> 4dd19ff
- updated to 2.1.0 + rpm -Uhv --nodeps --define '_topdir /tmp/B.VdlWi5' --define '_specdir %{_topdir}' --define '_sourcedir %{_specdir}' --define '_rpmdir %{_topdir}/RPMS' --define '_builddir %{_topdir}/BUILD' --define 'php_suffix 53' php53-pecl-propro-2.1.0-1.src.rpm Preparing... ################################################## php53-pecl-propro ################################################## + rm -f php53-pecl-propro-2.1.0-1.src.rpm mesg: ttyname failed: Inappropriate ioctl for device + install -m 700 -d /tmp/B.VdlWi5/BUILD/tmp mesg: ttyname failed: Inappropriate ioctl for device + TMPDIR=/tmp/B.VdlWi5/BUILD/tmp + exec nice -n 0 rpmbuild -bp --short-circuit --nodeps --define '_topdir /tmp/B.VdlWi5' --define '_specdir %{_topdir}' --define '_sourcedir %{_specdir}' --define '_rpmdir %{_topdir}/RPMS' --define '_builddir %{_topdir}/BUILD' --target x86_64-pld-linux --define 'php_suffix 53' --define 'prep exit 0' /tmp/B.VdlWi5/php-pecl-propro.spec Building target platforms: x86_64-pld-linux checking BuildConflict-ing packages no BuildConflicts found checking BR rpm: error: Failed build dependencies: rpm: php53-devel >= 3:5.3.0 is needed by php53-pecl-propro-2.1.0-1.src rpm: Building target platforms: x86_64-pld-linux updating poldek cache... ready is up to date Retrieving th::packages.ndir.md... th is up to date Retrieving th::packages.ndir.md... th is up to date Retrieving th-ready::packages.ndir.md... th-ready is up to date Retrieving th-ready::packages.ndir.md... th-ready is up to date Retrieving th-test::packages.ndir.md... th-test is up to date Retrieving th-test::packages.ndir.md... Retrieving th-test::packages.ndir.diff.toc.gz... ..............................done Retrieving diff::packages.ndir.2018.10.11-16.47.01.gz... Retrieving diff::packages.ndir.dscr.2018.10.11-16.47.01.gz... Loading [pndir]th-test... Applying packages.ndir.2018.10.11-16.47.01.gz... Writing /root/.poldek-cache/[...]/packages.ndir.gz... checking conflicting packages in BRed packages poldek: Loading [pndir]ready... poldek: Loading [pndir]th-test... poldek: Loading [pndir]th-test... poldek: Loading [pndir]th-ready... poldek: Loading [pndir]th-ready... poldek: Loading [pndir]th... poldek: Loading [pndir]th... poldek: 32184 packages read poldek: Removed 5045 duplicate packages from available set poldek: Processing dependencies... poldek: php53-devel-5.3.29-43.x86_64 marks php53-common-5.3.29-43.x86_64 (cap /usr/lib64/php53) poldek: php53-devel-5.3.29-43.x86_64 marks php53-embedded-5.3.29-43.x86_64 (cap php53-embedded = 4:5.3.29-43) poldek: There are 3 packages to install (2 marked by dependencies): poldek: I php53-devel-5.3.29-43.x86_64 poldek: D php53-common-5.3.29-43.x86_64 php53-embedded-5.3.29-43.x86_64 poldek: This operation will use 5.6MB of disk space. poldek: Need to get 1.4MB of archives (1.4MB to download). poldek: poldek: Retrieving [1/3] th-test::php53-common-5.3.29-43.x86_64.rpm... poldek: ..............................done poldek: Retrieving [2/3] th-test::php53-embedded-5.3.29-43.x86_64.rpm... poldek: ..............................done poldek: Retrieving [3/3] th-test::php53-devel-5.3.29-43.x86_64.rpm... poldek: ..............................done poldek: Executing pm-command.sh --upgrade -vh --test --root / --define _check_dirname_deps 1... poldek: Preparing... ################################################## no conflicts found checking BR rpm: error: Failed build dependencies: rpm: php53-devel >= 3:5.3.0 is needed by php53-pecl-propro-2.1.0-1.src rpm: Building target platforms: x86_64-pld-linux installing BR: php53\-devel + poldek --noask --caplookup -Q -v '--ignore=hhvm-*' '--ignore=php4-*' '--ignore=php52-*' '--ignore=php54-*' '--ignore=php55-*' '--ignore=php56-*' '--ignore=php70-*' '--ignore=php71-*' '--ignore=php72-*' '--ignore=php73-*' --upgrade php53-devel Loading [pndir]ready... Loading [pndir]th-test... Loading [pndir]th-test... Loading [pndir]th-ready... Loading [pndir]th-ready... Loading [pndir]th... Loading [pndir]th... 32184 packages read Removed 5045 duplicate packages from available set Processing dependencies... php53-devel-5.3.29-43.x86_64 marks php53-common-5.3.29-43.x86_64 (cap /usr/lib64/php53) php53-devel-5.3.29-43.x86_64 marks php53-embedded-5.3.29-43.x86_64 (cap php53-embedded = 4:5.3.29-43) There are 3 packages to install (2 marked by dependencies): I php53-devel-5.3.29-43.x86_64 D php53-common-5.3.29-43.x86_64 php53-embedded-5.3.29-43.x86_64 This operation will use 5.6MB of disk space. Need to get 1.4MB of archives. Executing pm-command.sh --upgrade -vh --root / --define _check_dirname_deps 1... Preparing... ################################################## php53-common ################################################## php53-embedded ################################################## php53-devel ################################################## building RPM using: set -ex; : build-id: afa135ce-698f-4fca-ad7f-2ccc0c5e760f; TMPDIR=/tmp/B.VdlWi5/BUILD/tmp exec nice -n 0 rpmbuild -bb --define '_smp_mflags -j9' --define '_make_opts -Otarget' --define '_pld_builder 1' --define '_topdir /tmp/B.VdlWi5' --define '_specdir %{_topdir}' --define '_sourcedir %{_specdir}' --define '_rpmdir %{_topdir}/RPMS' --define '_builddir %{_topdir}/BUILD' --target x86_64-pld-linux --define 'php_suffix 53' /tmp/B.VdlWi5/php-pecl-propro.spec mesg: ttyname failed: Inappropriate ioctl for device + : build-id: afa135ce-698f-4fca-ad7f-2ccc0c5e760f + TMPDIR=/tmp/B.VdlWi5/BUILD/tmp + exec nice -n 0 rpmbuild -bb --define '_smp_mflags -j9' --define '_make_opts -Otarget' --define '_pld_builder 1' --define '_topdir /tmp/B.VdlWi5' --define '_specdir %{_topdir}' --define '_sourcedir %{_specdir}' --define '_rpmdir %{_topdir}/RPMS' --define '_builddir %{_topdir}/BUILD' --target x86_64-pld-linux --define 'php_suffix 53' /tmp/B.VdlWi5/php-pecl-propro.spec Building target platforms: x86_64-pld-linux Executing(%prep): /bin/sh -e /tmp/B.VdlWi5/BUILD/tmp/rpm-tmp.53626 + umask 022 + cd /tmp/B.VdlWi5/BUILD + cd /tmp/B.VdlWi5/BUILD + rm -rf php53-pecl-propro-2.1.0 + /bin/mkdir -p php53-pecl-propro-2.1.0 + cd php53-pecl-propro-2.1.0 + /usr/bin/gzip -dc /tmp/B.VdlWi5/propro-2.1.0.tgz + /bin/tar -xf - + STATUS=0 + '[' 0 -ne 0 ']' + /bin/id -u + '[' 1000 '=' 0 ']' + /bin/id -u + '[' 1000 '=' 0 ']' + /bin/chmod -Rf a+rX,u+w,g-w,o-w . + mv propro-2.1.0/AUTHORS propro-2.1.0/BUGS propro-2.1.0/CONTRIBUTING.md propro-2.1.0/CREDITS propro-2.1.0/Doxyfile propro-2.1.0/LICENSE propro-2.1.0/Makefile.frag propro-2.1.0/README.md propro-2.1.0/THANKS propro-2.1.0/TODO propro-2.1.0/config.m4 propro-2.1.0/config.w32 propro-2.1.0/config0.m4 propro-2.1.0/php_propro.h propro-2.1.0/scripts propro-2.1.0/src propro-2.1.0/tests . + exit 0 Executing(%build): /bin/sh -e /tmp/B.VdlWi5/BUILD/tmp/rpm-tmp.53626 TMP=/home/users/builder/tmp HOME=/home/users/builder PATH=/home/users/builder/GNUstep/Tools:/usr/local/bin:/usr/bin:/bin:/home/users/builder/bin TMPDIR=/tmp/B.VdlWi5/BUILD/tmp + umask 022 + cd /tmp/B.VdlWi5/BUILD + cd php53-pecl-propro-2.1.0 + phpize Configuring for: PHP Api Version: 20090626 Zend Module Api No: 20090626 Zend Extension Api No: 220090626 configure.in:3: warning: prefer named diversions configure.in:3: warning: prefer named diversions + libtoolize --copy --force --install libtoolize: putting auxiliary files in '.'. libtoolize: copying file './config.guess' libtoolize: copying file './config.sub' libtoolize: copying file './install-sh' libtoolize: copying file './ltmain.sh' libtoolize: Consider adding 'AC_CONFIG_MACRO_DIRS([m4])' to configure.in, libtoolize: and rerunning libtoolize and aclocal. libtoolize: Consider adding '-I m4' to ACLOCAL_AMFLAGS in Makefile.am. + ./configure 'LDFLAGS=-Wl,--as-needed -Wl,--no-copy-dt-needed-entries -Wl,-z,relro -Wl,-z,combreloc ' 'CFLAGS=-O2 -fwrapv -pipe -Wformat -Werror=format-security -gdwarf-4 -fno-debug-types-section -fvar-tracking-assignments -g2 -Wp,-D_FORTIFY_SOURCE=2 -fstack-protector-strong --param=ssp-buffer-size=4 -fPIC -march=x86-64 -gdwarf-4 -fno-debug-types-section -fvar-tracking-assignments -g2 ' 'CXXFLAGS=-O2 -fwrapv -pipe -Wformat -Werror=format-security -gdwarf-4 -fno-debug-types-section -fvar-tracking-assignments -g2 -Wp,-D_FORTIFY_SOURCE=2 -fstack-protector-strong --param=ssp-buffer-size=4 -fPIC -march=x86-64 -gdwarf-4 -fno-debug-types-section -fvar-tracking-assignments -g2 ' 'FFLAGS=-O2 -fwrapv -pipe -Wformat -Werror=format-security -gdwarf-4 -fno-debug-types-section -fvar-tracking-assignments -g2 -Wp,-D_FORTIFY_SOURCE=2 -fstack-protector-strong --param=ssp-buffer-size=4 -fPIC -march=x86-64 -gdwarf-4 -fno-debug-types-section -fvar-tracking-assignments -g2 ' 'FCFLAGS=-O2 -fwrapv -pipe -Wformat -Werror=format-security -gdwarf-4 -fno-debug-types-section -fvar-tracking-assignments -g2 -Wp,-D_FORTIFY_SOURCE=2 -fstack-protector-strong --param=ssp-buffer-size=4 -fPIC -march=x86-64 -gdwarf-4 -fno-debug-types-section -fvar-tracking-assignments -g2 ' 'CPPFLAGS=' 'CC=x86_64-pld-linux-gcc' 'CXX=x86_64-pld-linux-g++' '--host=x86_64-pld-linux' '--build=x86_64-pld-linux' '--prefix=/usr' '--exec-prefix=/usr' '--bindir=/usr/bin' '--sbindir=/usr/sbin' '--sysconfdir=/etc' '--datadir=/usr/share' '--includedir=/usr/include' '--libdir=/usr/lib64' '--libexecdir=/usr/libexec' '--localstatedir=/var' '--sharedstatedir=/var/lib' '--mandir=/usr/share/man' '--infodir=/usr/share/info' '--x-libraries=/usr/lib64' checking for grep that handles long lines and -e... /bin/grep checking for egrep... /bin/grep -E checking for a sed that does not truncate output... /bin/sed checking for x86_64-pld-linux-cc... x86_64-pld-linux-gcc checking whether the C compiler works... yes checking for C compiler default output file name... a.out checking for suffix of executables... checking whether we are cross compiling... no checking for suffix of object files... o checking whether we are using the GNU C compiler... yes checking whether x86_64-pld-linux-gcc accepts -g... yes checking for x86_64-pld-linux-gcc option to accept ISO C89... none needed checking how to run the C preprocessor... x86_64-pld-linux-gcc -E checking for icc... no checking for suncc... no checking whether x86_64-pld-linux-gcc and cc understand -c and -o together... yes checking for system library directory... lib checking if compiler supports -R... no checking if compiler supports -Wl,-rpath,... yes checking build system type... x86_64-pld-linux-gnu checking host system type... x86_64-pld-linux-gnu checking target system type... x86_64-pld-linux-gnu checking for PHP prefix... /usr checking for PHP includes... -I/usr/include/php -I/usr/include/php/main -I/usr/include/php/TSRM -I/usr/include/php/Zend -I/usr/include/php/ext -I/usr/include/php/ext/date/lib checking for PHP extension directory... /usr/lib64/php53 checking for PHP installed headers prefix... /usr/include/php checking if debug is enabled... no checking if zts is enabled... no checking for re2c... re2c checking for re2c version... 0.13.5 (ok) checking for gawk... gawk checking whether to enable property proxy support... yes, shared checking how to print strings... print -r checking for a sed that does not truncate output... (cached) /bin/sed checking for fgrep... /bin/grep -F checking for ld used by x86_64-pld-linux-gcc... /usr/bin/ld checking if the linker (/usr/bin/ld) is GNU ld... yes checking for BSD- or MS-compatible name lister (nm)... /usr/bin/nm -B checking the name lister (/usr/bin/nm -B) interface... BSD nm checking whether ln -s works... yes checking the maximum length of command line arguments... 1572864 checking how to convert x86_64-pld-linux-gnu file names to x86_64-pld-linux-gnu format... func_convert_file_noop checking how to convert x86_64-pld-linux-gnu file names to toolchain format... func_convert_file_noop checking for /usr/bin/ld option to reload object files... -r checking for x86_64-pld-linux-objdump... no checking for objdump... objdump checking how to recognize dependent libraries... pass_all checking for x86_64-pld-linux-dlltool... no checking for dlltool... no checking how to associate runtime and link libraries... print -r -- checking for x86_64-pld-linux-ar... no checking for ar... ar checking for archiver @FILE support... @ checking for x86_64-pld-linux-strip... no checking for strip... strip checking for x86_64-pld-linux-ranlib... no checking for ranlib... ranlib checking for mawk... (cached) gawk checking command to parse /usr/bin/nm -B output from x86_64-pld-linux-gcc object... ok checking for sysroot... no checking for a working dd... /bin/dd checking how to truncate binary pipes... /bin/dd bs=4096 count=1 checking for x86_64-pld-linux-mt... no checking for mt... no checking if : is a manifest tool... no checking for ANSI C header files... yes checking for sys/types.h... yes checking for sys/stat.h... yes checking for stdlib.h... yes checking for string.h... yes checking for memory.h... yes checking for strings.h... yes checking for inttypes.h... yes checking for stdint.h... yes checking for unistd.h... yes checking for dlfcn.h... yes checking for objdir... .libs checking if x86_64-pld-linux-gcc supports -fno-rtti -fno-exceptions... no checking for x86_64-pld-linux-gcc option to produce PIC... -fPIC -DPIC checking if x86_64-pld-linux-gcc PIC flag -fPIC -DPIC works... yes checking if x86_64-pld-linux-gcc static flag -static works... yes checking if x86_64-pld-linux-gcc supports -c -o file.o... yes checking if x86_64-pld-linux-gcc supports -c -o file.o... (cached) yes checking whether the x86_64-pld-linux-gcc linker (/usr/bin/ld -m elf_x86_64) supports shared libraries... yes checking whether -lc should be explicitly linked in... no checking dynamic linker characteristics... GNU/Linux ld.so checking how to hardcode library paths into programs... immediate checking whether stripping libraries is possible... yes checking if libtool supports shared libraries... yes checking whether to build shared libraries... yes checking whether to build static libraries... no configure: creating ./config.status config.status: creating config.h config.status: executing libtool commands + /usr/bin/make -Otarget -j9 /bin/sh /tmp/B.VdlWi5/BUILD/php53-pecl-propro-2.1.0/libtool --mode=compile x86_64-pld-linux-gcc -I. -I/tmp/B.VdlWi5/BUILD/php53-pecl-propro-2.1.0 -DPHP_ATOM_INC -I/tmp/B.VdlWi5/BUILD/php53-pecl-propro-2.1.0/include -I/tmp/B.VdlWi5/BUILD/php53-pecl-propro-2.1.0/main -I/tmp/B.VdlWi5/BUILD/php53-pecl-propro-2.1.0 -I/usr/include/php -I/usr/include/php/main -I/usr/include/php/TSRM -I/usr/include/php/Zend -I/usr/include/php/ext -I/usr/include/php/ext/date/lib -I/tmp/B.VdlWi5/BUILD/php53-pecl-propro-2.1.0/src -DHAVE_CONFIG_H -O2 -fwrapv -pipe -Wformat -Werror=format-security -gdwarf-4 -fno-debug-types-section -fvar-tracking-assignments -g2 -Wp,-D_FORTIFY_SOURCE=2 -fstack-protector-strong --param=ssp-buffer-size=4 -fPIC -march=x86-64 -gdwarf-4 -fno-debug-types-section -fvar-tracking-assignments -g2 -c /tmp/B.VdlWi5/BUILD/php53-pecl-propro-2.1.0/src/php_propro_api.c -o src/php_propro_api.lo libtool: compile: x86_64-pld-linux-gcc -I. -I/tmp/B.VdlWi5/BUILD/php53-pecl-propro-2.1.0 -DPHP_ATOM_INC -I/tmp/B.VdlWi5/BUILD/php53-pecl-propro-2.1.0/include -I/tmp/B.VdlWi5/BUILD/php53-pecl-propro-2.1.0/main -I/tmp/B.VdlWi5/BUILD/php53-pecl-propro-2.1.0 -I/usr/include/php -I/usr/include/php/main -I/usr/include/php/TSRM -I/usr/include/php/Zend -I/usr/include/php/ext -I/usr/include/php/ext/date/lib -I/tmp/B.VdlWi5/BUILD/php53-pecl-propro-2.1.0/src -DHAVE_CONFIG_H -O2 -fwrapv -pipe -Wformat -Werror=format-security -gdwarf-4 -fno-debug-types-section -fvar-tracking-assignments -g2 -Wp,-D_FORTIFY_SOURCE=2 -fstack-protector-strong --param=ssp-buffer-size=4 -fPIC -march=x86-64 -gdwarf-4 -fno-debug-types-section -fvar-tracking-assignments -g2 -c /tmp/B.VdlWi5/BUILD/php53-pecl-propro-2.1.0/src/php_propro_api.c -fPIC -DPIC -o src/.libs/php_propro_api.o In file included from /tmp/B.VdlWi5/BUILD/php53-pecl-propro-2.1.0/src/php_propro_api.c:21: /tmp/B.VdlWi5/BUILD/php53-pecl-propro-2.1.0/src/php_propro_api.h:27:2: error: unknown type name 'zend_string' zend_string *member; ^~~~~~~~~~~ /tmp/B.VdlWi5/BUILD/php53-pecl-propro-2.1.0/src/php_propro_api.h:89:3: error: unknown type name 'zend_string'; did you mean 'zend_stream'? zend_string *member); ^~~~~~~~~~~ zend_stream /tmp/B.VdlWi5/BUILD/php53-pecl-propro-2.1.0/src/php_propro_api.c:30:8: error: unknown type name 'ZEND_RESULT_CODE' static ZEND_RESULT_CODE cast_obj(zval *object, zval *return_value, int type); ^~~~~~~~~~~~~~~~ /tmp/B.VdlWi5/BUILD/php53-pecl-propro-2.1.0/src/php_propro_api.c:162:64: error: unknown type name 'zend_string'; did you mean 'zend_stream'? php_property_proxy_t *php_property_proxy_init(zval *container, zend_string *member) ^~~~~~~~~~~ zend_stream /tmp/B.VdlWi5/BUILD/php53-pecl-propro-2.1.0/src/php_propro_api.c: In function 'php_property_proxy_free': /tmp/B.VdlWi5/BUILD/php53-pecl-propro-2.1.0/src/php_propro_api.c:195:8: warning: implicit declaration of function 'Z_ISUNDEF'; did you mean 'Z_ISREF'? [-Wimplicit-function-declaration] if (!Z_ISUNDEF((*proxy)->container)) { ^~~~~~~~~ Z_ISREF In file included from /usr/include/php/Zend/zend.h:756, from /usr/include/php/main/php.h:34, from /tmp/B.VdlWi5/BUILD/php53-pecl-propro-2.1.0/src/php_propro_api.c:18: /tmp/B.VdlWi5/BUILD/php53-pecl-propro-2.1.0/src/php_propro_api.c:196:18: warning: passing argument 1 of '_zval_ptr_dtor' from incompatible pointer type [-Wincompatible-pointer-types] zval_ptr_dtor(&(*proxy)->container); /usr/include/php/Zend/zend_variables.h:56:49: note: in definition of macro 'zval_ptr_dtor' #define zval_ptr_dtor(zval_ptr) _zval_ptr_dtor((zval_ptr) ZEND_FILE_LINE_CC) ^~~~~~~~ /usr/include/php/Zend/zend_variables.h:50:37: note: expected 'zval **' {aka 'struct _zval_struct **'} but argument is of type 'zval *' {aka 'struct _zval_struct *'} ZEND_API void _zval_ptr_dtor(zval **zval_ptr ZEND_FILE_LINE_DC); ~~~~~~~^~~~~~~~ /tmp/B.VdlWi5/BUILD/php53-pecl-propro-2.1.0/src/php_propro_api.c:197:4: warning: implicit declaration of function 'ZVAL_UNDEF'; did you mean 'ZVAL_TRUE'? [-Wimplicit-function-declaration] ZVAL_UNDEF(&(*proxy)->container); ^~~~~~~~~~ ZVAL_TRUE /tmp/B.VdlWi5/BUILD/php53-pecl-propro-2.1.0/src/php_propro_api.c:199:3: warning: implicit declaration of function 'zend_string_release'; did you mean 'zend_stack_base'? [-Wimplicit-function-declaration] zend_string_release((*proxy)->member); ^~~~~~~~~~~~~~~~~~~ zend_stack_base In file included from /usr/include/php/Zend/zend.h:237, from /usr/include/php/main/php.h:34, from /tmp/B.VdlWi5/BUILD/php53-pecl-propro-2.1.0/src/php_propro_api.c:18: /tmp/B.VdlWi5/BUILD/php53-pecl-propro-2.1.0/src/php_propro_api.c: In function 'php_property_proxy_object_new_ex': /tmp/B.VdlWi5/BUILD/php53-pecl-propro-2.1.0/src/php_propro_api.c:227:50: error: 'zend_class_entry' {aka 'struct _zend_class_entry'} has no member named 'default_properties_count'; did you mean 'default_properties'? o = ecalloc(1, sizeof(*o) + sizeof(zval) * (ce->default_properties_count - 1)); ^~~~~~~~~~~~~~~~~~~~~~~~ /usr/include/php/Zend/zend_alloc.h:73:52: note: in definition of macro 'ecalloc' #define ecalloc(nmemb, size) _ecalloc((nmemb), (size) ZEND_FILE_LINE_CC ZEND_FILE_LINE_EMPTY_CC) ^~~~ /tmp/B.VdlWi5/BUILD/php53-pecl-propro-2.1.0/src/php_propro_api.c:229:2: warning: implicit declaration of function 'object_properties_init'; did you mean 'object_and_properties_init'? [-Wimplicit-function-declaration] object_properties_init(&o->zo, ce); ^~~~~~~~~~~~~~~~~~~~~~ object_and_properties_init /tmp/B.VdlWi5/BUILD/php53-pecl-propro-2.1.0/src/php_propro_api.c:232:7: error: 'zend_object' {aka 'struct _zend_object'} has no member named 'handlers' o->zo.handlers = &php_property_proxy_object_handlers; ^ In file included from /tmp/B.VdlWi5/BUILD/php53-pecl-propro-2.1.0/src/php_propro_api.h:16, from /tmp/B.VdlWi5/BUILD/php53-pecl-propro-2.1.0/src/php_propro_api.c:21: /tmp/B.VdlWi5/BUILD/php53-pecl-propro-2.1.0/src/php_propro_api.c: In function 'destroy_obj': ./php_propro.h:33:54: error: 'zend_object' {aka 'struct _zend_object'} has no member named 'handlers' #define PHP_PROPRO_PTR(zo) (void*)(((char*)(zo))-(zo)->handlers->offset) ^~ /tmp/B.VdlWi5/BUILD/php53-pecl-propro-2.1.0/src/php_propro_api.c:244:35: note: in expansion of macro 'PHP_PROPRO_PTR' php_property_proxy_object_t *o = PHP_PROPRO_PTR(object); ^~~~~~~~~~~~~~ In file included from /usr/include/php/Zend/zend.h:756, from /usr/include/php/main/php.h:34, from /tmp/B.VdlWi5/BUILD/php53-pecl-propro-2.1.0/src/php_propro_api.c:18: /tmp/B.VdlWi5/BUILD/php53-pecl-propro-2.1.0/src/php_propro_api.c:250:17: warning: passing argument 1 of '_zval_ptr_dtor' from incompatible pointer type [-Wincompatible-pointer-types] zval_ptr_dtor(&o->parent); /usr/include/php/Zend/zend_variables.h:56:49: note: in definition of macro 'zval_ptr_dtor' #define zval_ptr_dtor(zval_ptr) _zval_ptr_dtor((zval_ptr) ZEND_FILE_LINE_CC) ^~~~~~~~ /usr/include/php/Zend/zend_variables.h:50:37: note: expected 'zval **' {aka 'struct _zval_struct **'} but argument is of type 'zval *' {aka 'struct _zval_struct *'} ZEND_API void _zval_ptr_dtor(zval **zval_ptr ZEND_FILE_LINE_DC); ~~~~~~~^~~~~~~~ /tmp/B.VdlWi5/BUILD/php53-pecl-propro-2.1.0/src/php_propro_api.c: In function 'get_propro': /tmp/B.VdlWi5/BUILD/php53-pecl-propro-2.1.0/src/php_propro_api.c:258:2: warning: implicit declaration of function 'ZEND_ASSERT'; did you mean 'ZEND_ISSET'? [-Wimplicit-function-declaration] ZEND_ASSERT(Z_TYPE_P(object) == IS_OBJECT); ^~~~~~~~~~~ ZEND_ISSET In file included from /tmp/B.VdlWi5/BUILD/php53-pecl-propro-2.1.0/src/php_propro_api.h:16, from /tmp/B.VdlWi5/BUILD/php53-pecl-propro-2.1.0/src/php_propro_api.c:21: /tmp/B.VdlWi5/BUILD/php53-pecl-propro-2.1.0/src/php_propro_api.c:259:24: warning: implicit declaration of function 'Z_OBJ_P'; did you mean 'Z_OBJ_HT'? [-Wimplicit-function-declaration] return PHP_PROPRO_PTR(Z_OBJ_P(object)); ^~~~~~~ ./php_propro.h:33:45: note: in definition of macro 'PHP_PROPRO_PTR' #define PHP_PROPRO_PTR(zo) (void*)(((char*)(zo))-(zo)->handlers->offset) ^~ ./php_propro.h:33:37: warning: cast to pointer from integer of different size [-Wint-to-pointer-cast] #define PHP_PROPRO_PTR(zo) (void*)(((char*)(zo))-(zo)->handlers->offset) ^ /tmp/B.VdlWi5/BUILD/php53-pecl-propro-2.1.0/src/php_propro_api.c:259:9: note: in expansion of macro 'PHP_PROPRO_PTR' return PHP_PROPRO_PTR(Z_OBJ_P(object)); ^~~~~~~~~~~~~~ ./php_propro.h:33:54: error: invalid type argument of '->' (have 'int') #define PHP_PROPRO_PTR(zo) (void*)(((char*)(zo))-(zo)->handlers->offset) ^~ /tmp/B.VdlWi5/BUILD/php53-pecl-propro-2.1.0/src/php_propro_api.c:259:9: note: in expansion of macro 'PHP_PROPRO_PTR' return PHP_PROPRO_PTR(Z_OBJ_P(object)); ^~~~~~~~~~~~~~ /tmp/B.VdlWi5/BUILD/php53-pecl-propro-2.1.0/src/php_propro_api.c: In function 'get_debug_info': /tmp/B.VdlWi5/BUILD/php53-pecl-propro-2.1.0/src/php_propro_api.c:285:3: warning: implicit declaration of function 'zend_hash_str_add_empty_element'; did you mean 'zend_hash_add_empty_element'? [-Wimplicit-function-declaration] zend_hash_str_add_empty_element(ht, "parent", sizeof("parent")-1); ^~~~~~~~~~~~~~~~~~~~~~~~~~~~~~~ zend_hash_add_empty_element /tmp/B.VdlWi5/BUILD/php53-pecl-propro-2.1.0/src/php_propro_api.c:286:3: warning: implicit declaration of function 'zend_hash_str_add'; did you mean 'zend_hash_add'? [-Wimplicit-function-declaration] zend_hash_str_add(ht, "container", sizeof("container")-1, &obj->proxy->container); ^~~~~~~~~~~~~~~~~ zend_hash_add /tmp/B.VdlWi5/BUILD/php53-pecl-propro-2.1.0/src/php_propro_api.c:292:10: warning: assignment to 'zval *' {aka 'struct _zval_struct *'} from 'int' makes pointer from integer without a cast [-Wint-conversion] zmember = zend_hash_str_add_empty_element(ht, "member", sizeof("member")-1); ^ /tmp/B.VdlWi5/BUILD/php53-pecl-propro-2.1.0/src/php_propro_api.c:293:2: warning: implicit declaration of function 'ZVAL_STR'; did you mean 'ZVAL_STRING'? [-Wimplicit-function-declaration] ZVAL_STR(zmember, obj->proxy->member); ^~~~~~~~ ZVAL_STRING /tmp/B.VdlWi5/BUILD/php53-pecl-propro-2.1.0/src/php_propro_api.c: At top level: /tmp/B.VdlWi5/BUILD/php53-pecl-propro-2.1.0/src/php_propro_api.c:299:8: error: unknown type name 'ZEND_RESULT_CODE' static ZEND_RESULT_CODE cast_obj(zval *object, zval *return_value, int type) ^~~~~~~~~~~~~~~~ In file included from /usr/include/php/Zend/zend.h:756, from /usr/include/php/main/php.h:34, from /tmp/B.VdlWi5/BUILD/php53-pecl-propro-2.1.0/src/php_propro_api.c:18: /tmp/B.VdlWi5/BUILD/php53-pecl-propro-2.1.0/src/php_propro_api.c: In function 'cast_obj': /usr/include/php/Zend/zend_API.h:575:18: error: lvalue required as unary '&' operand zval_ptr_dtor(&zv); \ ^ /usr/include/php/Zend/zend_variables.h:56:49: note: in definition of macro 'zval_ptr_dtor' #define zval_ptr_dtor(zval_ptr) _zval_ptr_dtor((zval_ptr) ZEND_FILE_LINE_CC) ^~~~~~~~ /usr/include/php/Zend/zend_API.h:592:38: note: in expansion of macro 'ZVAL_ZVAL' #define RETVAL_ZVAL(zv, copy, dtor) ZVAL_ZVAL(return_value, zv, copy, dtor) ^~~~~~~~~ /tmp/B.VdlWi5/BUILD/php53-pecl-propro-2.1.0/src/php_propro_api.c:304:2: note: in expansion of macro 'RETVAL_ZVAL' RETVAL_ZVAL(get_proxied_value(object, &tmp), 1, 0); ^~~~~~~~~~~ /tmp/B.VdlWi5/BUILD/php53-pecl-propro-2.1.0/src/php_propro_api.c:308:7: warning: implicit declaration of function 'Z_ISUNDEF_P'; did you mean 'Z_ISREF_P'? [-Wimplicit-function-declaration] if (!Z_ISUNDEF_P(return_value)) { ^~~~~~~~~~~ Z_ISREF_P /tmp/B.VdlWi5/BUILD/php53-pecl-propro-2.1.0/src/php_propro_api.c:309:3: warning: implicit declaration of function 'ZVAL_DEREF'; did you mean 'ZVAL_TRUE'? [-Wimplicit-function-declaration] ZVAL_DEREF(return_value); ^~~~~~~~~~ ZVAL_TRUE In file included from /usr/include/php/Zend/zend.h:755, from /usr/include/php/main/php.h:34, from /tmp/B.VdlWi5/BUILD/php53-pecl-propro-2.1.0/src/php_propro_api.c:18: /usr/include/php/Zend/zend_operators.h:436:35: error: invalid type argument of unary '*' (have 'zval' {aka 'struct _zval_struct'}) #define Z_TYPE_PP(zval_pp) Z_TYPE(**zval_pp) /usr/include/php/Zend/zend_operators.h:434:24: note: in definition of macro 'Z_TYPE' #define Z_TYPE(zval) (zval).type ^~~~ /usr/include/php/Zend/zend_operators.h:367:6: note: in expansion of macro 'Z_TYPE_PP' if (Z_TYPE_PP(ppzv) != str_type) { \ ^~~~~~~~~ /tmp/B.VdlWi5/BUILD/php53-pecl-propro-2.1.0/src/php_propro_api.c:310:3: note: in expansion of macro 'convert_to_explicit_type_ex' convert_to_explicit_type_ex(return_value, type); ^~~~~~~~~~~~~~~~~~~~~~~~~~~ In file included from /usr/include/php/main/php.h:34, from /tmp/B.VdlWi5/BUILD/php53-pecl-propro-2.1.0/src/php_propro_api.c:18: /usr/include/php/Zend/zend.h:694:20: error: incompatible type for argument 1 of 'zval_isref_p' if (!PZVAL_IS_REF(*ppzv)) { \ /usr/include/php/Zend/zend.h:337:38: note: in definition of macro 'Z_ISREF_P' #define Z_ISREF_P(pz) zval_isref_p(pz) ^~ /usr/include/php/Zend/zend.h:694:7: note: in expansion of macro 'PZVAL_IS_REF' if (!PZVAL_IS_REF(*ppzv)) { \ ^~~~~~~~~~~~ /usr/include/php/Zend/zend_operators.h:368:3: note: in expansion of macro 'SEPARATE_ZVAL_IF_NOT_REF' SEPARATE_ZVAL_IF_NOT_REF(ppzv); \ ^~~~~~~~~~~~~~~~~~~~~~~~ /tmp/B.VdlWi5/BUILD/php53-pecl-propro-2.1.0/src/php_propro_api.c:310:3: note: in expansion of macro 'convert_to_explicit_type_ex' convert_to_explicit_type_ex(return_value, type); ^~~~~~~~~~~~~~~~~~~~~~~~~~~ In file included from /usr/include/php/main/php.h:34, from /tmp/B.VdlWi5/BUILD/php53-pecl-propro-2.1.0/src/php_propro_api.c:18: /usr/include/php/Zend/zend.h:388:56: note: expected 'zval *' {aka 'struct _zval_struct *'} but argument is of type 'zval' {aka 'struct _zval_struct'} static zend_always_inline zend_bool zval_isref_p(zval* pz) { ~~~~~~^~ In file included from /usr/include/php/main/php.h:34, from /tmp/B.VdlWi5/BUILD/php53-pecl-propro-2.1.0/src/php_propro_api.c:18: /usr/include/php/Zend/zend.h:681:20: error: incompatible types when initializing type 'zval *' {aka 'struct _zval_struct *'} using type 'zval' {aka 'struct _zval_struct'} zval *orig_ptr = *(ppzv); \ ^ /usr/include/php/Zend/zend.h:695:3: note: in expansion of macro 'SEPARATE_ZVAL' SEPARATE_ZVAL(ppzv); \ ^~~~~~~~~~~~~ /usr/include/php/Zend/zend_operators.h:368:3: note: in expansion of macro 'SEPARATE_ZVAL_IF_NOT_REF' SEPARATE_ZVAL_IF_NOT_REF(ppzv); \ ^~~~~~~~~~~~~~~~~~~~~~~~ /tmp/B.VdlWi5/BUILD/php53-pecl-propro-2.1.0/src/php_propro_api.c:310:3: note: in expansion of macro 'convert_to_explicit_type_ex' convert_to_explicit_type_ex(return_value, type); ^~~~~~~~~~~~~~~~~~~~~~~~~~~ In file included from /usr/include/php/Zend/zend.h:754, from /usr/include/php/main/php.h:34, from /tmp/B.VdlWi5/BUILD/php53-pecl-propro-2.1.0/src/php_propro_api.c:18: /usr/include/php/Zend/zend_gc.h:206:7: error: incompatible types when assigning to type 'zval' {aka 'struct _zval_struct'} from type 'zval *' {aka 'struct _zval_struct *'} (z) = (zval*)emalloc(sizeof(zval_gc_info)); \ ^ /usr/include/php/Zend/zend.h:685:4: note: in expansion of macro 'ALLOC_ZVAL' ALLOC_ZVAL(*(ppzv)); \ ^~~~~~~~~~ /usr/include/php/Zend/zend.h:695:3: note: in expansion of macro 'SEPARATE_ZVAL' SEPARATE_ZVAL(ppzv); \ ^~~~~~~~~~~~~ /usr/include/php/Zend/zend_operators.h:368:3: note: in expansion of macro 'SEPARATE_ZVAL_IF_NOT_REF' SEPARATE_ZVAL_IF_NOT_REF(ppzv); \ ^~~~~~~~~~~~~~~~~~~~~~~~ /tmp/B.VdlWi5/BUILD/php53-pecl-propro-2.1.0/src/php_propro_api.c:310:3: note: in expansion of macro 'convert_to_explicit_type_ex' convert_to_explicit_type_ex(return_value, type); ^~~~~~~~~~~~~~~~~~~~~~~~~~~ /tmp/B.VdlWi5/BUILD/php53-pecl-propro-2.1.0/src/php_propro_api.c:310:3: error: cannot convert to a pointer type In file included from /usr/include/php/main/php.h:34, from /tmp/B.VdlWi5/BUILD/php53-pecl-propro-2.1.0/src/php_propro_api.c:18: /usr/include/php/Zend/zend.h:686:4: error: invalid type argument of unary '*' (have 'zval' {aka 'struct _zval_struct'}) **(ppzv) = *orig_ptr; \ ^~~~~~~~ /usr/include/php/Zend/zend.h:695:3: note: in expansion of macro 'SEPARATE_ZVAL' SEPARATE_ZVAL(ppzv); \ ^~~~~~~~~~~~~ /usr/include/php/Zend/zend_operators.h:368:3: note: in expansion of macro 'SEPARATE_ZVAL_IF_NOT_REF' SEPARATE_ZVAL_IF_NOT_REF(ppzv); \ ^~~~~~~~~~~~~~~~~~~~~~~~ /tmp/B.VdlWi5/BUILD/php53-pecl-propro-2.1.0/src/php_propro_api.c:310:3: note: in expansion of macro 'convert_to_explicit_type_ex' convert_to_explicit_type_ex(return_value, type); ^~~~~~~~~~~~~~~~~~~~~~~~~~~ In file included from /usr/include/php/Zend/zend.h:756, from /usr/include/php/main/php.h:34, from /tmp/B.VdlWi5/BUILD/php53-pecl-propro-2.1.0/src/php_propro_api.c:18: /usr/include/php/Zend/zend.h:687:19: error: incompatible type for argument 1 of '_zval_copy_ctor' zval_copy_ctor(*(ppzv)); \ /usr/include/php/Zend/zend_variables.h:54:49: note: in definition of macro 'zval_copy_ctor' #define zval_copy_ctor(zvalue) _zval_copy_ctor((zvalue) ZEND_FILE_LINE_CC) ^~~~~~ /usr/include/php/Zend/zend.h:695:3: note: in expansion of macro 'SEPARATE_ZVAL' SEPARATE_ZVAL(ppzv); \ ^~~~~~~~~~~~~ /usr/include/php/Zend/zend_operators.h:368:3: note: in expansion of macro 'SEPARATE_ZVAL_IF_NOT_REF' SEPARATE_ZVAL_IF_NOT_REF(ppzv); \ ^~~~~~~~~~~~~~~~~~~~~~~~ /tmp/B.VdlWi5/BUILD/php53-pecl-propro-2.1.0/src/php_propro_api.c:310:3: note: in expansion of macro 'convert_to_explicit_type_ex' convert_to_explicit_type_ex(return_value, type); ^~~~~~~~~~~~~~~~~~~~~~~~~~~ /usr/include/php/Zend/zend_variables.h:40:42: note: expected 'zval *' {aka 'struct _zval_struct *'} but argument is of type 'zval' {aka 'struct _zval_struct'} static inline void _zval_copy_ctor(zval *zvalue ZEND_FILE_LINE_DC) ~~~~~~^~~~~~ In file included from /usr/include/php/main/php.h:34, from /tmp/B.VdlWi5/BUILD/php53-pecl-propro-2.1.0/src/php_propro_api.c:18: /usr/include/php/Zend/zend.h:325:53: error: incompatible type for argument 1 of 'zval_set_refcount_p' #define Z_SET_REFCOUNT_PP(ppz, rc) Z_SET_REFCOUNT_P(*(ppz), rc) ^~~~~~ /usr/include/php/Zend/zend.h:334:54: note: in definition of macro 'Z_SET_REFCOUNT_P' #define Z_SET_REFCOUNT_P(pz, rc) zval_set_refcount_p(pz, rc) ^~ /usr/include/php/Zend/zend.h:688:4: note: in expansion of macro 'Z_SET_REFCOUNT_PP' Z_SET_REFCOUNT_PP(ppzv, 1); \ ^~~~~~~~~~~~~~~~~ /usr/include/php/Zend/zend.h:695:3: note: in expansion of macro 'SEPARATE_ZVAL' SEPARATE_ZVAL(ppzv); \ ^~~~~~~~~~~~~ /usr/include/php/Zend/zend_operators.h:368:3: note: in expansion of macro 'SEPARATE_ZVAL_IF_NOT_REF' SEPARATE_ZVAL_IF_NOT_REF(ppzv); \ ^~~~~~~~~~~~~~~~~~~~~~~~ /tmp/B.VdlWi5/BUILD/php53-pecl-propro-2.1.0/src/php_propro_api.c:310:3: note: in expansion of macro 'convert_to_explicit_type_ex' convert_to_explicit_type_ex(return_value, type); ^~~~~~~~~~~~~~~~~~~~~~~~~~~ In file included from /usr/include/php/main/php.h:34, from /tmp/B.VdlWi5/BUILD/php53-pecl-propro-2.1.0/src/php_propro_api.c:18: /usr/include/php/Zend/zend.h:376:63: note: expected 'zval *' {aka 'struct _zval_struct *'} but argument is of type 'zval' {aka 'struct _zval_struct'} static zend_always_inline zend_uint zval_set_refcount_p(zval* pz, zend_uint rc) { ~~~~~~^~ In file included from /usr/include/php/main/php.h:34, from /tmp/B.VdlWi5/BUILD/php53-pecl-propro-2.1.0/src/php_propro_api.c:18: /usr/include/php/Zend/zend.h:330:48: error: incompatible type for argument 1 of 'zval_unset_isref_p' #define Z_UNSET_ISREF_PP(ppz) Z_UNSET_ISREF_P(*(ppz)) ^~~~~~ /usr/include/php/Zend/zend.h:339:49: note: in definition of macro 'Z_UNSET_ISREF_P' #define Z_UNSET_ISREF_P(pz) zval_unset_isref_p(pz) ^~ /usr/include/php/Zend/zend.h:689:4: note: in expansion of macro 'Z_UNSET_ISREF_PP' Z_UNSET_ISREF_PP((ppzv)); \ ^~~~~~~~~~~~~~~~ /usr/include/php/Zend/zend.h:695:3: note: in expansion of macro 'SEPARATE_ZVAL' SEPARATE_ZVAL(ppzv); \ ^~~~~~~~~~~~~ /usr/include/php/Zend/zend_operators.h:368:3: note: in expansion of macro 'SEPARATE_ZVAL_IF_NOT_REF' SEPARATE_ZVAL_IF_NOT_REF(ppzv); \ ^~~~~~~~~~~~~~~~~~~~~~~~ /tmp/B.VdlWi5/BUILD/php53-pecl-propro-2.1.0/src/php_propro_api.c:310:3: note: in expansion of macro 'convert_to_explicit_type_ex' convert_to_explicit_type_ex(return_value, type); ^~~~~~~~~~~~~~~~~~~~~~~~~~~ In file included from /usr/include/php/main/php.h:34, from /tmp/B.VdlWi5/BUILD/php53-pecl-propro-2.1.0/src/php_propro_api.c:18: /usr/include/php/Zend/zend.h:396:62: note: expected 'zval *' {aka 'struct _zval_struct *'} but argument is of type 'zval' {aka 'struct _zval_struct'} static zend_always_inline zend_bool zval_unset_isref_p(zval* pz) { ~~~~~~^~ In file included from /usr/include/php/Zend/zend.h:755, from /usr/include/php/main/php.h:34, from /tmp/B.VdlWi5/BUILD/php53-pecl-propro-2.1.0/src/php_propro_api.c:18: /usr/include/php/Zend/zend_operators.h:369:28: error: incompatible type for argument 1 of 'convert_to_null' convert_to_explicit_type(*ppzv, str_type); \ /usr/include/php/Zend/zend_operators.h:340:21: note: in definition of macro 'convert_to_explicit_type' convert_to_null(pzv); \ ^~~ /tmp/B.VdlWi5/BUILD/php53-pecl-propro-2.1.0/src/php_propro_api.c:310:3: note: in expansion of macro 'convert_to_explicit_type_ex' convert_to_explicit_type_ex(return_value, type); ^~~~~~~~~~~~~~~~~~~~~~~~~~~ /usr/include/php/Zend/zend_operators.h:285:37: note: expected 'zval *' {aka 'struct _zval_struct *'} but argument is of type 'zval' {aka 'struct _zval_struct'} ZEND_API void convert_to_null(zval *op); ~~~~~~^~ /usr/include/php/Zend/zend_operators.h:369:28: error: incompatible type for argument 1 of 'convert_to_long' convert_to_explicit_type(*ppzv, str_type); \ /usr/include/php/Zend/zend_operators.h:343:21: note: in definition of macro 'convert_to_explicit_type' convert_to_long(pzv); \ ^~~ /tmp/B.VdlWi5/BUILD/php53-pecl-propro-2.1.0/src/php_propro_api.c:310:3: note: in expansion of macro 'convert_to_explicit_type_ex' convert_to_explicit_type_ex(return_value, type); ^~~~~~~~~~~~~~~~~~~~~~~~~~~ /usr/include/php/Zend/zend_operators.h:282:37: note: expected 'zval *' {aka 'struct _zval_struct *'} but argument is of type 'zval' {aka 'struct _zval_struct'} ZEND_API void convert_to_long(zval *op); ~~~~~~^~ /usr/include/php/Zend/zend_operators.h:369:28: error: incompatible type for argument 1 of 'convert_to_double' convert_to_explicit_type(*ppzv, str_type); \ /usr/include/php/Zend/zend_operators.h:346:23: note: in definition of macro 'convert_to_explicit_type' convert_to_double(pzv); \ ^~~ /tmp/B.VdlWi5/BUILD/php53-pecl-propro-2.1.0/src/php_propro_api.c:310:3: note: in expansion of macro 'convert_to_explicit_type_ex' convert_to_explicit_type_ex(return_value, type); ^~~~~~~~~~~~~~~~~~~~~~~~~~~ /usr/include/php/Zend/zend_operators.h:283:39: note: expected 'zval *' {aka 'struct _zval_struct *'} but argument is of type 'zval' {aka 'struct _zval_struct'} ZEND_API void convert_to_double(zval *op); ~~~~~~^~ /usr/include/php/Zend/zend_operators.h:369:28: error: incompatible type for argument 1 of 'convert_to_boolean' convert_to_explicit_type(*ppzv, str_type); \ /usr/include/php/Zend/zend_operators.h:349:24: note: in definition of macro 'convert_to_explicit_type' convert_to_boolean(pzv); \ ^~~ /tmp/B.VdlWi5/BUILD/php53-pecl-propro-2.1.0/src/php_propro_api.c:310:3: note: in expansion of macro 'convert_to_explicit_type_ex' convert_to_explicit_type_ex(return_value, type); ^~~~~~~~~~~~~~~~~~~~~~~~~~~ /usr/include/php/Zend/zend_operators.h:286:40: note: expected 'zval *' {aka 'struct _zval_struct *'} but argument is of type 'zval' {aka 'struct _zval_struct'} ZEND_API void convert_to_boolean(zval *op); ~~~~~~^~ /usr/include/php/Zend/zend_operators.h:369:28: error: incompatible type for argument 1 of 'convert_to_array' convert_to_explicit_type(*ppzv, str_type); \ /usr/include/php/Zend/zend_operators.h:352:22: note: in definition of macro 'convert_to_explicit_type' convert_to_array(pzv); \ ^~~ /tmp/B.VdlWi5/BUILD/php53-pecl-propro-2.1.0/src/php_propro_api.c:310:3: note: in expansion of macro 'convert_to_explicit_type_ex' convert_to_explicit_type_ex(return_value, type); ^~~~~~~~~~~~~~~~~~~~~~~~~~~ /usr/include/php/Zend/zend_operators.h:287:38: note: expected 'zval *' {aka 'struct _zval_struct *'} but argument is of type 'zval' {aka 'struct _zval_struct'} ZEND_API void convert_to_array(zval *op); ~~~~~~^~ /usr/include/php/Zend/zend_operators.h:369:28: error: incompatible type for argument 1 of 'convert_to_object' convert_to_explicit_type(*ppzv, str_type); \ /usr/include/php/Zend/zend_operators.h:355:23: note: in definition of macro 'convert_to_explicit_type' convert_to_object(pzv); \ ^~~ /tmp/B.VdlWi5/BUILD/php53-pecl-propro-2.1.0/src/php_propro_api.c:310:3: note: in expansion of macro 'convert_to_explicit_type_ex' convert_to_explicit_type_ex(return_value, type); ^~~~~~~~~~~~~~~~~~~~~~~~~~~ /usr/include/php/Zend/zend_operators.h:288:39: note: expected 'zval *' {aka 'struct _zval_struct *'} but argument is of type 'zval' {aka 'struct _zval_struct'} ZEND_API void convert_to_object(zval *op); ~~~~~~^~ /usr/include/php/Zend/zend_operators.h:294:39: error: invalid type argument of '->' (have 'zval' {aka 'struct _zval_struct'}) #define convert_to_string(op) if ((op)->type != IS_STRING) { _convert_to_string((op) ZEND_FILE_LINE_CC); } ^~ /usr/include/php/Zend/zend_operators.h:358:5: note: in expansion of macro 'convert_to_string' convert_to_string(pzv); \ ^~~~~~~~~~~~~~~~~ /usr/include/php/Zend/zend_operators.h:369:3: note: in expansion of macro 'convert_to_explicit_type' convert_to_explicit_type(*ppzv, str_type); \ ^~~~~~~~~~~~~~~~~~~~~~~~ /tmp/B.VdlWi5/BUILD/php53-pecl-propro-2.1.0/src/php_propro_api.c:310:3: note: in expansion of macro 'convert_to_explicit_type_ex' convert_to_explicit_type_ex(return_value, type); ^~~~~~~~~~~~~~~~~~~~~~~~~~~ /usr/include/php/Zend/zend_operators.h:369:28: error: incompatible type for argument 1 of '_convert_to_string' convert_to_explicit_type(*ppzv, str_type); \ ^ /usr/include/php/Zend/zend_operators.h:294:82: note: in definition of macro 'convert_to_string' #define convert_to_string(op) if ((op)->type != IS_STRING) { _convert_to_string((op) ZEND_FILE_LINE_CC); } ^~ /usr/include/php/Zend/zend_operators.h:369:3: note: in expansion of macro 'convert_to_explicit_type' convert_to_explicit_type(*ppzv, str_type); \ ^~~~~~~~~~~~~~~~~~~~~~~~ /tmp/B.VdlWi5/BUILD/php53-pecl-propro-2.1.0/src/php_propro_api.c:310:3: note: in expansion of macro 'convert_to_explicit_type_ex' convert_to_explicit_type_ex(return_value, type); ^~~~~~~~~~~~~~~~~~~~~~~~~~~ /usr/include/php/Zend/zend_operators.h:281:40: note: expected 'zval *' {aka 'struct _zval_struct *'} but argument is of type 'zval' {aka 'struct _zval_struct'} ZEND_API void _convert_to_string(zval *op ZEND_FILE_LINE_DC); ~~~~~~^~ In file included from /usr/include/php/Zend/zend.h:756, from /usr/include/php/main/php.h:34, from /tmp/B.VdlWi5/BUILD/php53-pecl-propro-2.1.0/src/php_propro_api.c:18: /tmp/B.VdlWi5/BUILD/php53-pecl-propro-2.1.0/src/php_propro_api.c: In function 'get_obj': /usr/include/php/Zend/zend_API.h:575:18: error: lvalue required as unary '&' operand zval_ptr_dtor(&zv); \ ^ /usr/include/php/Zend/zend_variables.h:56:49: note: in definition of macro 'zval_ptr_dtor' #define zval_ptr_dtor(zval_ptr) _zval_ptr_dtor((zval_ptr) ZEND_FILE_LINE_CC) ^~~~~~~~ /usr/include/php/Zend/zend_API.h:592:38: note: in expansion of macro 'ZVAL_ZVAL' #define RETVAL_ZVAL(zv, copy, dtor) ZVAL_ZVAL(return_value, zv, copy, dtor) ^~~~~~~~~ /tmp/B.VdlWi5/BUILD/php53-pecl-propro-2.1.0/src/php_propro_api.c:322:2: note: in expansion of macro 'RETVAL_ZVAL' RETVAL_ZVAL(get_proxied_value(object, &tmp), 1, 0); ^~~~~~~~~~~ /tmp/B.VdlWi5/BUILD/php53-pecl-propro-2.1.0/src/php_propro_api.c: In function 'set_container': /tmp/B.VdlWi5/BUILD/php53-pecl-propro-2.1.0/src/php_propro_api.c:351:4: warning: implicit declaration of function 'ZVAL_COPY_VALUE'; did you mean 'ZVAL_COPY_CTOR'? [-Wimplicit-function-declaration] ZVAL_COPY_VALUE(&tmp, &obj->proxy->container); ^~~~~~~~~~~~~~~ ZVAL_COPY_CTOR /tmp/B.VdlWi5/BUILD/php53-pecl-propro-2.1.0/src/php_propro_api.c:352:4: warning: implicit declaration of function 'ZVAL_COPY'; did you mean 'ZVAL_LONG'? [-Wimplicit-function-declaration] ZVAL_COPY(&obj->proxy->container, container); ^~~~~~~~~ ZVAL_LONG In file included from /usr/include/php/Zend/zend.h:756, from /usr/include/php/main/php.h:34, from /tmp/B.VdlWi5/BUILD/php53-pecl-propro-2.1.0/src/php_propro_api.c:18: /tmp/B.VdlWi5/BUILD/php53-pecl-propro-2.1.0/src/php_propro_api.c:353:18: warning: passing argument 1 of '_zval_ptr_dtor' from incompatible pointer type [-Wincompatible-pointer-types] zval_ptr_dtor(&tmp); /usr/include/php/Zend/zend_variables.h:56:49: note: in definition of macro 'zval_ptr_dtor' #define zval_ptr_dtor(zval_ptr) _zval_ptr_dtor((zval_ptr) ZEND_FILE_LINE_CC) ^~~~~~~~ /usr/include/php/Zend/zend_variables.h:50:37: note: expected 'zval **' {aka 'struct _zval_struct **'} but argument is of type 'zval *' {aka 'struct _zval_struct *'} ZEND_API void _zval_ptr_dtor(zval **zval_ptr ZEND_FILE_LINE_DC); ~~~~~~~^~~~~~~~ /tmp/B.VdlWi5/BUILD/php53-pecl-propro-2.1.0/src/php_propro_api.c: At top level: /tmp/B.VdlWi5/BUILD/php53-pecl-propro-2.1.0/src/php_propro_api.c:360:58: error: unknown type name 'zend_string'; did you mean 'zend_stream'? static inline zval *get_container_value(zval *container, zend_string *member, zval *return_value) ^~~~~~~~~~~ zend_stream In file included from /usr/include/php/Zend/zend.h:756, from /usr/include/php/main/php.h:34, from /tmp/B.VdlWi5/BUILD/php53-pecl-propro-2.1.0/src/php_propro_api.c:18: /tmp/B.VdlWi5/BUILD/php53-pecl-propro-2.1.0/src/php_propro_api.c: In function 'cleanup_container': /usr/include/php/Zend/zend_variables.h:56:48: warning: passing argument 1 of '_zval_ptr_dtor' from incompatible pointer type [-Wincompatible-pointer-types] #define zval_ptr_dtor(zval_ptr) _zval_ptr_dtor((zval_ptr) ZEND_FILE_LINE_CC) ^~~~~~~~~~ /tmp/B.VdlWi5/BUILD/php53-pecl-propro-2.1.0/src/php_propro_api.c:387:3: note: in expansion of macro 'zval_ptr_dtor' zval_ptr_dtor(container); ^~~~~~~~~~~~~ /usr/include/php/Zend/zend_variables.h:50:37: note: expected 'zval **' {aka 'struct _zval_struct **'} but argument is of type 'zval *' {aka 'struct _zval_struct *'} ZEND_API void _zval_ptr_dtor(zval **zval_ptr ZEND_FILE_LINE_DC); ~~~~~~~^~~~~~~~ /tmp/B.VdlWi5/BUILD/php53-pecl-propro-2.1.0/src/php_propro_api.c: In function 'separate_container': /tmp/B.VdlWi5/BUILD/php53-pecl-propro-2.1.0/src/php_propro_api.c:399:3: warning: implicit declaration of function 'ZVAL_ARR'; did you mean 'ZVAL_TRUE'? [-Wimplicit-function-declaration] ZVAL_ARR(container, zend_array_dup(Z_ARRVAL_P(container))); ^~~~~~~~ ZVAL_TRUE /tmp/B.VdlWi5/BUILD/php53-pecl-propro-2.1.0/src/php_propro_api.c:399:23: warning: implicit declaration of function 'zend_array_dup'; did you mean 'zend_strndup'? [-Wimplicit-function-declaration] ZVAL_ARR(container, zend_array_dup(Z_ARRVAL_P(container))); ^~~~~~~~~~~~~~ zend_strndup /tmp/B.VdlWi5/BUILD/php53-pecl-propro-2.1.0/src/php_propro_api.c:402:7: error: 'IS_UNDEF' undeclared (first use in this function); did you mean 'IS_UNUSED'? case IS_UNDEF: ^~~~~~~~ IS_UNUSED /tmp/B.VdlWi5/BUILD/php53-pecl-propro-2.1.0/src/php_propro_api.c:402:7: note: each undeclared identifier is reported only once for each function it appears in In file included from /usr/include/php/main/php.h:34, from /tmp/B.VdlWi5/BUILD/php53-pecl-propro-2.1.0/src/php_propro_api.c:18: /usr/include/php/Zend/zend.h:681:20: error: incompatible types when initializing type 'zval *' {aka 'struct _zval_struct *'} using type 'zval' {aka 'struct _zval_struct'} zval *orig_ptr = *(ppzv); \ ^ /tmp/B.VdlWi5/BUILD/php53-pecl-propro-2.1.0/src/php_propro_api.c:407:3: note: in expansion of macro 'SEPARATE_ZVAL' SEPARATE_ZVAL(container); ^~~~~~~~~~~~~ In file included from /usr/include/php/Zend/zend.h:754, from /usr/include/php/main/php.h:34, from /tmp/B.VdlWi5/BUILD/php53-pecl-propro-2.1.0/src/php_propro_api.c:18: /usr/include/php/Zend/zend_gc.h:206:7: error: incompatible types when assigning to type 'zval' {aka 'struct _zval_struct'} from type 'zval *' {aka 'struct _zval_struct *'} (z) = (zval*)emalloc(sizeof(zval_gc_info)); \ ^ /usr/include/php/Zend/zend.h:685:4: note: in expansion of macro 'ALLOC_ZVAL' ALLOC_ZVAL(*(ppzv)); \ ^~~~~~~~~~ /tmp/B.VdlWi5/BUILD/php53-pecl-propro-2.1.0/src/php_propro_api.c:407:3: note: in expansion of macro 'SEPARATE_ZVAL' SEPARATE_ZVAL(container); ^~~~~~~~~~~~~ /tmp/B.VdlWi5/BUILD/php53-pecl-propro-2.1.0/src/php_propro_api.c:407:3: error: cannot convert to a pointer type In file included from /usr/include/php/main/php.h:34, from /tmp/B.VdlWi5/BUILD/php53-pecl-propro-2.1.0/src/php_propro_api.c:18: /usr/include/php/Zend/zend.h:686:4: error: invalid type argument of unary '*' (have 'zval' {aka 'struct _zval_struct'}) **(ppzv) = *orig_ptr; \ ^~~~~~~~ /tmp/B.VdlWi5/BUILD/php53-pecl-propro-2.1.0/src/php_propro_api.c:407:3: note: in expansion of macro 'SEPARATE_ZVAL' SEPARATE_ZVAL(container); ^~~~~~~~~~~~~ In file included from /usr/include/php/Zend/zend.h:756, from /usr/include/php/main/php.h:34, from /tmp/B.VdlWi5/BUILD/php53-pecl-propro-2.1.0/src/php_propro_api.c:18: /usr/include/php/Zend/zend.h:687:19: error: incompatible type for argument 1 of '_zval_copy_ctor' zval_copy_ctor(*(ppzv)); \ /usr/include/php/Zend/zend_variables.h:54:49: note: in definition of macro 'zval_copy_ctor' #define zval_copy_ctor(zvalue) _zval_copy_ctor((zvalue) ZEND_FILE_LINE_CC) ^~~~~~ /tmp/B.VdlWi5/BUILD/php53-pecl-propro-2.1.0/src/php_propro_api.c:407:3: note: in expansion of macro 'SEPARATE_ZVAL' SEPARATE_ZVAL(container); ^~~~~~~~~~~~~ /usr/include/php/Zend/zend_variables.h:40:42: note: expected 'zval *' {aka 'struct _zval_struct *'} but argument is of type 'zval' {aka 'struct _zval_struct'} static inline void _zval_copy_ctor(zval *zvalue ZEND_FILE_LINE_DC) ~~~~~~^~~~~~ In file included from /usr/include/php/main/php.h:34, from /tmp/B.VdlWi5/BUILD/php53-pecl-propro-2.1.0/src/php_propro_api.c:18: /usr/include/php/Zend/zend.h:325:53: error: incompatible type for argument 1 of 'zval_set_refcount_p' #define Z_SET_REFCOUNT_PP(ppz, rc) Z_SET_REFCOUNT_P(*(ppz), rc) ^~~~~~ /usr/include/php/Zend/zend.h:334:54: note: in definition of macro 'Z_SET_REFCOUNT_P' #define Z_SET_REFCOUNT_P(pz, rc) zval_set_refcount_p(pz, rc) ^~ /usr/include/php/Zend/zend.h:688:4: note: in expansion of macro 'Z_SET_REFCOUNT_PP' Z_SET_REFCOUNT_PP(ppzv, 1); \ ^~~~~~~~~~~~~~~~~ /tmp/B.VdlWi5/BUILD/php53-pecl-propro-2.1.0/src/php_propro_api.c:407:3: note: in expansion of macro 'SEPARATE_ZVAL' SEPARATE_ZVAL(container); ^~~~~~~~~~~~~ In file included from /usr/include/php/main/php.h:34, from /tmp/B.VdlWi5/BUILD/php53-pecl-propro-2.1.0/src/php_propro_api.c:18: /usr/include/php/Zend/zend.h:376:63: note: expected 'zval *' {aka 'struct _zval_struct *'} but argument is of type 'zval' {aka 'struct _zval_struct'} static zend_always_inline zend_uint zval_set_refcount_p(zval* pz, zend_uint rc) { ~~~~~~^~ In file included from /usr/include/php/main/php.h:34, from /tmp/B.VdlWi5/BUILD/php53-pecl-propro-2.1.0/src/php_propro_api.c:18: /usr/include/php/Zend/zend.h:330:48: error: incompatible type for argument 1 of 'zval_unset_isref_p' #define Z_UNSET_ISREF_PP(ppz) Z_UNSET_ISREF_P(*(ppz)) ^~~~~~ /usr/include/php/Zend/zend.h:339:49: note: in definition of macro 'Z_UNSET_ISREF_P' #define Z_UNSET_ISREF_P(pz) zval_unset_isref_p(pz) ^~ /usr/include/php/Zend/zend.h:689:4: note: in expansion of macro 'Z_UNSET_ISREF_PP' Z_UNSET_ISREF_PP((ppzv)); \ ^~~~~~~~~~~~~~~~ /tmp/B.VdlWi5/BUILD/php53-pecl-propro-2.1.0/src/php_propro_api.c:407:3: note: in expansion of macro 'SEPARATE_ZVAL' SEPARATE_ZVAL(container); ^~~~~~~~~~~~~ In file included from /usr/include/php/main/php.h:34, from /tmp/B.VdlWi5/BUILD/php53-pecl-propro-2.1.0/src/php_propro_api.c:18: /usr/include/php/Zend/zend.h:396:62: note: expected 'zval *' {aka 'struct _zval_struct *'} but argument is of type 'zval' {aka 'struct _zval_struct'} static zend_always_inline zend_bool zval_unset_isref_p(zval* pz) { ~~~~~~^~ /tmp/B.VdlWi5/BUILD/php53-pecl-propro-2.1.0/src/php_propro_api.c:408:3: warning: implicit declaration of function 'Z_TRY_ADDREF_P'; did you mean 'Z_ADDREF_P'? [-Wimplicit-function-declaration] Z_TRY_ADDREF_P(container); ^~~~~~~~~~~~~~ Z_ADDREF_P /tmp/B.VdlWi5/BUILD/php53-pecl-propro-2.1.0/src/php_propro_api.c: At top level: /tmp/B.VdlWi5/BUILD/php53-pecl-propro-2.1.0/src/php_propro_api.c:416:58: error: unknown type name 'zend_string'; did you mean 'zend_stream'? static inline zval *set_container_value(zval *container, zend_string *member, zval *value) ^~~~~~~~~~~ zend_stream /tmp/B.VdlWi5/BUILD/php53-pecl-propro-2.1.0/src/php_propro_api.c:430:68: error: macro "zend_hash_next_index_insert" requires 4 arguments, but only 2 given value = zend_hash_next_index_insert(Z_ARRVAL_P(container), value); ^ /tmp/B.VdlWi5/BUILD/php53-pecl-propro-2.1.0/src/php_propro_api.c: In function 'get_proxied_value': /tmp/B.VdlWi5/BUILD/php53-pecl-propro-2.1.0/src/php_propro_api.c:455:18: warning: implicit declaration of function 'get_container_value'; did you mean 'get_container'? [-Wimplicit-function-declaration] return_value = get_container_value(container, obj->proxy->member, return_value); ^~~~~~~~~~~~~~~~~~~ get_container /tmp/B.VdlWi5/BUILD/php53-pecl-propro-2.1.0/src/php_propro_api.c:455:16: warning: assignment to 'zval *' {aka 'struct _zval_struct *'} from 'int' makes pointer from integer without a cast [-Wint-conversion] return_value = get_container_value(container, obj->proxy->member, return_value); ^ /tmp/B.VdlWi5/BUILD/php53-pecl-propro-2.1.0/src/php_propro_api.c: In function 'set_proxied_value': /tmp/B.VdlWi5/BUILD/php53-pecl-propro-2.1.0/src/php_propro_api.c:478:3: warning: implicit declaration of function 'set_container_value'; did you mean 'set_container'? [-Wimplicit-function-declaration] set_container_value(container, obj->proxy->member, value); ^~~~~~~~~~~~~~~~~~~ set_container /tmp/B.VdlWi5/BUILD/php53-pecl-propro-2.1.0/src/php_propro_api.c:482:3: warning: implicit declaration of function 'Z_TRY_DELREF_P'; did you mean 'Z_DELREF_P'? [-Wimplicit-function-declaration] Z_TRY_DELREF_P(value); ^~~~~~~~~~~~~~ Z_DELREF_P /tmp/B.VdlWi5/BUILD/php53-pecl-propro-2.1.0/src/php_propro_api.c: In function 'read_dimension': /tmp/B.VdlWi5/BUILD/php53-pecl-propro-2.1.0/src/php_propro_api.c:493:2: error: unknown type name 'zend_string'; did you mean 'zend_stream'? zend_string *member = offset ? zval_get_string(offset) : NULL; ^~~~~~~~~~~ zend_stream /tmp/B.VdlWi5/BUILD/php53-pecl-propro-2.1.0/src/php_propro_api.c:493:33: warning: implicit declaration of function 'zval_get_string'; did you mean 'cfg_get_string'? [-Wimplicit-function-declaration] zend_string *member = offset ? zval_get_string(offset) : NULL; ^~~~~~~~~~~~~~~ cfg_get_string /tmp/B.VdlWi5/BUILD/php53-pecl-propro-2.1.0/src/php_propro_api.c:493:57: warning: pointer/integer type mismatch in conditional expression zend_string *member = offset ? zval_get_string(offset) : NULL; ^ In file included from /usr/include/php/main/php.h:38, from /tmp/B.VdlWi5/BUILD/php53-pecl-propro-2.1.0/src/php_propro_api.c:18: /usr/include/php/Zend/zend_API.h:567:10: error: invalid type argument of unary '*' (have 'int') *(z) = *(zv); \ ^~~~~ /usr/include/php/Zend/zend_API.h:592:38: note: in expansion of macro 'ZVAL_ZVAL' #define RETVAL_ZVAL(zv, copy, dtor) ZVAL_ZVAL(return_value, zv, copy, dtor) ^~~~~~~~~ /tmp/B.VdlWi5/BUILD/php53-pecl-propro-2.1.0/src/php_propro_api.c:508:4: note: in expansion of macro 'RETVAL_ZVAL' RETVAL_ZVAL(get_container_value(value, member, &tmp), 1, 0); ^~~~~~~~~~~ In file included from /usr/include/php/Zend/zend.h:755, from /usr/include/php/main/php.h:34, from /tmp/B.VdlWi5/BUILD/php53-pecl-propro-2.1.0/src/php_propro_api.c:18: /usr/include/php/Zend/zend_operators.h:435:33: error: invalid type argument of unary '*' (have 'int') #define Z_TYPE_P(zval_p) Z_TYPE(*zval_p) /usr/include/php/Zend/zend_operators.h:434:24: note: in definition of macro 'Z_TYPE' #define Z_TYPE(zval) (zval).type ^~~~ /usr/include/php/Zend/zend_API.h:531:3: note: in expansion of macro 'Z_TYPE_P' Z_TYPE_P(z) = IS_NULL; \ ^~~~~~~~ /usr/include/php/Zend/zend_API.h:573:5: note: in expansion of macro 'ZVAL_NULL' ZVAL_NULL(zv); \ ^~~~~~~~~ /usr/include/php/Zend/zend_API.h:592:38: note: in expansion of macro 'ZVAL_ZVAL' #define RETVAL_ZVAL(zv, copy, dtor) ZVAL_ZVAL(return_value, zv, copy, dtor) ^~~~~~~~~ /tmp/B.VdlWi5/BUILD/php53-pecl-propro-2.1.0/src/php_propro_api.c:508:4: note: in expansion of macro 'RETVAL_ZVAL' RETVAL_ZVAL(get_container_value(value, member, &tmp), 1, 0); ^~~~~~~~~~~ In file included from /usr/include/php/Zend/zend.h:756, from /usr/include/php/main/php.h:34, from /tmp/B.VdlWi5/BUILD/php53-pecl-propro-2.1.0/src/php_propro_api.c:18: /usr/include/php/Zend/zend_API.h:575:18: error: lvalue required as unary '&' operand zval_ptr_dtor(&zv); \ ^ /usr/include/php/Zend/zend_variables.h:56:49: note: in definition of macro 'zval_ptr_dtor' #define zval_ptr_dtor(zval_ptr) _zval_ptr_dtor((zval_ptr) ZEND_FILE_LINE_CC) ^~~~~~~~ /usr/include/php/Zend/zend_API.h:592:38: note: in expansion of macro 'ZVAL_ZVAL' #define RETVAL_ZVAL(zv, copy, dtor) ZVAL_ZVAL(return_value, zv, copy, dtor) ^~~~~~~~~ /tmp/B.VdlWi5/BUILD/php53-pecl-propro-2.1.0/src/php_propro_api.c:508:4: note: in expansion of macro 'RETVAL_ZVAL' RETVAL_ZVAL(get_container_value(value, member, &tmp), 1, 0); ^~~~~~~~~~~ /tmp/B.VdlWi5/BUILD/php53-pecl-propro-2.1.0/src/php_propro_api.c:520:14: warning: implicit declaration of function 'zend_long_to_str'; did you mean 'zend_do_goto'? [-Wimplicit-function-declaration] member = zend_long_to_str(zend_hash_next_free_element( ^~~~~~~~~~~~~~~~ zend_do_goto /tmp/B.VdlWi5/BUILD/php53-pecl-propro-2.1.0/src/php_propro_api.c:520:12: warning: assignment to 'int *' from 'int' makes pointer from integer without a cast [-Wint-conversion] member = zend_long_to_str(zend_hash_next_free_element( ^ /tmp/B.VdlWi5/BUILD/php53-pecl-propro-2.1.0/src/php_propro_api.c:523:12: warning: assignment to 'int *' from 'int' makes pointer from integer without a cast [-Wint-conversion] member = zend_long_to_str(0); ^ /tmp/B.VdlWi5/BUILD/php53-pecl-propro-2.1.0/src/php_propro_api.c:527:11: warning: implicit declaration of function 'php_property_proxy_init'; did you mean 'php_property_proxy_free'? [-Wimplicit-function-declaration] proxy = php_property_proxy_init(NULL, member); ^~~~~~~~~~~~~~~~~~~~~~~ php_property_proxy_free /tmp/B.VdlWi5/BUILD/php53-pecl-propro-2.1.0/src/php_propro_api.c:527:9: warning: assignment to 'php_property_proxy_t *' {aka 'struct php_property_proxy *'} from 'int' makes pointer from integer without a cast [-Wint-conversion] proxy = php_property_proxy_init(NULL, member); ^ /tmp/B.VdlWi5/BUILD/php53-pecl-propro-2.1.0/src/php_propro_api.c:530:3: warning: implicit declaration of function 'RETVAL_OBJ'; did you mean 'RETVAL_BOOL'? [-Wimplicit-function-declaration] RETVAL_OBJ(&proxy_obj->zo); ^~~~~~~~~~ RETVAL_BOOL /tmp/B.VdlWi5/BUILD/php53-pecl-propro-2.1.0/src/php_propro_api.c: In function 'has_dimension': /tmp/B.VdlWi5/BUILD/php53-pecl-propro-2.1.0/src/php_propro_api.c:556:3: error: unknown type name 'zend_string'; did you mean 'zend_stream'? zend_string *zs = zval_get_string(offset); ^~~~~~~~~~~ zend_stream /tmp/B.VdlWi5/BUILD/php53-pecl-propro-2.1.0/src/php_propro_api.c:556:21: warning: initialization of 'int *' from 'int' makes pointer from integer without a cast [-Wint-conversion] zend_string *zs = zval_get_string(offset); ^~~~~~~~~~~~~~~ /tmp/B.VdlWi5/BUILD/php53-pecl-propro-2.1.0/src/php_propro_api.c:560:57: warning: passing argument 2 of 'zend_symtable_find' from incompatible pointer type [-Wincompatible-pointer-types] zval *zentry = zend_symtable_find(Z_ARRVAL_P(value), zs); ^~ In file included from /usr/include/php/Zend/zend.h:270, from /usr/include/php/main/php.h:34, from /tmp/B.VdlWi5/BUILD/php53-pecl-propro-2.1.0/src/php_propro_api.c:18: /usr/include/php/Zend/zend_hash.h:357:65: note: expected 'const char *' but argument is of type 'int *' static inline int zend_symtable_find(HashTable *ht, const char *arKey, uint nKeyLength, void **pData) ~~~~~~~~~~~~^~~~~ /tmp/B.VdlWi5/BUILD/php53-pecl-propro-2.1.0/src/php_propro_api.c:560:19: error: too few arguments to function 'zend_symtable_find' zval *zentry = zend_symtable_find(Z_ARRVAL_P(value), zs); ^~~~~~~~~~~~~~~~~~ In file included from /usr/include/php/Zend/zend.h:270, from /usr/include/php/main/php.h:34, from /tmp/B.VdlWi5/BUILD/php53-pecl-propro-2.1.0/src/php_propro_api.c:18: /usr/include/php/Zend/zend_hash.h:357:19: note: declared here static inline int zend_symtable_find(HashTable *ht, const char *arKey, uint nKeyLength, void **pData) ^~~~~~~~~~~~~~~~~~ /tmp/B.VdlWi5/BUILD/php53-pecl-propro-2.1.0/src/php_propro_api.c:564:16: warning: implicit declaration of function 'Z_ISNULL_P'; did you mean 'Z_ISREF_P'? [-Wimplicit-function-declaration] exists = !Z_ISNULL_P(zentry); ^~~~~~~~~~ Z_ISREF_P /tmp/B.VdlWi5/BUILD/php53-pecl-propro-2.1.0/src/php_propro_api.c: In function 'write_dimension': /tmp/B.VdlWi5/BUILD/php53-pecl-propro-2.1.0/src/php_propro_api.c:582:2: error: unknown type name 'zend_string'; did you mean 'zend_stream'? zend_string *zs = NULL; ^~~~~~~~~~~ zend_stream /tmp/B.VdlWi5/BUILD/php53-pecl-propro-2.1.0/src/php_propro_api.c:588:6: warning: assignment to 'int *' from 'int' makes pointer from integer without a cast [-Wint-conversion] zs = zval_get_string(offset); ^ /tmp/B.VdlWi5/BUILD/php53-pecl-propro-2.1.0/src/php_propro_api.c: In function 'unset_dimension': /tmp/B.VdlWi5/BUILD/php53-pecl-propro-2.1.0/src/php_propro_api.c:617:3: error: unknown type name 'zend_string'; did you mean 'zend_stream'? zend_string *o = zval_get_string(offset); ^~~~~~~~~~~ zend_stream /tmp/B.VdlWi5/BUILD/php53-pecl-propro-2.1.0/src/php_propro_api.c:617:20: warning: initialization of 'int *' from 'int' makes pointer from integer without a cast [-Wint-conversion] zend_string *o = zval_get_string(offset); ^~~~~~~~~~~~~~~ /tmp/B.VdlWi5/BUILD/php53-pecl-propro-2.1.0/src/php_propro_api.c:619:3: warning: implicit declaration of function 'SEPARATE_ARRAY'; did you mean 'SEPARATE_ZVAL'? [-Wimplicit-function-declaration] SEPARATE_ARRAY(array); ^~~~~~~~~~~~~~ SEPARATE_ZVAL /tmp/B.VdlWi5/BUILD/php53-pecl-propro-2.1.0/src/php_propro_api.c:620:40: warning: passing argument 2 of 'zend_symtable_del' from incompatible pointer type [-Wincompatible-pointer-types] zend_symtable_del(Z_ARRVAL_P(array), o); ^ In file included from /usr/include/php/Zend/zend.h:270, from /usr/include/php/main/php.h:34, from /tmp/B.VdlWi5/BUILD/php53-pecl-propro-2.1.0/src/php_propro_api.c:18: /usr/include/php/Zend/zend_hash.h:350:64: note: expected 'const char *' but argument is of type 'int *' static inline int zend_symtable_del(HashTable *ht, const char *arKey, uint nKeyLength) ~~~~~~~~~~~~^~~~~ /tmp/B.VdlWi5/BUILD/php53-pecl-propro-2.1.0/src/php_propro_api.c:620:3: error: too few arguments to function 'zend_symtable_del' zend_symtable_del(Z_ARRVAL_P(array), o); ^~~~~~~~~~~~~~~~~ In file included from /usr/include/php/Zend/zend.h:270, from /usr/include/php/main/php.h:34, from /tmp/B.VdlWi5/BUILD/php53-pecl-propro-2.1.0/src/php_propro_api.c:18: /usr/include/php/Zend/zend_hash.h:350:19: note: declared here static inline int zend_symtable_del(HashTable *ht, const char *arKey, uint nKeyLength) ^~~~~~~~~~~~~~~~~ /tmp/B.VdlWi5/BUILD/php53-pecl-propro-2.1.0/src/php_propro_api.c: In function 'zim_propro___construct': /tmp/B.VdlWi5/BUILD/php53-pecl-propro-2.1.0/src/php_propro_api.c:638:2: error: unknown type name 'zend_string'; did you mean 'zend_stream'? zend_string *member; ^~~~~~~~~~~ zend_stream /tmp/B.VdlWi5/BUILD/php53-pecl-propro-2.1.0/src/php_propro_api.c:650:15: warning: assignment to 'php_property_proxy_t *' {aka 'struct php_property_proxy *'} from 'int' makes pointer from integer without a cast [-Wint-conversion] obj->proxy = php_property_proxy_init(NULL, member); ^ /tmp/B.VdlWi5/BUILD/php53-pecl-propro-2.1.0/src/php_propro_api.c:653:15: warning: assignment to 'php_property_proxy_t *' {aka 'struct php_property_proxy *'} from 'int' makes pointer from integer without a cast [-Wint-conversion] obj->proxy = php_property_proxy_init(container, member); ^ /tmp/B.VdlWi5/BUILD/php53-pecl-propro-2.1.0/src/php_propro_api.c: In function 'zm_startup_propro': /tmp/B.VdlWi5/BUILD/php53-pecl-propro-2.1.0/src/php_propro_api.c:673:48: warning: assignment to 'zend_object_value (*)(zend_class_entry *)' {aka 'struct _zend_object_value (*)(struct _zend_class_entry *)'} from incompatible pointer type 'zend_object * (*)(zend_class_entry *)' {aka 'struct _zend_object * (*)(struct _zend_class_entry *)'} [-Wincompatible-pointer-types] php_property_proxy_class_entry->create_object = php_property_proxy_object_new; ^ /tmp/B.VdlWi5/BUILD/php53-pecl-propro-2.1.0/src/php_propro_api.c:678:37: error: 'zend_object_handlers' {aka 'struct _zend_object_handlers'} has no member named 'offset'; did you mean 'set'? php_property_proxy_object_handlers.offset = XtOffsetOf(php_property_proxy_object_t, zo); ^~~~~~ set /tmp/B.VdlWi5/BUILD/php53-pecl-propro-2.1.0/src/php_propro_api.c:679:37: error: 'zend_object_handlers' {aka 'struct _zend_object_handlers'} has no member named 'free_obj'; did you mean 'clone_obj'? php_property_proxy_object_handlers.free_obj = destroy_obj; ^~~~~~~~ clone_obj /tmp/B.VdlWi5/BUILD/php53-pecl-propro-2.1.0/src/php_propro_api.c:680:37: error: 'zend_object_handlers' {aka 'struct _zend_object_handlers'} has no member named 'get_gc'; did you mean 'get'? php_property_proxy_object_handlers.get_gc = get_gc; ^~~~~~ get /tmp/B.VdlWi5/BUILD/php53-pecl-propro-2.1.0/src/php_propro_api.c:682:41: warning: assignment to 'zend_object_set_t' {aka 'void (*)(struct _zval_struct **, struct _zval_struct *)'} from incompatible pointer type 'void (*)(zval *, zval *)' {aka 'void (*)(struct _zval_struct *, struct _zval_struct *)'} [-Wincompatible-pointer-types] php_property_proxy_object_handlers.set = set_obj; ^ /tmp/B.VdlWi5/BUILD/php53-pecl-propro-2.1.0/src/php_propro_api.c:683:41: warning: assignment to 'zend_object_get_t' {aka 'struct _zval_struct * (*)(struct _zval_struct *)'} from incompatible pointer type 'zval * (*)(zval *, zval *)' {aka 'struct _zval_struct * (*)(struct _zval_struct *, struct _zval_struct *)'} [-Wincompatible-pointer-types] php_property_proxy_object_handlers.get = get_obj; ^ /tmp/B.VdlWi5/BUILD/php53-pecl-propro-2.1.0/src/php_propro_api.c:685:52: warning: assignment to 'zend_object_read_dimension_t' {aka 'struct _zval_struct * (*)(struct _zval_struct *, struct _zval_struct *, int)'} from incompatible pointer type 'zval * (*)(zval *, zval *, int, zval *)' {aka 'struct _zval_struct * (*)(struct _zval_struct *, struct _zval_struct *, int, struct _zval_struct *)'} [-Wincompatible-pointer-types] php_property_proxy_object_handlers.read_dimension = read_dimension; ^ make: *** [Makefile:207: src/php_propro_api.lo] Error 1 error: Bad exit status from /tmp/B.VdlWi5/BUILD/tmp/rpm-tmp.53626 (%build) RPM build errors: Bad exit status from /tmp/B.VdlWi5/BUILD/tmp/rpm-tmp.53626 (%build) ended at: Thu Oct 11 18:48:41 2018, done in 0:00:04.800040 error: No files produced. mesg: ttyname failed: Inappropriate ioctl for device + chmod -R u+rwX /tmp/B.VdlWi5/BUILD + rm -rf /tmp/B.VdlWi5/tmp /tmp/B.VdlWi5/BUILD mesg: ttyname failed: Inappropriate ioctl for device + rm -rf /tmp/B.VdlWi5 Begin-PLD-Builder-Info Build-Time: user:14.86s sys:2.81s real:28.60s (faults io:0 non-io:888791) End-PLD-Builder-Info
[Back to list of logs] [View rpm -qa of builder]