FailedOk

th/SRPMS[OK]
th/x32[OK]
th/i686[OK]
th/x86_64[OK]

ac/SRPMS[OK]
ac/i386[OK]
ac/i586[OK]
ac/i686[OK]
ac/alpha[OK]
ac/amd64[OK]
ac/athlon[OK]
ac/ppc[OK]
ac/sparc[OK]
ac/sparc64[OK]

Advanced Search
main()
Powered by PLD Linux
(c) 2002-2018 PLD Team
$Revision: 1.37 $
Powered by voodoo magic.
Your IP: 54.80.188.87

php-pecl-raphf 06ae70ae-9385-4781-a575-3e029d116d28

Status:Failed
Source URL:ftp://buildlogs.pld-linux.org/th/x86_64/FAIL/php-pecl-raphf,06ae70ae-9385-4781-a575-3e029d116d28.bz2
text/plain URL:View!
full text:View!
rpm -qa of builder:View!
Date:2018/10/11 18:45:17
Runtime:0:00:04.744149

Toc:

  • error 1
  • rpm: error: Failed build dependencies:
  • error 2
  • rpm: error: Failed build dependencies:
  • prep
  • Executing(%prep): /bin/sh -e /tmp/B.QBr3rz/BUILD/tmp/rpm-tmp.79734
  • build
  • Executing(%build): /bin/sh -e /tmp/B.QBr3rz/BUILD/tmp/rpm-tmp.79734
  • error 3
  • ./php_raphf_api.h:204:2: error: unknown type name 'zend_string'
  • error 4
  • ./php_raphf_api.h:230:3: error: unknown type name 'zend_string'; did you mean 'zend_stream'?
  • error 5
  • ./php_raphf_api.h:252:3: error: unknown type name 'zend_string'; did you mean 'zend_stream'?
  • error 6
  • ./php_raphf_api.h:252:22: error: unknown type name 'zend_string'; did you mean 'zend_stream'?
  • error 7
  • ./php_raphf_api.h:387:50: error: unknown type name 'zend_string'; did you mean 'zend_stream'?
  • error 8
  • ./php_raphf_api.h:388:3: error: unknown type name 'zend_string'; did you mean 'zend_stream'?
  • error 9
  • /tmp/B.QBr3rz/BUILD/php56-pecl-raphf-2.0.0/src/php_raphf_api.c:153:9: error: 'zend_hash_key' {aka 'struct _zend_hash_key'} has no member named 'key'
  • error 10
  • /tmp/B.QBr3rz/BUILD/php56-pecl-raphf-2.0.0/src/php_raphf_api.c:154:32: error: 'zend_hash_key' {aka 'struct _zend_hash_key'} has no member named 'key'
  • error 11
  • /tmp/B.QBr3rz/BUILD/php56-pecl-raphf-2.0.0/src/php_raphf_api.c:154:47: error: 'zend_hash_key' {aka 'struct _zend_hash_key'} has no member named 'key'
  • error 12
  • /tmp/B.QBr3rz/BUILD/php56-pecl-raphf-2.0.0/src/php_raphf_api.c:173:9: error: 'zend_hash_key' {aka 'struct _zend_hash_key'} has no member named 'key'
  • error 13
  • /tmp/B.QBr3rz/BUILD/php56-pecl-raphf-2.0.0/src/php_raphf_api.c:174:41: error: macro "zend_hash_update" requires 6 arguments, but only 3 given
  • error 14
  • /tmp/B.QBr3rz/BUILD/php56-pecl-raphf-2.0.0/src/php_raphf_api.c:174:3: error: 'zend_hash_update' undeclared (first use in this function); did you mean '_zend_hash_splice'?
  • error 15
  • /tmp/B.QBr3rz/BUILD/php56-pecl-raphf-2.0.0/src/php_raphf_api.c:176:45: error: macro "zend_hash_index_update" requires 5 arguments, but only 3 given
  • error 16
  • /tmp/B.QBr3rz/BUILD/php56-pecl-raphf-2.0.0/src/php_raphf_api.c:176:3: error: 'zend_hash_index_update' undeclared (first use in this function); did you mean 'zend_hash_index_exists'?
  • error 17
  • /tmp/B.QBr3rz/BUILD/php56-pecl-raphf-2.0.0/src/php_raphf_api.c:246:47: error: unknown type name 'zend_string'; did you mean 'zend_stream'?
  • error 18
  • /tmp/B.QBr3rz/BUILD/php56-pecl-raphf-2.0.0/src/php_raphf_api.c:283:2: error: unknown type name 'zend_string'; did you mean 'zend_stream'?
  • error 19
  • /tmp/B.QBr3rz/BUILD/php56-pecl-raphf-2.0.0/src/php_raphf_api.c:283:36: error: unknown type name 'zend_string'
  • error 20
  • /tmp/B.QBr3rz/BUILD/php56-pecl-raphf-2.0.0/src/php_raphf_api.c:286:20: error: request for member 'len' in something not a structure or union
  • error 21
  • /tmp/B.QBr3rz/BUILD/php56-pecl-raphf-2.0.0/src/php_raphf_api.c:311:48: error: unknown type name 'zend_string'; did you mean 'zend_stream'?
  • error 22
  • /tmp/B.QBr3rz/BUILD/php56-pecl-raphf-2.0.0/src/php_raphf_api.c:343:3: error: unknown type name 'zend_string'; did you mean 'zend_stream'?
  • error 23
  • /tmp/B.QBr3rz/BUILD/php56-pecl-raphf-2.0.0/src/php_raphf_api.c:343:22: error: unknown type name 'zend_string'; did you mean 'zend_stream'?
  • error 24
  • /tmp/B.QBr3rz/BUILD/php56-pecl-raphf-2.0.0/src/php_raphf_api.c:400:60: error: macro "zend_hash_get_current_key" requires 4 arguments, but only 3 given
  • error 25
  • /tmp/B.QBr3rz/BUILD/php56-pecl-raphf-2.0.0/src/php_raphf_api.c:400:9: error: 'zend_hash_get_current_key' undeclared (first use in this function); did you mean 'zend_hash_get_current_key_ex'?
  • error 26
  • /tmp/B.QBr3rz/BUILD/php56-pecl-raphf-2.0.0/src/php_raphf_api.c:401:45: error: macro "zend_hash_get_current_data" requires 2 arguments, but only 1 given
  • error 27
  • /tmp/B.QBr3rz/BUILD/php56-pecl-raphf-2.0.0/src/php_raphf_api.c:401:7: error: 'zend_hash_get_current_data' undeclared (first use in this function); did you mean 'zend_hash_get_current_data_ex'?
  • error 28
  • /tmp/B.QBr3rz/BUILD/php56-pecl-raphf-2.0.0/src/php_raphf_api.c:463:36: error: unknown type name 'zend_string'; did you mean 'zend_stream'?
  • error 29
  • /tmp/B.QBr3rz/BUILD/php56-pecl-raphf-2.0.0/src/php_raphf_api.c:463:55: error: unknown type name 'zend_string'; did you mean 'zend_stream'?
  • error 30
  • /tmp/B.QBr3rz/BUILD/php56-pecl-raphf-2.0.0/src/php_raphf_api.c:541:2: error: unknown type name 'zend_string'; did you mean 'zend_stream'?
  • error 31
  • /tmp/B.QBr3rz/BUILD/php56-pecl-raphf-2.0.0/src/php_raphf_api.c:586:3: error: too few arguments to function 'zend_hash_copy'
  • error 32
  • /tmp/B.QBr3rz/BUILD/php56-pecl-raphf-2.0.0/src/php_raphf_api.c:629:39: error: 'zend_hash_key' {aka 'struct _zend_hash_key'} has no member named 'key'
  • error 33
  • /tmp/B.QBr3rz/BUILD/php56-pecl-raphf-2.0.0/src/php_raphf_api.c:629:54: error: 'zend_hash_key' {aka 'struct _zend_hash_key'} has no member named 'key'
  • error 34
  • error: Bad exit status from /tmp/B.QBr3rz/BUILD/tmp/rpm-tmp.79734 (%build)
  • error 35
  • RPM build errors:
  • error 36
  • error: No files produced.

Content:

checking if we should skip the build
started at: Thu Oct 11 18:44:52 2018
killing old processes on a builder
mesg: ttyname failed: Inappropriate ioctl for device
sending signal 9 to pid -1
Killed
cleaning up /tmp
mesg: ttyname failed: Inappropriate ioctl for device
fetching https://srcbuilder.pld-linux.org/th//srpms/06ae70ae-9385-4781-a575-3e029d116d28/php56-pecl-raphf-2.0.0-1.src.rpm
fetched 26470 bytes, 59.1 K/s
installing srpm: php56-pecl-raphf-2.0.0-1.src.rpm
mesg: ttyname failed: Inappropriate ioctl for device
+ install -d /tmp/B.QBr3rz/BUILD /tmp/B.QBr3rz/RPMS
+ LC_ALL=en_US.UTF-8
+ rpm -qp --changelog php56-pecl-raphf-2.0.0-1.src.rpm
* Thu Oct 11 2018 PLD Linux Team <feedback@pld-linux.org>
- For complete changelog see: http://git.pld-linux.org/?p=packages/php-pecl-raphf.git;a=log;h=auto/th/php-pecl-raphf-2.0.0-1
* Mon Oct 08 2018 Adam Gołębiowski <adamg@pld-linux.org> 64b819e
- updated to 2.0.0 + rpm -Uhv --nodeps --define '_topdir /tmp/B.QBr3rz' --define '_specdir %{_topdir}' --define '_sourcedir %{_specdir}' --define '_rpmdir %{_topdir}/RPMS' --define '_builddir %{_topdir}/BUILD' --define 'php_suffix 56' php56-pecl-raphf-2.0.0-1.src.rpm Preparing... ################################################## php56-pecl-raphf ################################################## + rm -f php56-pecl-raphf-2.0.0-1.src.rpm mesg: ttyname failed: Inappropriate ioctl for device + install -m 700 -d /tmp/B.QBr3rz/BUILD/tmp mesg: ttyname failed: Inappropriate ioctl for device + TMPDIR=/tmp/B.QBr3rz/BUILD/tmp + exec nice -n 0 rpmbuild -bp --short-circuit --nodeps --define '_topdir /tmp/B.QBr3rz' --define '_specdir %{_topdir}' --define '_sourcedir %{_specdir}' --define '_rpmdir %{_topdir}/RPMS' --define '_builddir %{_topdir}/BUILD' --target x86_64-pld-linux --define 'php_suffix 56' --define 'prep exit 0' /tmp/B.QBr3rz/php-pecl-raphf.spec Building target platforms: x86_64-pld-linux checking BuildConflict-ing packages no BuildConflicts found checking BR rpm: error: Failed build dependencies: rpm: php56-devel >= 3:5.3.0 is needed by php56-pecl-raphf-2.0.0-1.src rpm: Building target platforms: x86_64-pld-linux updating poldek cache... ready is up to date Retrieving th::packages.ndir.md... th is up to date Retrieving th::packages.ndir.md... th is up to date Retrieving th-ready::packages.ndir.md... th-ready is up to date Retrieving th-ready::packages.ndir.md... th-ready is up to date Retrieving th-test::packages.ndir.md... th-test is up to date Retrieving th-test::packages.ndir.md... th-test is up to date checking conflicting packages in BRed packages poldek: Loading [pndir]ready... poldek: Loading [pndir]th-test... poldek: Loading [pndir]th-test... poldek: Loading [pndir]th-ready... poldek: Loading [pndir]th-ready... poldek: Loading [pndir]th... poldek: Loading [pndir]th... poldek: 32170 packages read poldek: Removed 5047 duplicate packages from available set poldek: Processing dependencies... poldek: php56-devel-5.6.38-2.x86_64 marks php56-common-5.6.38-2.x86_64 (cap /usr/lib64/php56) poldek: There are 2 packages to install (1 marked by dependencies): poldek: I php56-devel-5.6.38-2.x86_64 poldek: D php56-common-5.6.38-2.x86_64 poldek: This operation will use 7.4MB of disk space. poldek: Need to get 1.7MB of archives (1.7MB to download). poldek: poldek: Retrieving [1/2] th-test::php56-common-5.6.38-2.x86_64.rpm... poldek: ..............................done poldek: Retrieving [2/2] th-test::php56-devel-5.6.38-2.x86_64.rpm... poldek: ..............................done poldek: Executing pm-command.sh --upgrade -vh --test --root / --define _check_dirname_deps 1... poldek: Preparing... ################################################## no conflicts found checking BR rpm: error: Failed build dependencies: rpm: php56-devel >= 3:5.3.0 is needed by php56-pecl-raphf-2.0.0-1.src rpm: Building target platforms: x86_64-pld-linux installing BR: php56\-devel + poldek --noask --caplookup -Q -v '--ignore=hhvm-*' '--ignore=php4-*' '--ignore=php52-*' '--ignore=php53-*' '--ignore=php54-*' '--ignore=php55-*' '--ignore=php70-*' '--ignore=php71-*' '--ignore=php72-*' '--ignore=php73-*' --upgrade php56-devel Loading [pndir]ready... Loading [pndir]th-test... Loading [pndir]th-test... Loading [pndir]th-ready... Loading [pndir]th-ready... Loading [pndir]th... Loading [pndir]th... 32170 packages read Removed 5047 duplicate packages from available set Processing dependencies... php56-devel-5.6.38-2.x86_64 marks php56-common-5.6.38-2.x86_64 (cap /usr/lib64/php56) There are 2 packages to install (1 marked by dependencies): I php56-devel-5.6.38-2.x86_64 D php56-common-5.6.38-2.x86_64 This operation will use 7.4MB of disk space. Need to get 1.7MB of archives. Executing pm-command.sh --upgrade -vh --root / --define _check_dirname_deps 1... Preparing... ################################################## php56-common ################################################## php56-devel ################################################## building RPM using: set -ex; : build-id: 06ae70ae-9385-4781-a575-3e029d116d28; TMPDIR=/tmp/B.QBr3rz/BUILD/tmp exec nice -n 0 rpmbuild -bb --define '_smp_mflags -j9' --define '_make_opts -Otarget' --define '_pld_builder 1' --define '_topdir /tmp/B.QBr3rz' --define '_specdir %{_topdir}' --define '_sourcedir %{_specdir}' --define '_rpmdir %{_topdir}/RPMS' --define '_builddir %{_topdir}/BUILD' --target x86_64-pld-linux --define 'php_suffix 56' /tmp/B.QBr3rz/php-pecl-raphf.spec mesg: ttyname failed: Inappropriate ioctl for device + : build-id: 06ae70ae-9385-4781-a575-3e029d116d28 + TMPDIR=/tmp/B.QBr3rz/BUILD/tmp + exec nice -n 0 rpmbuild -bb --define '_smp_mflags -j9' --define '_make_opts -Otarget' --define '_pld_builder 1' --define '_topdir /tmp/B.QBr3rz' --define '_specdir %{_topdir}' --define '_sourcedir %{_specdir}' --define '_rpmdir %{_topdir}/RPMS' --define '_builddir %{_topdir}/BUILD' --target x86_64-pld-linux --define 'php_suffix 56' /tmp/B.QBr3rz/php-pecl-raphf.spec Building target platforms: x86_64-pld-linux Executing(%prep): /bin/sh -e /tmp/B.QBr3rz/BUILD/tmp/rpm-tmp.79734 + umask 022 + cd /tmp/B.QBr3rz/BUILD + cd /tmp/B.QBr3rz/BUILD + rm -rf php56-pecl-raphf-2.0.0 + /bin/mkdir -p php56-pecl-raphf-2.0.0 + cd php56-pecl-raphf-2.0.0 + /usr/bin/gzip -dc /tmp/B.QBr3rz/raphf-2.0.0.tgz + /bin/tar -xf - + STATUS=0 + '[' 0 -ne 0 ']' + /bin/id -u + '[' 1000 '=' 0 ']' + /bin/id -u + '[' 1000 '=' 0 ']' + /bin/chmod -Rf a+rX,u+w,g-w,o-w . + mv raphf-2.0.0/AUTHORS raphf-2.0.0/BUGS raphf-2.0.0/CONTRIBUTING.md raphf-2.0.0/CREDITS raphf-2.0.0/Doxyfile raphf-2.0.0/LICENSE raphf-2.0.0/Makefile.frag raphf-2.0.0/README.md raphf-2.0.0/THANKS raphf-2.0.0/TODO raphf-2.0.0/config.m4 raphf-2.0.0/config.w32 raphf-2.0.0/config0.m4 raphf-2.0.0/php_raphf.h raphf-2.0.0/scripts raphf-2.0.0/src raphf-2.0.0/tests . + exit 0 Executing(%build): /bin/sh -e /tmp/B.QBr3rz/BUILD/tmp/rpm-tmp.79734 TMP=/home/users/builder/tmp HOME=/home/users/builder PATH=/home/users/builder/GNUstep/Tools:/usr/local/bin:/usr/bin:/bin:/home/users/builder/bin TMPDIR=/tmp/B.QBr3rz/BUILD/tmp + umask 022 + cd /tmp/B.QBr3rz/BUILD + cd php56-pecl-raphf-2.0.0 + phpize Configuring for: PHP Api Version: 20131106 Zend Module Api No: 20131226 Zend Extension Api No: 220131226 + libtoolize --copy --force --install libtoolize: putting auxiliary files in '.'. libtoolize: copying file './config.guess' libtoolize: copying file './config.sub' libtoolize: copying file './install-sh' libtoolize: copying file './ltmain.sh' libtoolize: Consider adding 'AC_CONFIG_MACRO_DIRS([m4])' to configure.in, libtoolize: and rerunning libtoolize and aclocal. libtoolize: Consider adding '-I m4' to ACLOCAL_AMFLAGS in Makefile.am. + ./configure 'LDFLAGS=-Wl,--as-needed -Wl,--no-copy-dt-needed-entries -Wl,-z,relro -Wl,-z,combreloc ' 'CFLAGS=-O2 -fwrapv -pipe -Wformat -Werror=format-security -gdwarf-4 -fno-debug-types-section -fvar-tracking-assignments -g2 -Wp,-D_FORTIFY_SOURCE=2 -fstack-protector-strong --param=ssp-buffer-size=4 -fPIC -march=x86-64 -gdwarf-4 -fno-debug-types-section -fvar-tracking-assignments -g2 ' 'CXXFLAGS=-O2 -fwrapv -pipe -Wformat -Werror=format-security -gdwarf-4 -fno-debug-types-section -fvar-tracking-assignments -g2 -Wp,-D_FORTIFY_SOURCE=2 -fstack-protector-strong --param=ssp-buffer-size=4 -fPIC -march=x86-64 -gdwarf-4 -fno-debug-types-section -fvar-tracking-assignments -g2 ' 'FFLAGS=-O2 -fwrapv -pipe -Wformat -Werror=format-security -gdwarf-4 -fno-debug-types-section -fvar-tracking-assignments -g2 -Wp,-D_FORTIFY_SOURCE=2 -fstack-protector-strong --param=ssp-buffer-size=4 -fPIC -march=x86-64 -gdwarf-4 -fno-debug-types-section -fvar-tracking-assignments -g2 ' 'FCFLAGS=-O2 -fwrapv -pipe -Wformat -Werror=format-security -gdwarf-4 -fno-debug-types-section -fvar-tracking-assignments -g2 -Wp,-D_FORTIFY_SOURCE=2 -fstack-protector-strong --param=ssp-buffer-size=4 -fPIC -march=x86-64 -gdwarf-4 -fno-debug-types-section -fvar-tracking-assignments -g2 ' 'CPPFLAGS=' 'CC=x86_64-pld-linux-gcc' 'CXX=x86_64-pld-linux-g++' '--host=x86_64-pld-linux' '--build=x86_64-pld-linux' '--prefix=/usr' '--exec-prefix=/usr' '--bindir=/usr/bin' '--sbindir=/usr/sbin' '--sysconfdir=/etc' '--datadir=/usr/share' '--includedir=/usr/include' '--libdir=/usr/lib64' '--libexecdir=/usr/libexec' '--localstatedir=/var' '--sharedstatedir=/var/lib' '--mandir=/usr/share/man' '--infodir=/usr/share/info' '--x-libraries=/usr/lib64' checking for grep that handles long lines and -e... /bin/grep checking for egrep... /bin/grep -E checking for a sed that does not truncate output... /bin/sed checking for x86_64-pld-linux-cc... x86_64-pld-linux-gcc checking whether the C compiler works... yes checking for C compiler default output file name... a.out checking for suffix of executables... checking whether we are cross compiling... no checking for suffix of object files... o checking whether we are using the GNU C compiler... yes checking whether x86_64-pld-linux-gcc accepts -g... yes checking for x86_64-pld-linux-gcc option to accept ISO C89... none needed checking how to run the C preprocessor... x86_64-pld-linux-gcc -E checking for icc... no checking for suncc... no checking whether x86_64-pld-linux-gcc and cc understand -c and -o together... yes checking for system library directory... lib checking if compiler supports -R... no checking if compiler supports -Wl,-rpath,... yes checking build system type... x86_64-pld-linux-gnu checking host system type... x86_64-pld-linux-gnu checking target system type... x86_64-pld-linux-gnu checking for PHP prefix... /usr checking for PHP includes... -I/usr/include/php -I/usr/include/php/main -I/usr/include/php/TSRM -I/usr/include/php/Zend -I/usr/include/php/ext -I/usr/include/php/ext/date/lib checking for PHP extension directory... /usr/lib64/php56 checking for PHP installed headers prefix... /usr/include/php checking if debug is enabled... no checking if zts is enabled... no checking for re2c... re2c checking for re2c version... 0.13.5 (ok) checking for gawk... gawk checking whether to enable raphf support... yes, shared checking how to print strings... print -r checking for a sed that does not truncate output... (cached) /bin/sed checking for fgrep... /bin/grep -F checking for ld used by x86_64-pld-linux-gcc... /usr/bin/ld checking if the linker (/usr/bin/ld) is GNU ld... yes checking for BSD- or MS-compatible name lister (nm)... /usr/bin/nm -B checking the name lister (/usr/bin/nm -B) interface... BSD nm checking whether ln -s works... yes checking the maximum length of command line arguments... 1572864 checking how to convert x86_64-pld-linux-gnu file names to x86_64-pld-linux-gnu format... func_convert_file_noop checking how to convert x86_64-pld-linux-gnu file names to toolchain format... func_convert_file_noop checking for /usr/bin/ld option to reload object files... -r checking for x86_64-pld-linux-objdump... no checking for objdump... objdump checking how to recognize dependent libraries... pass_all checking for x86_64-pld-linux-dlltool... no checking for dlltool... no checking how to associate runtime and link libraries... print -r -- checking for x86_64-pld-linux-ar... no checking for ar... ar checking for archiver @FILE support... @ checking for x86_64-pld-linux-strip... no checking for strip... strip checking for x86_64-pld-linux-ranlib... no checking for ranlib... ranlib checking for mawk... (cached) gawk checking command to parse /usr/bin/nm -B output from x86_64-pld-linux-gcc object... ok checking for sysroot... no checking for a working dd... /bin/dd checking how to truncate binary pipes... /bin/dd bs=4096 count=1 checking for x86_64-pld-linux-mt... no checking for mt... no checking if : is a manifest tool... no checking for ANSI C header files... yes checking for sys/types.h... yes checking for sys/stat.h... yes checking for stdlib.h... yes checking for string.h... yes checking for memory.h... yes checking for strings.h... yes checking for inttypes.h... yes checking for stdint.h... yes checking for unistd.h... yes checking for dlfcn.h... yes checking for objdir... .libs checking if x86_64-pld-linux-gcc supports -fno-rtti -fno-exceptions... no checking for x86_64-pld-linux-gcc option to produce PIC... -fPIC -DPIC checking if x86_64-pld-linux-gcc PIC flag -fPIC -DPIC works... yes checking if x86_64-pld-linux-gcc static flag -static works... yes checking if x86_64-pld-linux-gcc supports -c -o file.o... yes checking if x86_64-pld-linux-gcc supports -c -o file.o... (cached) yes checking whether the x86_64-pld-linux-gcc linker (/usr/bin/ld -m elf_x86_64) supports shared libraries... yes checking whether -lc should be explicitly linked in... no checking dynamic linker characteristics... GNU/Linux ld.so checking how to hardcode library paths into programs... immediate checking whether stripping libraries is possible... yes checking if libtool supports shared libraries... yes checking whether to build shared libraries... yes checking whether to build static libraries... no configure: creating ./config.status config.status: creating config.h config.status: executing libtool commands + /usr/bin/make -Otarget -j9 /bin/sh /tmp/B.QBr3rz/BUILD/php56-pecl-raphf-2.0.0/libtool --mode=compile x86_64-pld-linux-gcc -I. -I/tmp/B.QBr3rz/BUILD/php56-pecl-raphf-2.0.0 -DPHP_ATOM_INC -I/tmp/B.QBr3rz/BUILD/php56-pecl-raphf-2.0.0/include -I/tmp/B.QBr3rz/BUILD/php56-pecl-raphf-2.0.0/main -I/tmp/B.QBr3rz/BUILD/php56-pecl-raphf-2.0.0 -I/usr/include/php -I/usr/include/php/main -I/usr/include/php/TSRM -I/usr/include/php/Zend -I/usr/include/php/ext -I/usr/include/php/ext/date/lib -I/tmp/B.QBr3rz/BUILD/php56-pecl-raphf-2.0.0/src -DHAVE_CONFIG_H -O2 -fwrapv -pipe -Wformat -Werror=format-security -gdwarf-4 -fno-debug-types-section -fvar-tracking-assignments -g2 -Wp,-D_FORTIFY_SOURCE=2 -fstack-protector-strong --param=ssp-buffer-size=4 -fPIC -march=x86-64 -gdwarf-4 -fno-debug-types-section -fvar-tracking-assignments -g2 -c /tmp/B.QBr3rz/BUILD/php56-pecl-raphf-2.0.0/src/php_raphf_api.c -o src/php_raphf_api.lo libtool: compile: x86_64-pld-linux-gcc -I. -I/tmp/B.QBr3rz/BUILD/php56-pecl-raphf-2.0.0 -DPHP_ATOM_INC -I/tmp/B.QBr3rz/BUILD/php56-pecl-raphf-2.0.0/include -I/tmp/B.QBr3rz/BUILD/php56-pecl-raphf-2.0.0/main -I/tmp/B.QBr3rz/BUILD/php56-pecl-raphf-2.0.0 -I/usr/include/php -I/usr/include/php/main -I/usr/include/php/TSRM -I/usr/include/php/Zend -I/usr/include/php/ext -I/usr/include/php/ext/date/lib -I/tmp/B.QBr3rz/BUILD/php56-pecl-raphf-2.0.0/src -DHAVE_CONFIG_H -O2 -fwrapv -pipe -Wformat -Werror=format-security -gdwarf-4 -fno-debug-types-section -fvar-tracking-assignments -g2 -Wp,-D_FORTIFY_SOURCE=2 -fstack-protector-strong --param=ssp-buffer-size=4 -fPIC -march=x86-64 -gdwarf-4 -fno-debug-types-section -fvar-tracking-assignments -g2 -c /tmp/B.QBr3rz/BUILD/php56-pecl-raphf-2.0.0/src/php_raphf_api.c -fPIC -DPIC -o src/.libs/php_raphf_api.o In file included from ./php_raphf.h:33, from /tmp/B.QBr3rz/BUILD/php56-pecl-raphf-2.0.0/src/php_raphf_api.c:20: ./php_raphf_api.h:204:2: error: unknown type name 'zend_string' zend_string *ident; ^~~~~~~~~~~ ./php_raphf_api.h:230:3: error: unknown type name 'zend_string'; did you mean 'zend_stream'? zend_string *name, php_resource_factory_ops_t *fops, ^~~~~~~~~~~ zend_stream ./php_raphf_api.h:252:3: error: unknown type name 'zend_string'; did you mean 'zend_stream'? zend_string *name, zend_string *ident, ^~~~~~~~~~~ zend_stream ./php_raphf_api.h:252:22: error: unknown type name 'zend_string'; did you mean 'zend_stream'? zend_string *name, zend_string *ident, ^~~~~~~~~~~ zend_stream ./php_raphf_api.h:387:50: error: unknown type name 'zend_string'; did you mean 'zend_stream'? PHP_RAPHF_API void php_persistent_handle_cleanup(zend_string *name, ^~~~~~~~~~~ zend_stream ./php_raphf_api.h:388:3: error: unknown type name 'zend_string'; did you mean 'zend_stream'? zend_string *ident); ^~~~~~~~~~~ zend_stream /tmp/B.QBr3rz/BUILD/php56-pecl-raphf-2.0.0/src/php_raphf_api.c: In function 'php_persistent_handle_apply_stat': /tmp/B.QBr3rz/BUILD/php56-pecl-raphf-2.0.0/src/php_raphf_api.c:146:39: warning: implicit declaration of function 'Z_PTR_P'; did you mean 'Z_AST_P'? [-Wimplicit-function-declaration] php_persistent_handle_list_t *list = Z_PTR_P(p); ^~~~~~~ Z_AST_P /tmp/B.QBr3rz/BUILD/php56-pecl-raphf-2.0.0/src/php_raphf_api.c:146:39: warning: initialization of 'php_persistent_handle_list_t *' {aka 'struct php_persistent_handle_list *'} from 'int' makes pointer from integer without a cast [-Wint-conversion] /tmp/B.QBr3rz/BUILD/php56-pecl-raphf-2.0.0/src/php_raphf_api.c:153:9: error: 'zend_hash_key' {aka 'struct _zend_hash_key'} has no member named 'key' if (key->key) { ^~ /tmp/B.QBr3rz/BUILD/php56-pecl-raphf-2.0.0/src/php_raphf_api.c:154:32: error: 'zend_hash_key' {aka 'struct _zend_hash_key'} has no member named 'key' add_assoc_zval_ex(zentry, key->key->val, key->key->len, &zsubentry); ^~ /tmp/B.QBr3rz/BUILD/php56-pecl-raphf-2.0.0/src/php_raphf_api.c:154:47: error: 'zend_hash_key' {aka 'struct _zend_hash_key'} has no member named 'key' add_assoc_zval_ex(zentry, key->key->val, key->key->len, &zsubentry); ^~ /tmp/B.QBr3rz/BUILD/php56-pecl-raphf-2.0.0/src/php_raphf_api.c: In function 'php_persistent_handle_apply_statall': /tmp/B.QBr3rz/BUILD/php56-pecl-raphf-2.0.0/src/php_raphf_api.c:164:47: warning: initialization of 'php_persistent_handle_provider_t *' {aka 'struct php_persistent_handle_provider *'} from 'int' makes pointer from integer without a cast [-Wint-conversion] php_persistent_handle_provider_t *provider = Z_PTR_P(p); ^~~~~~~ /tmp/B.QBr3rz/BUILD/php56-pecl-raphf-2.0.0/src/php_raphf_api.c:171:4: warning: passing argument 2 of 'zend_hash_apply_with_arguments' from incompatible pointer type [-Wincompatible-pointer-types] php_persistent_handle_apply_stat, 1, &zentry); ^~~~~~~~~~~~~~~~~~~~~~~~~~~~~~~~ In file included from /usr/include/php/Zend/zend.h:286, from /usr/include/php/main/php.h:35, from /tmp/B.QBr3rz/BUILD/php56-pecl-raphf-2.0.0/src/php_raphf_api.c:17: /usr/include/php/Zend/zend_hash.h:141:89: note: expected 'apply_func_args_t' {aka 'int (*)(void *, int, __va_list_tag *, struct _zend_hash_key *)'} but argument is of type 'int (*)(zval *, int, __va_list_tag *, zend_hash_key *)' {aka 'int (*)(struct _zval_struct *, int, __va_list_tag *, struct _zend_hash_key *)'} ZEND_API void zend_hash_apply_with_arguments(HashTable *ht TSRMLS_DC, apply_func_args_t apply_func, int, ...); ~~~~~~~~~~~~~~~~~~^~~~~~~~~~ /tmp/B.QBr3rz/BUILD/php56-pecl-raphf-2.0.0/src/php_raphf_api.c:173:9: error: 'zend_hash_key' {aka 'struct _zend_hash_key'} has no member named 'key' if (key->key) { ^~ /tmp/B.QBr3rz/BUILD/php56-pecl-raphf-2.0.0/src/php_raphf_api.c:174:41: error: macro "zend_hash_update" requires 6 arguments, but only 3 given zend_hash_update(ht, key->key, &zentry); ^ /tmp/B.QBr3rz/BUILD/php56-pecl-raphf-2.0.0/src/php_raphf_api.c:174:3: error: 'zend_hash_update' undeclared (first use in this function); did you mean '_zend_hash_splice'? zend_hash_update(ht, key->key, &zentry); ^~~~~~~~~~~~~~~~ _zend_hash_splice /tmp/B.QBr3rz/BUILD/php56-pecl-raphf-2.0.0/src/php_raphf_api.c:174:3: note: each undeclared identifier is reported only once for each function it appears in /tmp/B.QBr3rz/BUILD/php56-pecl-raphf-2.0.0/src/php_raphf_api.c:176:45: error: macro "zend_hash_index_update" requires 5 arguments, but only 3 given zend_hash_index_update(ht, key->h, &zentry); ^ /tmp/B.QBr3rz/BUILD/php56-pecl-raphf-2.0.0/src/php_raphf_api.c:176:3: error: 'zend_hash_index_update' undeclared (first use in this function); did you mean 'zend_hash_index_exists'? zend_hash_index_update(ht, key->h, &zentry); ^~~~~~~~~~~~~~~~~~~~~~ zend_hash_index_exists /tmp/B.QBr3rz/BUILD/php56-pecl-raphf-2.0.0/src/php_raphf_api.c: In function 'php_persistent_handle_apply_cleanup_ex': /tmp/B.QBr3rz/BUILD/php56-pecl-raphf-2.0.0/src/php_raphf_api.c:185:17: warning: initialization of 'void *' from 'int' makes pointer from integer without a cast [-Wint-conversion] void *handle = Z_PTR_P(p); ^~~~~~~ /tmp/B.QBr3rz/BUILD/php56-pecl-raphf-2.0.0/src/php_raphf_api.c: In function 'php_persistent_handle_apply_cleanup': /tmp/B.QBr3rz/BUILD/php56-pecl-raphf-2.0.0/src/php_raphf_api.c:197:39: warning: initialization of 'php_persistent_handle_list_t *' {aka 'struct php_persistent_handle_list *'} from 'int' makes pointer from integer without a cast [-Wint-conversion] php_persistent_handle_list_t *list = Z_PTR_P(p); ^~~~~~~ /tmp/B.QBr3rz/BUILD/php56-pecl-raphf-2.0.0/src/php_raphf_api.c:200:4: warning: passing argument 2 of 'zend_hash_apply_with_argument' from incompatible pointer type [-Wincompatible-pointer-types] php_persistent_handle_apply_cleanup_ex, rf); ^~~~~~~~~~~~~~~~~~~~~~~~~~~~~~~~~~~~~~ In file included from /usr/include/php/Zend/zend.h:286, from /usr/include/php/main/php.h:35, from /tmp/B.QBr3rz/BUILD/php56-pecl-raphf-2.0.0/src/php_raphf_api.c:17: /usr/include/php/Zend/zend_hash.h:140:77: note: expected 'apply_func_arg_t' {aka 'int (*)(void *, void *)'} but argument is of type 'int (*)(zval *, void *)' {aka 'int (*)(struct _zval_struct *, void *)'} ZEND_API void zend_hash_apply_with_argument(HashTable *ht, apply_func_arg_t apply_func, void * TSRMLS_DC); ~~~~~~~~~~~~~~~~~^~~~~~~~~~ /tmp/B.QBr3rz/BUILD/php56-pecl-raphf-2.0.0/src/php_raphf_api.c: In function 'php_persistent_handle_list_dtor': /tmp/B.QBr3rz/BUILD/php56-pecl-raphf-2.0.0/src/php_raphf_api.c:220:4: warning: passing argument 2 of 'zend_hash_apply_with_argument' from incompatible pointer type [-Wincompatible-pointer-types] php_persistent_handle_apply_cleanup_ex, &provider->rf); ^~~~~~~~~~~~~~~~~~~~~~~~~~~~~~~~~~~~~~ In file included from /usr/include/php/Zend/zend.h:286, from /usr/include/php/main/php.h:35, from /tmp/B.QBr3rz/BUILD/php56-pecl-raphf-2.0.0/src/php_raphf_api.c:17: /usr/include/php/Zend/zend_hash.h:140:77: note: expected 'apply_func_arg_t' {aka 'int (*)(void *, void *)'} but argument is of type 'int (*)(zval *, void *)' {aka 'int (*)(struct _zval_struct *, void *)'} ZEND_API void zend_hash_apply_with_argument(HashTable *ht, apply_func_arg_t apply_func, void * TSRMLS_DC); ~~~~~~~~~~~~~~~~~^~~~~~~~~~ /tmp/B.QBr3rz/BUILD/php56-pecl-raphf-2.0.0/src/php_raphf_api.c: In function 'php_persistent_handle_list_apply_dtor': /tmp/B.QBr3rz/BUILD/php56-pecl-raphf-2.0.0/src/php_raphf_api.c:238:39: warning: initialization of 'php_persistent_handle_list_t *' {aka 'struct php_persistent_handle_list *'} from 'int' makes pointer from integer without a cast [-Wint-conversion] php_persistent_handle_list_t *list = Z_PTR_P(p); ^~~~~~~ /tmp/B.QBr3rz/BUILD/php56-pecl-raphf-2.0.0/src/php_raphf_api.c:241:2: warning: implicit declaration of function 'ZVAL_PTR'; did you mean 'ZVAL_TRUE'? [-Wimplicit-function-declaration] ZVAL_PTR(p, NULL); ^~~~~~~~ ZVAL_TRUE /tmp/B.QBr3rz/BUILD/php56-pecl-raphf-2.0.0/src/php_raphf_api.c: At top level: /tmp/B.QBr3rz/BUILD/php56-pecl-raphf-2.0.0/src/php_raphf_api.c:246:47: error: unknown type name 'zend_string'; did you mean 'zend_stream'? php_persistent_handle_provider_t *provider, zend_string *ident) ^~~~~~~~~~~ zend_stream /tmp/B.QBr3rz/BUILD/php56-pecl-raphf-2.0.0/src/php_raphf_api.c: In function 'php_persistent_handle_apply_cleanup_all': /tmp/B.QBr3rz/BUILD/php56-pecl-raphf-2.0.0/src/php_raphf_api.c:282:47: warning: initialization of 'php_persistent_handle_provider_t *' {aka 'struct php_persistent_handle_provider *'} from 'int' makes pointer from integer without a cast [-Wint-conversion] php_persistent_handle_provider_t *provider = Z_PTR_P(p); ^~~~~~~ /tmp/B.QBr3rz/BUILD/php56-pecl-raphf-2.0.0/src/php_raphf_api.c:283:2: error: unknown type name 'zend_string'; did you mean 'zend_stream'? zend_string *ident = va_arg(argv, zend_string *); ^~~~~~~~~~~ zend_stream In file included from /usr/include/php/Zend/zend.h:75, from /usr/include/php/main/php.h:35, from /tmp/B.QBr3rz/BUILD/php56-pecl-raphf-2.0.0/src/php_raphf_api.c:17: /tmp/B.QBr3rz/BUILD/php56-pecl-raphf-2.0.0/src/php_raphf_api.c:283:36: error: unknown type name 'zend_string' zend_string *ident = va_arg(argv, zend_string *); ^~~~~~~~~~~ /tmp/B.QBr3rz/BUILD/php56-pecl-raphf-2.0.0/src/php_raphf_api.c:286:20: error: request for member 'len' in something not a structure or union if (ident && ident->len) { ^~ /tmp/B.QBr3rz/BUILD/php56-pecl-raphf-2.0.0/src/php_raphf_api.c:287:15: warning: implicit declaration of function 'php_persistent_handle_list_find'; did you mean 'php_persistent_handle_list_free'? [-Wimplicit-function-declaration] if ((list = php_persistent_handle_list_find(provider, ident))) { ^~~~~~~~~~~~~~~~~~~~~~~~~~~~~~~ php_persistent_handle_list_free /tmp/B.QBr3rz/BUILD/php56-pecl-raphf-2.0.0/src/php_raphf_api.c:287:13: warning: assignment to 'php_persistent_handle_list_t *' {aka 'struct php_persistent_handle_list *'} from 'int' makes pointer from integer without a cast [-Wint-conversion] if ((list = php_persistent_handle_list_find(provider, ident))) { ^ /tmp/B.QBr3rz/BUILD/php56-pecl-raphf-2.0.0/src/php_raphf_api.c:289:6: warning: passing argument 2 of 'zend_hash_apply_with_argument' from incompatible pointer type [-Wincompatible-pointer-types] php_persistent_handle_apply_cleanup_ex, ^~~~~~~~~~~~~~~~~~~~~~~~~~~~~~~~~~~~~~ In file included from /usr/include/php/Zend/zend.h:286, from /usr/include/php/main/php.h:35, from /tmp/B.QBr3rz/BUILD/php56-pecl-raphf-2.0.0/src/php_raphf_api.c:17: /usr/include/php/Zend/zend_hash.h:140:77: note: expected 'apply_func_arg_t' {aka 'int (*)(void *, void *)'} but argument is of type 'int (*)(zval *, void *)' {aka 'int (*)(struct _zval_struct *, void *)'} ZEND_API void zend_hash_apply_with_argument(HashTable *ht, apply_func_arg_t apply_func, void * TSRMLS_DC); ~~~~~~~~~~~~~~~~~^~~~~~~~~~ /tmp/B.QBr3rz/BUILD/php56-pecl-raphf-2.0.0/src/php_raphf_api.c:294:5: warning: passing argument 2 of 'zend_hash_apply_with_argument' from incompatible pointer type [-Wincompatible-pointer-types] php_persistent_handle_apply_cleanup, &provider->rf); ^~~~~~~~~~~~~~~~~~~~~~~~~~~~~~~~~~~ In file included from /usr/include/php/Zend/zend.h:286, from /usr/include/php/main/php.h:35, from /tmp/B.QBr3rz/BUILD/php56-pecl-raphf-2.0.0/src/php_raphf_api.c:17: /usr/include/php/Zend/zend_hash.h:140:77: note: expected 'apply_func_arg_t' {aka 'int (*)(void *, void *)'} but argument is of type 'int (*)(zval *, void *)' {aka 'int (*)(struct _zval_struct *, void *)'} ZEND_API void zend_hash_apply_with_argument(HashTable *ht, apply_func_arg_t apply_func, void * TSRMLS_DC); ~~~~~~~~~~~~~~~~~^~~~~~~~~~ /tmp/B.QBr3rz/BUILD/php56-pecl-raphf-2.0.0/src/php_raphf_api.c: In function 'php_persistent_handle_hash_dtor': /tmp/B.QBr3rz/BUILD/php56-pecl-raphf-2.0.0/src/php_raphf_api.c:302:47: warning: initialization of 'php_persistent_handle_provider_t *' {aka 'struct php_persistent_handle_provider *'} from 'int' makes pointer from integer without a cast [-Wint-conversion] php_persistent_handle_provider_t *provider = Z_PTR_P(p); ^~~~~~~ /tmp/B.QBr3rz/BUILD/php56-pecl-raphf-2.0.0/src/php_raphf_api.c:305:4: warning: passing argument 2 of 'zend_hash_apply_with_argument' from incompatible pointer type [-Wincompatible-pointer-types] php_persistent_handle_list_apply_dtor, provider); ^~~~~~~~~~~~~~~~~~~~~~~~~~~~~~~~~~~~~ In file included from /usr/include/php/Zend/zend.h:286, from /usr/include/php/main/php.h:35, from /tmp/B.QBr3rz/BUILD/php56-pecl-raphf-2.0.0/src/php_raphf_api.c:17: /usr/include/php/Zend/zend_hash.h:140:77: note: expected 'apply_func_arg_t' {aka 'int (*)(void *, void *)'} but argument is of type 'int (*)(zval *, void *)' {aka 'int (*)(struct _zval_struct *, void *)'} ZEND_API void zend_hash_apply_with_argument(HashTable *ht, apply_func_arg_t apply_func, void * TSRMLS_DC); ~~~~~~~~~~~~~~~~~^~~~~~~~~~ /tmp/B.QBr3rz/BUILD/php56-pecl-raphf-2.0.0/src/php_raphf_api.c: At top level: /tmp/B.QBr3rz/BUILD/php56-pecl-raphf-2.0.0/src/php_raphf_api.c:311:48: error: unknown type name 'zend_string'; did you mean 'zend_stream'? ZEND_RESULT_CODE php_persistent_handle_provide(zend_string *name, ^~~~~~~~~~~ zend_stream /tmp/B.QBr3rz/BUILD/php56-pecl-raphf-2.0.0/src/php_raphf_api.c:343:3: error: unknown type name 'zend_string'; did you mean 'zend_stream'? zend_string *name, zend_string *ident, ^~~~~~~~~~~ zend_stream /tmp/B.QBr3rz/BUILD/php56-pecl-raphf-2.0.0/src/php_raphf_api.c:343:22: error: unknown type name 'zend_string'; did you mean 'zend_stream'? zend_string *name, zend_string *ident, ^~~~~~~~~~~ zend_stream /tmp/B.QBr3rz/BUILD/php56-pecl-raphf-2.0.0/src/php_raphf_api.c: In function 'php_persistent_handle_abandon': /tmp/B.QBr3rz/BUILD/php56-pecl-raphf-2.0.0/src/php_raphf_api.c:382:2: warning: implicit declaration of function 'zend_string_release'; did you mean 'zend_stack_base'? [-Wimplicit-function-declaration] zend_string_release(a->ident); ^~~~~~~~~~~~~~~~~~~ zend_stack_base /tmp/B.QBr3rz/BUILD/php56-pecl-raphf-2.0.0/src/php_raphf_api.c: In function 'php_persistent_handle_acquire': /tmp/B.QBr3rz/BUILD/php56-pecl-raphf-2.0.0/src/php_raphf_api.c:397:7: warning: assignment to 'php_persistent_handle_list_t *' {aka 'struct php_persistent_handle_list *'} from 'int' makes pointer from integer without a cast [-Wint-conversion] list = php_persistent_handle_list_find(a->provider, a->ident); ^ /tmp/B.QBr3rz/BUILD/php56-pecl-raphf-2.0.0/src/php_raphf_api.c:400:60: error: macro "zend_hash_get_current_key" requires 4 arguments, but only 3 given key = zend_hash_get_current_key(&list->free, NULL, &index); ^ /tmp/B.QBr3rz/BUILD/php56-pecl-raphf-2.0.0/src/php_raphf_api.c:400:9: error: 'zend_hash_get_current_key' undeclared (first use in this function); did you mean 'zend_hash_get_current_key_ex'? key = zend_hash_get_current_key(&list->free, NULL, &index); ^~~~~~~~~~~~~~~~~~~~~~~~~ zend_hash_get_current_key_ex /tmp/B.QBr3rz/BUILD/php56-pecl-raphf-2.0.0/src/php_raphf_api.c:401:45: error: macro "zend_hash_get_current_data" requires 2 arguments, but only 1 given p = zend_hash_get_current_data(&list->free); ^ /tmp/B.QBr3rz/BUILD/php56-pecl-raphf-2.0.0/src/php_raphf_api.c:401:7: error: 'zend_hash_get_current_data' undeclared (first use in this function); did you mean 'zend_hash_get_current_data_ex'? p = zend_hash_get_current_data(&list->free); ^~~~~~~~~~~~~~~~~~~~~~~~~~ zend_hash_get_current_data_ex /tmp/B.QBr3rz/BUILD/php56-pecl-raphf-2.0.0/src/php_raphf_api.c:403:11: warning: assignment to 'void *' from 'int' makes pointer from integer without a cast [-Wint-conversion] handle = Z_PTR_P(p); ^ /tmp/B.QBr3rz/BUILD/php56-pecl-raphf-2.0.0/src/php_raphf_api.c: In function 'php_persistent_handle_accrete': /tmp/B.QBr3rz/BUILD/php56-pecl-raphf-2.0.0/src/php_raphf_api.c:430:8: warning: assignment to 'php_persistent_handle_list_t *' {aka 'struct php_persistent_handle_list *'} from 'int' makes pointer from integer without a cast [-Wint-conversion] list = php_persistent_handle_list_find(a->provider, a->ident); ^ /tmp/B.QBr3rz/BUILD/php56-pecl-raphf-2.0.0/src/php_raphf_api.c: In function 'php_persistent_handle_release': /tmp/B.QBr3rz/BUILD/php56-pecl-raphf-2.0.0/src/php_raphf_api.c:444:7: warning: assignment to 'php_persistent_handle_list_t *' {aka 'struct php_persistent_handle_list *'} from 'int' makes pointer from integer without a cast [-Wint-conversion] list = php_persistent_handle_list_find(a->provider, a->ident); ^ /tmp/B.QBr3rz/BUILD/php56-pecl-raphf-2.0.0/src/php_raphf_api.c:455:4: warning: implicit declaration of function 'zend_hash_next_index_insert_ptr'; did you mean 'zend_hash_next_index_insert'? [-Wimplicit-function-declaration] zend_hash_next_index_insert_ptr(&list->free, handle); ^~~~~~~~~~~~~~~~~~~~~~~~~~~~~~~ zend_hash_next_index_insert /tmp/B.QBr3rz/BUILD/php56-pecl-raphf-2.0.0/src/php_raphf_api.c: At top level: /tmp/B.QBr3rz/BUILD/php56-pecl-raphf-2.0.0/src/php_raphf_api.c:463:36: error: unknown type name 'zend_string'; did you mean 'zend_stream'? void php_persistent_handle_cleanup(zend_string *name, zend_string *ident) ^~~~~~~~~~~ zend_stream /tmp/B.QBr3rz/BUILD/php56-pecl-raphf-2.0.0/src/php_raphf_api.c:463:55: error: unknown type name 'zend_string'; did you mean 'zend_stream'? void php_persistent_handle_cleanup(zend_string *name, zend_string *ident) ^~~~~~~~~~~ zend_stream /tmp/B.QBr3rz/BUILD/php56-pecl-raphf-2.0.0/src/php_raphf_api.c: In function 'php_persistent_handle_statall': /tmp/B.QBr3rz/BUILD/php56-pecl-raphf-2.0.0/src/php_raphf_api.c:502:5: warning: passing argument 2 of 'zend_hash_apply_with_arguments' from incompatible pointer type [-Wincompatible-pointer-types] php_persistent_handle_apply_statall, 1, ht); ^~~~~~~~~~~~~~~~~~~~~~~~~~~~~~~~~~~ In file included from /usr/include/php/Zend/zend.h:286, from /usr/include/php/main/php.h:35, from /tmp/B.QBr3rz/BUILD/php56-pecl-raphf-2.0.0/src/php_raphf_api.c:17: /usr/include/php/Zend/zend_hash.h:141:89: note: expected 'apply_func_args_t' {aka 'int (*)(void *, int, __va_list_tag *, struct _zend_hash_key *)'} but argument is of type 'int (*)(zval *, int, __va_list_tag *, zend_hash_key *)' {aka 'int (*)(struct _zval_struct *, int, __va_list_tag *, struct _zend_hash_key *)'} ZEND_API void zend_hash_apply_with_arguments(HashTable *ht TSRMLS_DC, apply_func_args_t apply_func, int, ...); ~~~~~~~~~~~~~~~~~~^~~~~~~~~~ /tmp/B.QBr3rz/BUILD/php56-pecl-raphf-2.0.0/src/php_raphf_api.c: In function 'zif_raphf_clean_persistent_handles': /tmp/B.QBr3rz/BUILD/php56-pecl-raphf-2.0.0/src/php_raphf_api.c:541:2: error: unknown type name 'zend_string'; did you mean 'zend_stream'? zend_string *name = NULL, *ident = NULL; ^~~~~~~~~~~ zend_stream /tmp/B.QBr3rz/BUILD/php56-pecl-raphf-2.0.0/src/php_raphf_api.c:544:3: warning: implicit declaration of function 'php_persistent_handle_cleanup'; did you mean 'php_persistent_handle_release'? [-Wimplicit-function-declaration] php_persistent_handle_cleanup(name, ident); ^~~~~~~~~~~~~~~~~~~~~~~~~~~~~ php_persistent_handle_release In file included from /usr/include/php/Zend/zend.h:286, from /usr/include/php/main/php.h:35, from /tmp/B.QBr3rz/BUILD/php56-pecl-raphf-2.0.0/src/php_raphf_api.c:17: /tmp/B.QBr3rz/BUILD/php56-pecl-raphf-2.0.0/src/php_raphf_api.c: In function 'zm_globals_ctor_raphf': /usr/include/php/Zend/zend_hash.h:104:111: warning: passing argument 3 of '_zend_hash_init' from incompatible pointer type [-Wincompatible-pointer-types] #define zend_hash_init(ht, nSize, pHashFunction, pDestructor, persistent) _zend_hash_init((ht), (nSize), (pDestructor), (persistent) ZEND_FILE_LINE_CC) ^~~~~~~~~~~~~ /tmp/B.QBr3rz/BUILD/php56-pecl-raphf-2.0.0/src/php_raphf_api.c:583:2: note: in expansion of macro 'zend_hash_init' zend_hash_init(&raphf_globals->persistent_handle.hash, 0, NULL, ^~~~~~~~~~~~~~ In file included from /usr/include/php/Zend/zend.h:286, from /usr/include/php/main/php.h:35, from /tmp/B.QBr3rz/BUILD/php56-pecl-raphf-2.0.0/src/php_raphf_api.c:17: /usr/include/php/Zend/zend_hash.h:100:69: note: expected 'dtor_func_t' {aka 'void (*)(void *)'} but argument is of type 'void (*)(zval *)' {aka 'void (*)(struct _zval_struct *)'} ZEND_API int _zend_hash_init(HashTable *ht, uint nSize, dtor_func_t pDestructor, zend_bool persistent ZEND_FILE_LINE_DC); ~~~~~~~~~~~~^~~~~~~~~~~ /tmp/B.QBr3rz/BUILD/php56-pecl-raphf-2.0.0/src/php_raphf_api.c:586:3: error: too few arguments to function 'zend_hash_copy' zend_hash_copy(&raphf_globals->persistent_handle.hash, ^~~~~~~~~~~~~~ In file included from /usr/include/php/Zend/zend.h:286, from /usr/include/php/main/php.h:35, from /tmp/B.QBr3rz/BUILD/php56-pecl-raphf-2.0.0/src/php_raphf_api.c:17: /usr/include/php/Zend/zend_hash.h:217:15: note: declared here ZEND_API void zend_hash_copy(HashTable *target, HashTable *source, copy_ctor_func_t pCopyConstructor, void *tmp, uint size); ^~~~~~~~~~~~~~ /tmp/B.QBr3rz/BUILD/php56-pecl-raphf-2.0.0/src/php_raphf_api.c: In function 'php_persistent_handle_apply_info_ex': /tmp/B.QBr3rz/BUILD/php56-pecl-raphf-2.0.0/src/php_raphf_api.c:622:39: warning: initialization of 'php_persistent_handle_list_t *' {aka 'struct php_persistent_handle_list *'} from 'int' makes pointer from integer without a cast [-Wint-conversion] php_persistent_handle_list_t *list = Z_PTR_P(p); ^~~~~~~ /tmp/B.QBr3rz/BUILD/php56-pecl-raphf-2.0.0/src/php_raphf_api.c:629:39: error: 'zend_hash_key' {aka 'struct _zend_hash_key'} has no member named 'key' php_info_print_table_row(4, super_key->key->val, key->key->val, used, free); ^~ /tmp/B.QBr3rz/BUILD/php56-pecl-raphf-2.0.0/src/php_raphf_api.c:629:54: error: 'zend_hash_key' {aka 'struct _zend_hash_key'} has no member named 'key' php_info_print_table_row(4, super_key->key->val, key->key->val, used, free); ^~ /tmp/B.QBr3rz/BUILD/php56-pecl-raphf-2.0.0/src/php_raphf_api.c: In function 'php_persistent_handle_apply_info': /tmp/B.QBr3rz/BUILD/php56-pecl-raphf-2.0.0/src/php_raphf_api.c:637:47: warning: initialization of 'php_persistent_handle_provider_t *' {aka 'struct php_persistent_handle_provider *'} from 'int' makes pointer from integer without a cast [-Wint-conversion] php_persistent_handle_provider_t *provider = Z_PTR_P(p); ^~~~~~~ /tmp/B.QBr3rz/BUILD/php56-pecl-raphf-2.0.0/src/php_raphf_api.c:640:4: warning: passing argument 2 of 'zend_hash_apply_with_arguments' from incompatible pointer type [-Wincompatible-pointer-types] php_persistent_handle_apply_info_ex, 1, key); ^~~~~~~~~~~~~~~~~~~~~~~~~~~~~~~~~~~ In file included from /usr/include/php/Zend/zend.h:286, from /usr/include/php/main/php.h:35, from /tmp/B.QBr3rz/BUILD/php56-pecl-raphf-2.0.0/src/php_raphf_api.c:17: /usr/include/php/Zend/zend_hash.h:141:89: note: expected 'apply_func_args_t' {aka 'int (*)(void *, int, __va_list_tag *, struct _zend_hash_key *)'} but argument is of type 'int (*)(zval *, int, __va_list_tag *, zend_hash_key *)' {aka 'int (*)(struct _zval_struct *, int, __va_list_tag *, struct _zend_hash_key *)'} ZEND_API void zend_hash_apply_with_arguments(HashTable *ht TSRMLS_DC, apply_func_args_t apply_func, int, ...); ~~~~~~~~~~~~~~~~~~^~~~~~~~~~ /tmp/B.QBr3rz/BUILD/php56-pecl-raphf-2.0.0/src/php_raphf_api.c: In function 'zm_info_raphf': /tmp/B.QBr3rz/BUILD/php56-pecl-raphf-2.0.0/src/php_raphf_api.c:664:4: warning: passing argument 2 of 'zend_hash_apply_with_arguments' from incompatible pointer type [-Wincompatible-pointer-types] php_persistent_handle_apply_info, 0); ^~~~~~~~~~~~~~~~~~~~~~~~~~~~~~~~ In file included from /usr/include/php/Zend/zend.h:286, from /usr/include/php/main/php.h:35, from /tmp/B.QBr3rz/BUILD/php56-pecl-raphf-2.0.0/src/php_raphf_api.c:17: /usr/include/php/Zend/zend_hash.h:141:89: note: expected 'apply_func_args_t' {aka 'int (*)(void *, int, __va_list_tag *, struct _zend_hash_key *)'} but argument is of type 'int (*)(zval *, int, __va_list_tag *, zend_hash_key *)' {aka 'int (*)(struct _zval_struct *, int, __va_list_tag *, struct _zend_hash_key *)'} ZEND_API void zend_hash_apply_with_arguments(HashTable *ht TSRMLS_DC, apply_func_args_t apply_func, int, ...); ~~~~~~~~~~~~~~~~~~^~~~~~~~~~ make: *** [Makefile:220: src/php_raphf_api.lo] Error 1 error: Bad exit status from /tmp/B.QBr3rz/BUILD/tmp/rpm-tmp.79734 (%build) RPM build errors: Bad exit status from /tmp/B.QBr3rz/BUILD/tmp/rpm-tmp.79734 (%build) ended at: Thu Oct 11 18:45:17 2018, done in 0:00:04.744149 error: No files produced. mesg: ttyname failed: Inappropriate ioctl for device + chmod -R u+rwX /tmp/B.QBr3rz/BUILD + rm -rf /tmp/B.QBr3rz/tmp /tmp/B.QBr3rz/BUILD mesg: ttyname failed: Inappropriate ioctl for device + rm -rf /tmp/B.QBr3rz Begin-PLD-Builder-Info Build-Time: user:13.25s sys:2.64s real:25.15s (faults io:0 non-io:914802) End-PLD-Builder-Info
[Back to list of logs] [View rpm -qa of builder]