FailedOk

th/SRPMS[OK]
th/x32[OK]
th/i686[OK]
th/x86_64[OK]

ac/SRPMS[OK]
ac/i386[OK]
ac/i586[OK]
ac/i686[OK]
ac/alpha[OK]
ac/amd64[OK]
ac/athlon[OK]
ac/ppc[OK]
ac/sparc[OK]
ac/sparc64[OK]

Advanced Search
main()
Powered by PLD Linux
(c) 2002-2020 PLD Team
$Revision: 1.37 $
Powered by The Right Thing.
Your IP: 35.153.39.7

php-pecl-ssh2 8cdb0722-e62f-4233-9bf6-614e96be8e37

Status:Failed
Source URL:https://buildlogs.pld-linux.org/pld/th/x86_64/FAIL/php-pecl-ssh2,8cdb0722-e62f-4233-9bf6-614e96be8e37.bz2
text/plain URL:View!
rpm -qa of builder:View!
Date:2020/11/19 15:18:59
Runtime:0:00:05.165924

Toc:

  • prep
  • Executing(%prep): /bin/sh -e /tmp/B.WzS5GN/BUILD/tmp/rpm-tmp.42422
  • build
  • Executing(%build): /bin/sh -e /tmp/B.WzS5GN/BUILD/tmp/rpm-tmp.42422
  • error 1
  • /tmp/B.WzS5GN/BUILD/php80-pecl-ssh2-1.2/ssh2.c:49:2: error: initializer element is not constant
  • error 2
  • /tmp/B.WzS5GN/BUILD/php80-pecl-ssh2-1.2/ssh2.c:443:6: error: void value not ignored as it ought to be
  • error 3
  • /tmp/B.WzS5GN/BUILD/php80-pecl-ssh2-1.2/ssh2.c:443:41: error: invalid operands to binary != (have 'const zend_internal_arg_info[1]' {aka 'const struct _zend_internal_arg_info[1]'} and 'int')
  • error 4
  • error: Bad exit status from /tmp/B.WzS5GN/BUILD/tmp/rpm-tmp.42422 (%build)
  • error 5
  • RPM build errors:
  • error 6
  • error: No files produced.

Content:

request from: glen
checking if we should skip the build
started at: Thu Nov 19 15:18:51 2020
killing old processes on a builder
sending signal 9 to pid -1
Killed
cleaning up /tmp
fetching https://srcbuilder.pld-linux.org/th//srpms/8cdb0722-e62f-4233-9bf6-614e96be8e37/php80-pecl-ssh2-1.2-2.src.rpm
fetched 43696 bytes, 136.5 K/s
installing srpm: php80-pecl-ssh2-1.2-2.src.rpm
+ install -d /tmp/B.WzS5GN/BUILD /tmp/B.WzS5GN/RPMS
+ LC_ALL=en_US.UTF-8
+ rpm -qp --changelog php80-pecl-ssh2-1.2-2.src.rpm
* Thu Nov 19 2020 PLD Linux Team <feedback@pld-linux.org>
- For complete changelog see: http://git.pld-linux.org/?p=packages/php-pecl-ssh2.git;a=log;h=master
+ rpm -Uhv --nodeps --define '_topdir /tmp/B.WzS5GN' --define '_specdir %{_topdir}' --define '_sourcedir %{_specdir}' --define '_rpmdir %{_topdir}/RPMS' --define '_builddir %{_topdir}/BUILD' --define 'php_suffix 80' php80-pecl-ssh2-1.2-2.src.rpm Preparing... ################################################## php80-pecl-ssh2 ################################################## + rm -f php80-pecl-ssh2-1.2-2.src.rpm + install -m 700 -d /tmp/B.WzS5GN/BUILD/tmp + TMPDIR=/tmp/B.WzS5GN/BUILD/tmp + exec nice -n 0 rpmbuild -bp --short-circuit --nodeps --define '_topdir /tmp/B.WzS5GN' --define '_specdir %{_topdir}' --define '_sourcedir %{_specdir}' --define '_rpmdir %{_topdir}/RPMS' --define '_builddir %{_topdir}/BUILD' --target x86_64-pld-linux --define 'php_suffix 80' --define 'prep exit 0' /tmp/B.WzS5GN/php-pecl-ssh2.spec Building target platforms: x86_64-pld-linux checking BuildConflict-ing packages no BuildConflicts found checking BR rpm: Building target platforms: x86_64-pld-linux no BR needed building RPM using: set -ex; : build-id: 8cdb0722-e62f-4233-9bf6-614e96be8e37; TMPDIR=/tmp/B.WzS5GN/BUILD/tmp exec nice -n 0 rpmbuild -bb --define '_smp_mflags -j9' --define '_make_opts -Otarget' --define '_pld_builder 1' --define '_topdir /tmp/B.WzS5GN' --define '_specdir %{_topdir}' --define '_sourcedir %{_specdir}' --define '_rpmdir %{_topdir}/RPMS' --define '_builddir %{_topdir}/BUILD' --target x86_64-pld-linux --define 'php_suffix 80' /tmp/B.WzS5GN/php-pecl-ssh2.spec + : build-id: 8cdb0722-e62f-4233-9bf6-614e96be8e37 + TMPDIR=/tmp/B.WzS5GN/BUILD/tmp + exec nice -n 0 rpmbuild -bb --define '_smp_mflags -j9' --define '_make_opts -Otarget' --define '_pld_builder 1' --define '_topdir /tmp/B.WzS5GN' --define '_specdir %{_topdir}' --define '_sourcedir %{_specdir}' --define '_rpmdir %{_topdir}/RPMS' --define '_builddir %{_topdir}/BUILD' --target x86_64-pld-linux --define 'php_suffix 80' /tmp/B.WzS5GN/php-pecl-ssh2.spec Building target platforms: x86_64-pld-linux Executing(%prep): /bin/sh -e /tmp/B.WzS5GN/BUILD/tmp/rpm-tmp.42422 + umask 022 + cd /tmp/B.WzS5GN/BUILD + cd /tmp/B.WzS5GN/BUILD + rm -rf php80-pecl-ssh2-1.2 + /bin/mkdir -p php80-pecl-ssh2-1.2 + cd php80-pecl-ssh2-1.2 + /bin/gzip -dc /tmp/B.WzS5GN/ssh2-1.2.tgz + /bin/tar -xf - + STATUS=0 + '[' 0 -ne 0 ']' + /bin/id -u + '[' 1000 '=' 0 ']' + /bin/id -u + '[' 1000 '=' 0 ']' + /bin/chmod -Rf a+rX,u+w,g-w,o-w . + mv ssh2-1.2/LICENSE ssh2-1.2/README.md ssh2-1.2/config.m4 ssh2-1.2/config.w32 ssh2-1.2/php_ssh2.h ssh2-1.2/ssh2.c ssh2-1.2/ssh2_fopen_wrappers.c ssh2-1.2/ssh2_sftp.c ssh2-1.2/tests . + exit 0 Executing(%build): /bin/sh -e /tmp/B.WzS5GN/BUILD/tmp/rpm-tmp.42422 TMP=/home/users/builder/tmp HOME=/home/users/builder PATH=/home/users/builder/GNUstep/Tools:/bin:/usr/bin:/usr/local/bin:/home/users/builder/bin TMPDIR=/tmp/B.WzS5GN/BUILD/tmp + umask 022 + cd /tmp/B.WzS5GN/BUILD + cd php80-pecl-ssh2-1.2 + phpize Configuring for: PHP Api Version: 20200930 Zend Module Api No: 20200930 Zend Extension Api No: 420200930 + ./configure 'LDFLAGS=-Wl,--as-needed -Wl,--no-copy-dt-needed-entries -Wl,-z,relro -Wl,-z,combreloc ' 'CFLAGS=-O2 -fwrapv -pipe -Wformat -Werror=format-security -gdwarf-4 -fno-debug-types-section -fvar-tracking-assignments -g2 -Wp,-D_FORTIFY_SOURCE=2 -fstack-protector-strong --param=ssp-buffer-size=4 -Werror=trampolines -fPIC -march=x86-64 -gdwarf-4 -fno-debug-types-section -fvar-tracking-assignments -g2 ' 'CXXFLAGS=-O2 -fwrapv -pipe -Wformat -Werror=format-security -gdwarf-4 -fno-debug-types-section -fvar-tracking-assignments -g2 -Wp,-D_FORTIFY_SOURCE=2 -fstack-protector-strong --param=ssp-buffer-size=4 -Werror=trampolines -fPIC -march=x86-64 -gdwarf-4 -fno-debug-types-section -fvar-tracking-assignments -g2 ' 'FFLAGS=-O2 -fwrapv -pipe -Wformat -Werror=format-security -gdwarf-4 -fno-debug-types-section -fvar-tracking-assignments -g2 -Wp,-D_FORTIFY_SOURCE=2 -fstack-protector-strong --param=ssp-buffer-size=4 -Werror=trampolines -fPIC -march=x86-64 -gdwarf-4 -fno-debug-types-section -fvar-tracking-assignments -g2 ' 'FCFLAGS=-O2 -fwrapv -pipe -Wformat -Werror=format-security -gdwarf-4 -fno-debug-types-section -fvar-tracking-assignments -g2 -Wp,-D_FORTIFY_SOURCE=2 -fstack-protector-strong --param=ssp-buffer-size=4 -Werror=trampolines -fPIC -march=x86-64 -gdwarf-4 -fno-debug-types-section -fvar-tracking-assignments -g2 ' 'CPPFLAGS=' 'CC=x86_64-pld-linux-gcc' 'CXX=x86_64-pld-linux-g++' '--host=x86_64-pld-linux' '--build=x86_64-pld-linux' '--prefix=/usr' '--exec-prefix=/usr' '--bindir=/usr/bin' '--sbindir=/usr/sbin' '--sysconfdir=/etc' '--datadir=/usr/share' '--includedir=/usr/include' '--libdir=/usr/lib64' '--libexecdir=/usr/libexec' '--localstatedir=/var' '--sharedstatedir=/var/lib' '--mandir=/usr/share/man' '--infodir=/usr/share/info' '--x-libraries=/usr/lib64' checking for grep that handles long lines and -e... /bin/grep checking for egrep... /bin/grep -E checking for a sed that does not truncate output... /bin/sed checking for x86_64-pld-linux-pkg-config... no checking for pkg-config... /usr/bin/pkg-config checking pkg-config is at least version 0.9.0... yes checking for x86_64-pld-linux-cc... x86_64-pld-linux-gcc checking whether the C compiler works... yes checking for C compiler default output file name... a.out checking for suffix of executables... checking whether we are cross compiling... no checking for suffix of object files... o checking whether we are using the GNU C compiler... yes checking whether x86_64-pld-linux-gcc accepts -g... yes checking for x86_64-pld-linux-gcc option to accept ISO C89... none needed checking how to run the C preprocessor... x86_64-pld-linux-gcc -E checking for icc... no checking for suncc... no checking for system library directory... lib checking if compiler supports -R... no checking if compiler supports -Wl,-rpath,... yes checking build system type... x86_64-pld-linux-gnu checking host system type... x86_64-pld-linux-gnu checking target system type... x86_64-pld-linux-gnu checking for PHP prefix... /usr checking for PHP includes... -I/usr/include/php -I/usr/include/php/main -I/usr/include/php/TSRM -I/usr/include/php/Zend -I/usr/include/php/ext -I/usr/include/php/ext/date/lib checking for PHP extension directory... /usr/lib64/php80 checking for PHP installed headers prefix... /usr/include/php checking if debug is enabled... no checking if zts is enabled... no checking for gawk... gawk checking for ssh2 support... yes, shared checking for ssh2 files in default path... found in /usr checking for libssh2_session_hostkey in -lssh2... yes checking for libssh2_agent_init in -lssh2... yes checking for libssh2_session_set_timeout in -lssh2... yes checking how to print strings... print -r checking for a sed that does not truncate output... (cached) /bin/sed checking for fgrep... /bin/grep -F checking for ld used by x86_64-pld-linux-gcc... /usr/bin/ld checking if the linker (/usr/bin/ld) is GNU ld... yes checking for BSD- or MS-compatible name lister (nm)... /usr/bin/nm -B checking the name lister (/usr/bin/nm -B) interface... BSD nm checking whether ln -s works... yes checking the maximum length of command line arguments... 1572864 checking how to convert x86_64-pld-linux-gnu file names to x86_64-pld-linux-gnu format... func_convert_file_noop checking how to convert x86_64-pld-linux-gnu file names to toolchain format... func_convert_file_noop checking for /usr/bin/ld option to reload object files... -r checking for x86_64-pld-linux-objdump... no checking for objdump... objdump checking how to recognize dependent libraries... pass_all checking for x86_64-pld-linux-dlltool... no checking for dlltool... no checking how to associate runtime and link libraries... print -r -- checking for x86_64-pld-linux-ar... no checking for ar... ar checking for archiver @FILE support... @ checking for x86_64-pld-linux-strip... no checking for strip... strip checking for x86_64-pld-linux-ranlib... no checking for ranlib... ranlib checking for mawk... (cached) gawk checking command to parse /usr/bin/nm -B output from x86_64-pld-linux-gcc object... ok checking for sysroot... no checking for a working dd... /bin/dd checking how to truncate binary pipes... /bin/dd bs=4096 count=1 checking for x86_64-pld-linux-mt... no checking for mt... no checking if : is a manifest tool... no checking for ANSI C header files... yes checking for sys/types.h... yes checking for sys/stat.h... yes checking for stdlib.h... yes checking for string.h... yes checking for memory.h... yes checking for strings.h... yes checking for inttypes.h... yes checking for stdint.h... yes checking for unistd.h... yes checking for dlfcn.h... yes checking for objdir... .libs checking if x86_64-pld-linux-gcc supports -fno-rtti -fno-exceptions... no checking for x86_64-pld-linux-gcc option to produce PIC... -fPIC -DPIC checking if x86_64-pld-linux-gcc PIC flag -fPIC -DPIC works... yes checking if x86_64-pld-linux-gcc static flag -static works... yes checking if x86_64-pld-linux-gcc supports -c -o file.o... yes checking if x86_64-pld-linux-gcc supports -c -o file.o... (cached) yes checking whether the x86_64-pld-linux-gcc linker (/usr/bin/ld -m elf_x86_64) supports shared libraries... yes checking whether -lc should be explicitly linked in... no checking dynamic linker characteristics... GNU/Linux ld.so checking how to hardcode library paths into programs... immediate checking whether stripping libraries is possible... yes checking if libtool supports shared libraries... yes checking whether to build shared libraries... yes checking whether to build static libraries... no configure: patching config.h.in configure: creating ./config.status config.status: creating config.h config.status: executing libtool commands + /usr/bin/make -Otarget -j9 /bin/sh /tmp/B.WzS5GN/BUILD/php80-pecl-ssh2-1.2/libtool --mode=compile x86_64-pld-linux-gcc -I. -I/tmp/B.WzS5GN/BUILD/php80-pecl-ssh2-1.2 -I/tmp/B.WzS5GN/BUILD/php80-pecl-ssh2-1.2/include -I/tmp/B.WzS5GN/BUILD/php80-pecl-ssh2-1.2/main -I/tmp/B.WzS5GN/BUILD/php80-pecl-ssh2-1.2 -I/usr/include/php -I/usr/include/php/main -I/usr/include/php/TSRM -I/usr/include/php/Zend -I/usr/include/php/ext -I/usr/include/php/ext/date/lib -DHAVE_CONFIG_H -O2 -fwrapv -pipe -Wformat -Werror=format-security -gdwarf-4 -fno-debug-types-section -fvar-tracking-assignments -g2 -Wp,-D_FORTIFY_SOURCE=2 -fstack-protector-strong --param=ssp-buffer-size=4 -Werror=trampolines -fPIC -march=x86-64 -gdwarf-4 -fno-debug-types-section -fvar-tracking-assignments -g2 -c /tmp/B.WzS5GN/BUILD/php80-pecl-ssh2-1.2/ssh2.c -o ssh2.lo libtool: compile: x86_64-pld-linux-gcc -I. -I/tmp/B.WzS5GN/BUILD/php80-pecl-ssh2-1.2 -I/tmp/B.WzS5GN/BUILD/php80-pecl-ssh2-1.2/include -I/tmp/B.WzS5GN/BUILD/php80-pecl-ssh2-1.2/main -I/tmp/B.WzS5GN/BUILD/php80-pecl-ssh2-1.2 -I/usr/include/php -I/usr/include/php/main -I/usr/include/php/TSRM -I/usr/include/php/Zend -I/usr/include/php/ext -I/usr/include/php/ext/date/lib -DHAVE_CONFIG_H -O2 -fwrapv -pipe -Wformat -Werror=format-security -gdwarf-4 -fno-debug-types-section -fvar-tracking-assignments -g2 -Wp,-D_FORTIFY_SOURCE=2 -fstack-protector-strong --param=ssp-buffer-size=4 -Werror=trampolines -fPIC -march=x86-64 -gdwarf-4 -fno-debug-types-section -fvar-tracking-assignments -g2 -c /tmp/B.WzS5GN/BUILD/php80-pecl-ssh2-1.2/ssh2.c -fPIC -DPIC -o .libs/ssh2.o /tmp/B.WzS5GN/BUILD/php80-pecl-ssh2-1.2/ssh2.c:49:2: warning: implicit declaration of function 'ZEND_ARG_PASS_INFO'; did you mean 'ZEND_ARG_OBJ_INFO'? [-Wimplicit-function-declaration] 49 | ZEND_ARG_PASS_INFO(1) | ^~~~~~~~~~~~~~~~~~ | ZEND_ARG_OBJ_INFO /tmp/B.WzS5GN/BUILD/php80-pecl-ssh2-1.2/ssh2.c:49:2: warning: initialization of 'const char *' from 'int' makes pointer from integer without a cast [-Wint-conversion] /tmp/B.WzS5GN/BUILD/php80-pecl-ssh2-1.2/ssh2.c:49:2: note: (near initialization for 'php_ssh2_first_arg_force_ref[1].name') /tmp/B.WzS5GN/BUILD/php80-pecl-ssh2-1.2/ssh2.c:49:2: error: initializer element is not constant /tmp/B.WzS5GN/BUILD/php80-pecl-ssh2-1.2/ssh2.c:49:2: note: (near initialization for 'php_ssh2_first_arg_force_ref[1].name') /tmp/B.WzS5GN/BUILD/php80-pecl-ssh2-1.2/ssh2.c: In function 'php_ssh2_debug_cb': /tmp/B.WzS5GN/BUILD/php80-pecl-ssh2-1.2/ssh2.c:103:17: warning: implicit declaration of function 'call_user_function_ex'; did you mean 'call_user_function'? [-Wimplicit-function-declaration] 103 | if (FAILURE == call_user_function_ex(NULL, NULL, data->disconnect_cb, NULL, 3, args, 0, NULL)) { | ^~~~~~~~~~~~~~~~~~~~~ | call_user_function /tmp/B.WzS5GN/BUILD/php80-pecl-ssh2-1.2/ssh2.c: In function 'zif_ssh2_disconnect': /tmp/B.WzS5GN/BUILD/php80-pecl-ssh2-1.2/ssh2.c:443:6: error: void value not ignored as it ought to be 443 | if (zend_list_close(Z_RES_P(zsession)) != SUCCESS) { | ^~~~~~~~~~~~~~~~~~~~~~~~~~~~~~~~~~ /tmp/B.WzS5GN/BUILD/php80-pecl-ssh2-1.2/ssh2.c:443:41: error: invalid operands to binary != (have 'const zend_internal_arg_info[1]' {aka 'const struct _zend_internal_arg_info[1]'} and 'int') 443 | if (zend_list_close(Z_RES_P(zsession)) != SUCCESS) { | ~~~~~~~~~~~~~~~~~~~~~~~~~~~~~~~~~~ ^~ | | | void make: *** [Makefile:228: ssh2.lo] Error 1 make: *** Waiting for unfinished jobs.... /bin/sh /tmp/B.WzS5GN/BUILD/php80-pecl-ssh2-1.2/libtool --mode=compile x86_64-pld-linux-gcc -I. -I/tmp/B.WzS5GN/BUILD/php80-pecl-ssh2-1.2 -I/tmp/B.WzS5GN/BUILD/php80-pecl-ssh2-1.2/include -I/tmp/B.WzS5GN/BUILD/php80-pecl-ssh2-1.2/main -I/tmp/B.WzS5GN/BUILD/php80-pecl-ssh2-1.2 -I/usr/include/php -I/usr/include/php/main -I/usr/include/php/TSRM -I/usr/include/php/Zend -I/usr/include/php/ext -I/usr/include/php/ext/date/lib -DHAVE_CONFIG_H -O2 -fwrapv -pipe -Wformat -Werror=format-security -gdwarf-4 -fno-debug-types-section -fvar-tracking-assignments -g2 -Wp,-D_FORTIFY_SOURCE=2 -fstack-protector-strong --param=ssp-buffer-size=4 -Werror=trampolines -fPIC -march=x86-64 -gdwarf-4 -fno-debug-types-section -fvar-tracking-assignments -g2 -c /tmp/B.WzS5GN/BUILD/php80-pecl-ssh2-1.2/ssh2_sftp.c -o ssh2_sftp.lo libtool: compile: x86_64-pld-linux-gcc -I. -I/tmp/B.WzS5GN/BUILD/php80-pecl-ssh2-1.2 -I/tmp/B.WzS5GN/BUILD/php80-pecl-ssh2-1.2/include -I/tmp/B.WzS5GN/BUILD/php80-pecl-ssh2-1.2/main -I/tmp/B.WzS5GN/BUILD/php80-pecl-ssh2-1.2 -I/usr/include/php -I/usr/include/php/main -I/usr/include/php/TSRM -I/usr/include/php/Zend -I/usr/include/php/ext -I/usr/include/php/ext/date/lib -DHAVE_CONFIG_H -O2 -fwrapv -pipe -Wformat -Werror=format-security -gdwarf-4 -fno-debug-types-section -fvar-tracking-assignments -g2 -Wp,-D_FORTIFY_SOURCE=2 -fstack-protector-strong --param=ssp-buffer-size=4 -Werror=trampolines -fPIC -march=x86-64 -gdwarf-4 -fno-debug-types-section -fvar-tracking-assignments -g2 -c /tmp/B.WzS5GN/BUILD/php80-pecl-ssh2-1.2/ssh2_sftp.c -fPIC -DPIC -o .libs/ssh2_sftp.o /tmp/B.WzS5GN/BUILD/php80-pecl-ssh2-1.2/ssh2_sftp.c:203:2: warning: initialization of 'ssize_t (*)(php_stream *, const char *, size_t)' {aka 'long int (*)(struct _php_stream *, const char *, long unsigned int)'} from incompatible pointer type 'size_t (*)(php_stream *, const char *, size_t)' {aka 'long unsigned int (*)(struct _php_stream *, const char *, long unsigned int)'} [-Wincompatible-pointer-types] 203 | php_ssh2_sftp_stream_write, | ^~~~~~~~~~~~~~~~~~~~~~~~~~ /tmp/B.WzS5GN/BUILD/php80-pecl-ssh2-1.2/ssh2_sftp.c:203:2: note: (near initialization for 'php_ssh2_sftp_stream_ops.write') /tmp/B.WzS5GN/BUILD/php80-pecl-ssh2-1.2/ssh2_sftp.c:204:2: warning: initialization of 'ssize_t (*)(php_stream *, char *, size_t)' {aka 'long int (*)(struct _php_stream *, char *, long unsigned int)'} from incompatible pointer type 'size_t (*)(php_stream *, char *, size_t)' {aka 'long unsigned int (*)(struct _php_stream *, char *, long unsigned int)'} [-Wincompatible-pointer-types] 204 | php_ssh2_sftp_stream_read, | ^~~~~~~~~~~~~~~~~~~~~~~~~ /tmp/B.WzS5GN/BUILD/php80-pecl-ssh2-1.2/ssh2_sftp.c:204:2: note: (near initialization for 'php_ssh2_sftp_stream_ops.read') /tmp/B.WzS5GN/BUILD/php80-pecl-ssh2-1.2/ssh2_sftp.c:309:2: warning: initialization of 'ssize_t (*)(php_stream *, char *, size_t)' {aka 'long int (*)(struct _php_stream *, char *, long unsigned int)'} from incompatible pointer type 'size_t (*)(php_stream *, char *, size_t)' {aka 'long unsigned int (*)(struct _php_stream *, char *, long unsigned int)'} [-Wincompatible-pointer-types] 309 | php_ssh2_sftp_dirstream_read, | ^~~~~~~~~~~~~~~~~~~~~~~~~~~~ /tmp/B.WzS5GN/BUILD/php80-pecl-ssh2-1.2/ssh2_sftp.c:309:2: note: (near initialization for 'php_ssh2_sftp_dirstream_ops.read') /bin/sh /tmp/B.WzS5GN/BUILD/php80-pecl-ssh2-1.2/libtool --mode=compile x86_64-pld-linux-gcc -I. -I/tmp/B.WzS5GN/BUILD/php80-pecl-ssh2-1.2 -I/tmp/B.WzS5GN/BUILD/php80-pecl-ssh2-1.2/include -I/tmp/B.WzS5GN/BUILD/php80-pecl-ssh2-1.2/main -I/tmp/B.WzS5GN/BUILD/php80-pecl-ssh2-1.2 -I/usr/include/php -I/usr/include/php/main -I/usr/include/php/TSRM -I/usr/include/php/Zend -I/usr/include/php/ext -I/usr/include/php/ext/date/lib -DHAVE_CONFIG_H -O2 -fwrapv -pipe -Wformat -Werror=format-security -gdwarf-4 -fno-debug-types-section -fvar-tracking-assignments -g2 -Wp,-D_FORTIFY_SOURCE=2 -fstack-protector-strong --param=ssp-buffer-size=4 -Werror=trampolines -fPIC -march=x86-64 -gdwarf-4 -fno-debug-types-section -fvar-tracking-assignments -g2 -c /tmp/B.WzS5GN/BUILD/php80-pecl-ssh2-1.2/ssh2_fopen_wrappers.c -o ssh2_fopen_wrappers.lo libtool: compile: x86_64-pld-linux-gcc -I. -I/tmp/B.WzS5GN/BUILD/php80-pecl-ssh2-1.2 -I/tmp/B.WzS5GN/BUILD/php80-pecl-ssh2-1.2/include -I/tmp/B.WzS5GN/BUILD/php80-pecl-ssh2-1.2/main -I/tmp/B.WzS5GN/BUILD/php80-pecl-ssh2-1.2 -I/usr/include/php -I/usr/include/php/main -I/usr/include/php/TSRM -I/usr/include/php/Zend -I/usr/include/php/ext -I/usr/include/php/ext/date/lib -DHAVE_CONFIG_H -O2 -fwrapv -pipe -Wformat -Werror=format-security -gdwarf-4 -fno-debug-types-section -fvar-tracking-assignments -g2 -Wp,-D_FORTIFY_SOURCE=2 -fstack-protector-strong --param=ssp-buffer-size=4 -Werror=trampolines -fPIC -march=x86-64 -gdwarf-4 -fno-debug-types-section -fvar-tracking-assignments -g2 -c /tmp/B.WzS5GN/BUILD/php80-pecl-ssh2-1.2/ssh2_fopen_wrappers.c -fPIC -DPIC -o .libs/ssh2_fopen_wrappers.o /tmp/B.WzS5GN/BUILD/php80-pecl-ssh2-1.2/ssh2_fopen_wrappers.c:184:2: warning: initialization of 'ssize_t (*)(php_stream *, const char *, size_t)' {aka 'long int (*)(struct _php_stream *, const char *, long unsigned int)'} from incompatible pointer type 'size_t (*)(php_stream *, const char *, size_t)' {aka 'long unsigned int (*)(struct _php_stream *, const char *, long unsigned int)'} [-Wincompatible-pointer-types] 184 | php_ssh2_channel_stream_write, | ^~~~~~~~~~~~~~~~~~~~~~~~~~~~~ /tmp/B.WzS5GN/BUILD/php80-pecl-ssh2-1.2/ssh2_fopen_wrappers.c:184:2: note: (near initialization for 'php_ssh2_channel_stream_ops.write') /tmp/B.WzS5GN/BUILD/php80-pecl-ssh2-1.2/ssh2_fopen_wrappers.c:185:2: warning: initialization of 'ssize_t (*)(php_stream *, char *, size_t)' {aka 'long int (*)(struct _php_stream *, char *, long unsigned int)'} from incompatible pointer type 'size_t (*)(php_stream *, char *, size_t)' {aka 'long unsigned int (*)(struct _php_stream *, char *, long unsigned int)'} [-Wincompatible-pointer-types] 185 | php_ssh2_channel_stream_read, | ^~~~~~~~~~~~~~~~~~~~~~~~~~~~ /tmp/B.WzS5GN/BUILD/php80-pecl-ssh2-1.2/ssh2_fopen_wrappers.c:185:2: note: (near initialization for 'php_ssh2_channel_stream_ops.read') error: Bad exit status from /tmp/B.WzS5GN/BUILD/tmp/rpm-tmp.42422 (%build) RPM build errors: Bad exit status from /tmp/B.WzS5GN/BUILD/tmp/rpm-tmp.42422 (%build) ended at: Thu Nov 19 15:18:59 2020, done in 0:00:05.165924 error: No files produced. + chmod -R u+rwX /tmp/B.WzS5GN/BUILD + rm -rf /tmp/B.WzS5GN/tmp /tmp/B.WzS5GN/BUILD + rm -rf /tmp/B.WzS5GN Begin-PLD-Builder-Info Build-Time: user:6.41s sys:1.79s real:7.72s (faults io:7 non-io:534230) End-PLD-Builder-Info
[Back to list of logs] [View rpm -qa of builder]