FailedOk

th/SRPMS[OK]
th/x32[OK]
th/i686[OK]
th/x86_64[OK]

ac/SRPMS[OK]
ac/i386[OK]
ac/i586[OK]
ac/i686[OK]
ac/alpha[OK]
ac/amd64[OK]
ac/athlon[OK]
ac/ppc[OK]
ac/sparc[OK]
ac/sparc64[OK]

Advanced Search
main()
Powered by PLD Linux
(c) 2002-2020 PLD Team
$Revision: 1.37 $
Powered by /dev/null.
Your IP: 3.219.31.204

php-pecl-translit 8cdb0722-e62f-4233-9bf6-614e96be8e37

Status:Failed
Source URL:https://buildlogs.pld-linux.org/pld/th/x86_64/FAIL/php-pecl-translit,8cdb0722-e62f-4233-9bf6-614e96be8e37.bz2
text/plain URL:View!
rpm -qa of builder:View!
Date:2020/11/19 15:19:17
Runtime:0:00:05.149304

Toc:

  • error 1
  • rpm: error: Failed build dependencies:
  • error 2
  • rpm: error: Failed build dependencies:
  • prep
  • Executing(%prep): /bin/sh -e /tmp/B.Xp46Uc/BUILD/tmp/rpm-tmp.60672
  • build
  • Executing(%build): /bin/sh -e /tmp/B.Xp46Uc/BUILD/tmp/rpm-tmp.60672
  • error 3
  • error: Bad exit status from /tmp/B.Xp46Uc/BUILD/tmp/rpm-tmp.60672 (%build)
  • error 4
  • RPM build errors:
  • error 5
  • error: No files produced.

Content:

request from: glen
checking if we should skip the build
started at: Thu Nov 19 15:18:59 2020
killing old processes on a builder
sending signal 9 to pid -1
Killed
cleaning up /tmp
fetching https://srcbuilder.pld-linux.org/th//srpms/8cdb0722-e62f-4233-9bf6-614e96be8e37/php80-pecl-translit-0.7.0-1.src.rpm
fetched 123918 bytes, 312.0 K/s
installing srpm: php80-pecl-translit-0.7.0-1.src.rpm
+ install -d /tmp/B.Xp46Uc/BUILD /tmp/B.Xp46Uc/RPMS
+ LC_ALL=en_US.UTF-8
+ rpm -qp --changelog php80-pecl-translit-0.7.0-1.src.rpm
* Thu Nov 19 2020 PLD Linux Team <feedback@pld-linux.org>
- For complete changelog see: http://git.pld-linux.org/?p=packages/php-pecl-translit.git;a=log;h=master
* Wed Feb 26 2020 Elan Ruusamäe <glen@pld-linux.org> e3cff36
- Update to 0.7.0 * Fri Dec 27 2019 Elan Ruusamäe <glen@pld-linux.org> 0a20db7
- License is BSD now * Fri Dec 27 2019 Elan Ruusamäe <glen@pld-linux.org> 981945b
- Up to 0.6.3 * Fri Dec 27 2019 Elan Ruusamäe <glen@pld-linux.org> 794992b
- Use php 7.4 ini filename + rpm -Uhv --nodeps --define '_topdir /tmp/B.Xp46Uc' --define '_specdir %{_topdir}' --define '_sourcedir %{_specdir}' --define '_rpmdir %{_topdir}/RPMS' --define '_builddir %{_topdir}/BUILD' --define 'php_suffix 80' php80-pecl-translit-0.7.0-1.src.rpm Preparing... ################################################## php80-pecl-translit ################################################## + rm -f php80-pecl-translit-0.7.0-1.src.rpm + install -m 700 -d /tmp/B.Xp46Uc/BUILD/tmp + TMPDIR=/tmp/B.Xp46Uc/BUILD/tmp + exec nice -n 0 rpmbuild -bp --short-circuit --nodeps --define '_topdir /tmp/B.Xp46Uc' --define '_specdir %{_topdir}' --define '_sourcedir %{_specdir}' --define '_rpmdir %{_topdir}/RPMS' --define '_builddir %{_topdir}/BUILD' --target x86_64-pld-linux --define 'php_suffix 80' --define 'prep exit 0' /tmp/B.Xp46Uc/php-pecl-translit.spec Building target platforms: x86_64-pld-linux checking BuildConflict-ing packages no BuildConflicts found checking BR rpm: error: Failed build dependencies: rpm: php80-iconv is needed by php80-pecl-translit-0.7.0-1.src rpm: Building target platforms: x86_64-pld-linux updating poldek cache... ready is up to date th is up to date th is up to date th-ready is up to date th-ready is up to date th-test is up to date th-test is up to date checking conflicting packages in BRed packages poldek: Loading [pndir]ready... poldek: Loading [pndir]th-test... poldek: Loading [pndir]th-test... poldek: Loading [pndir]th-ready... poldek: Loading [pndir]th-ready... poldek: Loading [pndir]th... poldek: Loading [pndir]th... poldek: 30337 packages read poldek: Removed 1779 duplicate packages from available set poldek: Processing dependencies... poldek: There are 1 package to install: poldek: A php80-iconv-8.0.0-1.RC5.1.x86_64 poldek: This operation will use 46.8KB of disk space. poldek: Need to get 27.4KB of archives. poldek: Executing pm-command.sh --upgrade -vh --test --root / --define _check_dirname_deps 1... poldek: Preparing... ################################################## no conflicts found checking BR rpm: error: Failed build dependencies: rpm: php80-iconv is needed by php80-pecl-translit-0.7.0-1.src rpm: Building target platforms: x86_64-pld-linux installing BR: php80\-iconv + poldek --noask --caplookup -Q -v '--ignore=hhvm-*' '--ignore=php4-*' '--ignore=php52-*' '--ignore=php53-*' '--ignore=php54-*' '--ignore=php55-*' '--ignore=php56-*' '--ignore=php70-*' '--ignore=php71-*' '--ignore=php72-*' '--ignore=php73-*' '--ignore=php74-*' --upgrade php80-iconv Loading [pndir]ready... Loading [pndir]th-test... Loading [pndir]th-test... Loading [pndir]th-ready... Loading [pndir]th-ready... Loading [pndir]th... Loading [pndir]th... 30337 packages read Removed 1779 duplicate packages from available set Processing dependencies... There are 1 package to install: A php80-iconv-8.0.0-1.RC5.1.x86_64 This operation will use 46.8KB of disk space. Need to get 27.4KB of archives. Executing pm-command.sh --upgrade -vh --root / --define _check_dirname_deps 1... Preparing... ################################################## php80-iconv ################################################## building RPM using: set -ex; : build-id: 8cdb0722-e62f-4233-9bf6-614e96be8e37; TMPDIR=/tmp/B.Xp46Uc/BUILD/tmp exec nice -n 0 rpmbuild -bb --define '_smp_mflags -j9' --define '_make_opts -Otarget' --define '_pld_builder 1' --define '_topdir /tmp/B.Xp46Uc' --define '_specdir %{_topdir}' --define '_sourcedir %{_specdir}' --define '_rpmdir %{_topdir}/RPMS' --define '_builddir %{_topdir}/BUILD' --target x86_64-pld-linux --define 'php_suffix 80' /tmp/B.Xp46Uc/php-pecl-translit.spec + : build-id: 8cdb0722-e62f-4233-9bf6-614e96be8e37 + TMPDIR=/tmp/B.Xp46Uc/BUILD/tmp + exec nice -n 0 rpmbuild -bb --define '_smp_mflags -j9' --define '_make_opts -Otarget' --define '_pld_builder 1' --define '_topdir /tmp/B.Xp46Uc' --define '_specdir %{_topdir}' --define '_sourcedir %{_specdir}' --define '_rpmdir %{_topdir}/RPMS' --define '_builddir %{_topdir}/BUILD' --target x86_64-pld-linux --define 'php_suffix 80' /tmp/B.Xp46Uc/php-pecl-translit.spec Building target platforms: x86_64-pld-linux Executing(%prep): /bin/sh -e /tmp/B.Xp46Uc/BUILD/tmp/rpm-tmp.60672 + umask 022 + cd /tmp/B.Xp46Uc/BUILD + cd /tmp/B.Xp46Uc/BUILD + rm -rf php80-pecl-translit-0.7.0 + /bin/mkdir -p php80-pecl-translit-0.7.0 + cd php80-pecl-translit-0.7.0 + /bin/gzip -dc /tmp/B.Xp46Uc/translit-0.7.0.tgz + /bin/tar -xf - + STATUS=0 + '[' 0 -ne 0 ']' + /bin/id -u + '[' 1000 '=' 0 ']' + /bin/id -u + '[' 1000 '=' 0 ']' + /bin/chmod -Rf a+rX,u+w,g-w,o-w . + mv translit-0.7.0/LICENSE translit-0.7.0/config.m4 translit-0.7.0/config.w32 translit-0.7.0/data translit-0.7.0/php_translit.h translit-0.7.0/tests translit-0.7.0/translit.c . + <<"EOF" #!/bin/sh export NO_INTERACTION=1 REPORT_EXIT_STATUS=1 MALLOC_CHECK_=2 exec /usr/bin/make -Otarget -j9 test \ PHP_EXECUTABLE=/usr/bin/php80 \ PHP_TEST_SHARED_SYSTEM_EXTENSIONS="iconv" \ RUN_TESTS_SETTINGS="-q $*" EOF + >run-tests.sh + cat + chmod +x run-tests.sh + exit 0 Executing(%build): /bin/sh -e /tmp/B.Xp46Uc/BUILD/tmp/rpm-tmp.60672 TMP=/home/users/builder/tmp HOME=/home/users/builder PATH=/home/users/builder/GNUstep/Tools:/bin:/usr/bin:/usr/local/bin:/home/users/builder/bin TMPDIR=/tmp/B.Xp46Uc/BUILD/tmp + umask 022 + cd /tmp/B.Xp46Uc/BUILD + cd php80-pecl-translit-0.7.0 + phpize Configuring for: PHP Api Version: 20200930 Zend Module Api No: 20200930 Zend Extension Api No: 420200930 + ./configure 'LDFLAGS=-Wl,--as-needed -Wl,--no-copy-dt-needed-entries -Wl,-z,relro -Wl,-z,combreloc ' 'CFLAGS=-O2 -fwrapv -pipe -Wformat -Werror=format-security -gdwarf-4 -fno-debug-types-section -fvar-tracking-assignments -g2 -Wp,-D_FORTIFY_SOURCE=2 -fstack-protector-strong --param=ssp-buffer-size=4 -Werror=trampolines -fPIC -march=x86-64 -gdwarf-4 -fno-debug-types-section -fvar-tracking-assignments -g2 ' 'CXXFLAGS=-O2 -fwrapv -pipe -Wformat -Werror=format-security -gdwarf-4 -fno-debug-types-section -fvar-tracking-assignments -g2 -Wp,-D_FORTIFY_SOURCE=2 -fstack-protector-strong --param=ssp-buffer-size=4 -Werror=trampolines -fPIC -march=x86-64 -gdwarf-4 -fno-debug-types-section -fvar-tracking-assignments -g2 ' 'FFLAGS=-O2 -fwrapv -pipe -Wformat -Werror=format-security -gdwarf-4 -fno-debug-types-section -fvar-tracking-assignments -g2 -Wp,-D_FORTIFY_SOURCE=2 -fstack-protector-strong --param=ssp-buffer-size=4 -Werror=trampolines -fPIC -march=x86-64 -gdwarf-4 -fno-debug-types-section -fvar-tracking-assignments -g2 ' 'FCFLAGS=-O2 -fwrapv -pipe -Wformat -Werror=format-security -gdwarf-4 -fno-debug-types-section -fvar-tracking-assignments -g2 -Wp,-D_FORTIFY_SOURCE=2 -fstack-protector-strong --param=ssp-buffer-size=4 -Werror=trampolines -fPIC -march=x86-64 -gdwarf-4 -fno-debug-types-section -fvar-tracking-assignments -g2 ' 'CPPFLAGS=' 'CC=x86_64-pld-linux-gcc' 'CXX=x86_64-pld-linux-g++' '--host=x86_64-pld-linux' '--build=x86_64-pld-linux' '--prefix=/usr' '--exec-prefix=/usr' '--bindir=/usr/bin' '--sbindir=/usr/sbin' '--sysconfdir=/etc' '--datadir=/usr/share' '--includedir=/usr/include' '--libdir=/usr/lib64' '--libexecdir=/usr/libexec' '--localstatedir=/var' '--sharedstatedir=/var/lib' '--mandir=/usr/share/man' '--infodir=/usr/share/info' '--x-libraries=/usr/lib64' checking for grep that handles long lines and -e... /bin/grep checking for egrep... /bin/grep -E checking for a sed that does not truncate output... /bin/sed checking for x86_64-pld-linux-pkg-config... no checking for pkg-config... /usr/bin/pkg-config checking pkg-config is at least version 0.9.0... yes checking for x86_64-pld-linux-cc... x86_64-pld-linux-gcc checking whether the C compiler works... yes checking for C compiler default output file name... a.out checking for suffix of executables... checking whether we are cross compiling... no checking for suffix of object files... o checking whether we are using the GNU C compiler... yes checking whether x86_64-pld-linux-gcc accepts -g... yes checking for x86_64-pld-linux-gcc option to accept ISO C89... none needed checking how to run the C preprocessor... x86_64-pld-linux-gcc -E checking for icc... no checking for suncc... no checking for system library directory... lib checking if compiler supports -R... no checking if compiler supports -Wl,-rpath,... yes checking build system type... x86_64-pld-linux-gnu checking host system type... x86_64-pld-linux-gnu checking target system type... x86_64-pld-linux-gnu checking for PHP prefix... /usr checking for PHP includes... -I/usr/include/php -I/usr/include/php/main -I/usr/include/php/TSRM -I/usr/include/php/Zend -I/usr/include/php/ext -I/usr/include/php/ext/date/lib checking for PHP extension directory... /usr/lib64/php80 checking for PHP installed headers prefix... /usr/include/php checking if debug is enabled... no checking if zts is enabled... no checking for gawk... gawk checking for transliteration support... yes, shared checking how to print strings... print -r checking for a sed that does not truncate output... (cached) /bin/sed checking for fgrep... /bin/grep -F checking for ld used by x86_64-pld-linux-gcc... /usr/bin/ld checking if the linker (/usr/bin/ld) is GNU ld... yes checking for BSD- or MS-compatible name lister (nm)... /usr/bin/nm -B checking the name lister (/usr/bin/nm -B) interface... BSD nm checking whether ln -s works... yes checking the maximum length of command line arguments... 1572864 checking how to convert x86_64-pld-linux-gnu file names to x86_64-pld-linux-gnu format... func_convert_file_noop checking how to convert x86_64-pld-linux-gnu file names to toolchain format... func_convert_file_noop checking for /usr/bin/ld option to reload object files... -r checking for x86_64-pld-linux-objdump... no checking for objdump... objdump checking how to recognize dependent libraries... pass_all checking for x86_64-pld-linux-dlltool... no checking for dlltool... no checking how to associate runtime and link libraries... print -r -- checking for x86_64-pld-linux-ar... no checking for ar... ar checking for archiver @FILE support... @ checking for x86_64-pld-linux-strip... no checking for strip... strip checking for x86_64-pld-linux-ranlib... no checking for ranlib... ranlib checking for mawk... (cached) gawk checking command to parse /usr/bin/nm -B output from x86_64-pld-linux-gcc object... ok checking for sysroot... no checking for a working dd... /bin/dd checking how to truncate binary pipes... /bin/dd bs=4096 count=1 checking for x86_64-pld-linux-mt... no checking for mt... no checking if : is a manifest tool... no checking for ANSI C header files... yes checking for sys/types.h... yes checking for sys/stat.h... yes checking for stdlib.h... yes checking for string.h... yes checking for memory.h... yes checking for strings.h... yes checking for inttypes.h... yes checking for stdint.h... yes checking for unistd.h... yes checking for dlfcn.h... yes checking for objdir... .libs checking if x86_64-pld-linux-gcc supports -fno-rtti -fno-exceptions... no checking for x86_64-pld-linux-gcc option to produce PIC... -fPIC -DPIC checking if x86_64-pld-linux-gcc PIC flag -fPIC -DPIC works... yes checking if x86_64-pld-linux-gcc static flag -static works... yes checking if x86_64-pld-linux-gcc supports -c -o file.o... yes checking if x86_64-pld-linux-gcc supports -c -o file.o... (cached) yes checking whether the x86_64-pld-linux-gcc linker (/usr/bin/ld -m elf_x86_64) supports shared libraries... yes checking whether -lc should be explicitly linked in... no checking dynamic linker characteristics... GNU/Linux ld.so checking how to hardcode library paths into programs... immediate checking whether stripping libraries is possible... yes checking if libtool supports shared libraries... yes checking whether to build shared libraries... yes checking whether to build static libraries... no configure: patching config.h.in configure: creating ./config.status config.status: creating config.h config.status: executing libtool commands + /usr/bin/make -Otarget -j9 /bin/sh /tmp/B.Xp46Uc/BUILD/php80-pecl-translit-0.7.0/libtool --mode=compile x86_64-pld-linux-gcc -I. -I/tmp/B.Xp46Uc/BUILD/php80-pecl-translit-0.7.0 -I/tmp/B.Xp46Uc/BUILD/php80-pecl-translit-0.7.0/include -I/tmp/B.Xp46Uc/BUILD/php80-pecl-translit-0.7.0/main -I/tmp/B.Xp46Uc/BUILD/php80-pecl-translit-0.7.0 -I/usr/include/php -I/usr/include/php/main -I/usr/include/php/TSRM -I/usr/include/php/Zend -I/usr/include/php/ext -I/usr/include/php/ext/date/lib -DHAVE_CONFIG_H -O2 -fwrapv -pipe -Wformat -Werror=format-security -gdwarf-4 -fno-debug-types-section -fvar-tracking-assignments -g2 -Wp,-D_FORTIFY_SOURCE=2 -fstack-protector-strong --param=ssp-buffer-size=4 -Werror=trampolines -fPIC -march=x86-64 -gdwarf-4 -fno-debug-types-section -fvar-tracking-assignments -g2 -c /tmp/B.Xp46Uc/BUILD/php80-pecl-translit-0.7.0/data/compact_underscores.c -o data/compact_underscores.lo libtool: compile: x86_64-pld-linux-gcc -I. -I/tmp/B.Xp46Uc/BUILD/php80-pecl-translit-0.7.0 -I/tmp/B.Xp46Uc/BUILD/php80-pecl-translit-0.7.0/include -I/tmp/B.Xp46Uc/BUILD/php80-pecl-translit-0.7.0/main -I/tmp/B.Xp46Uc/BUILD/php80-pecl-translit-0.7.0 -I/usr/include/php -I/usr/include/php/main -I/usr/include/php/TSRM -I/usr/include/php/Zend -I/usr/include/php/ext -I/usr/include/php/ext/date/lib -DHAVE_CONFIG_H -O2 -fwrapv -pipe -Wformat -Werror=format-security -gdwarf-4 -fno-debug-types-section -fvar-tracking-assignments -g2 -Wp,-D_FORTIFY_SOURCE=2 -fstack-protector-strong --param=ssp-buffer-size=4 -Werror=trampolines -fPIC -march=x86-64 -gdwarf-4 -fno-debug-types-section -fvar-tracking-assignments -g2 -c /tmp/B.Xp46Uc/BUILD/php80-pecl-translit-0.7.0/data/compact_underscores.c -fPIC -DPIC -o data/.libs/compact_underscores.o /bin/sh /tmp/B.Xp46Uc/BUILD/php80-pecl-translit-0.7.0/libtool --mode=compile x86_64-pld-linux-gcc -I. -I/tmp/B.Xp46Uc/BUILD/php80-pecl-translit-0.7.0 -I/tmp/B.Xp46Uc/BUILD/php80-pecl-translit-0.7.0/include -I/tmp/B.Xp46Uc/BUILD/php80-pecl-translit-0.7.0/main -I/tmp/B.Xp46Uc/BUILD/php80-pecl-translit-0.7.0 -I/usr/include/php -I/usr/include/php/main -I/usr/include/php/TSRM -I/usr/include/php/Zend -I/usr/include/php/ext -I/usr/include/php/ext/date/lib -DHAVE_CONFIG_H -O2 -fwrapv -pipe -Wformat -Werror=format-security -gdwarf-4 -fno-debug-types-section -fvar-tracking-assignments -g2 -Wp,-D_FORTIFY_SOURCE=2 -fstack-protector-strong --param=ssp-buffer-size=4 -Werror=trampolines -fPIC -march=x86-64 -gdwarf-4 -fno-debug-types-section -fvar-tracking-assignments -g2 -c /tmp/B.Xp46Uc/BUILD/php80-pecl-translit-0.7.0/data/hebrew_transliterate.c -o data/hebrew_transliterate.lo libtool: compile: x86_64-pld-linux-gcc -I. -I/tmp/B.Xp46Uc/BUILD/php80-pecl-translit-0.7.0 -I/tmp/B.Xp46Uc/BUILD/php80-pecl-translit-0.7.0/include -I/tmp/B.Xp46Uc/BUILD/php80-pecl-translit-0.7.0/main -I/tmp/B.Xp46Uc/BUILD/php80-pecl-translit-0.7.0 -I/usr/include/php -I/usr/include/php/main -I/usr/include/php/TSRM -I/usr/include/php/Zend -I/usr/include/php/ext -I/usr/include/php/ext/date/lib -DHAVE_CONFIG_H -O2 -fwrapv -pipe -Wformat -Werror=format-security -gdwarf-4 -fno-debug-types-section -fvar-tracking-assignments -g2 -Wp,-D_FORTIFY_SOURCE=2 -fstack-protector-strong --param=ssp-buffer-size=4 -Werror=trampolines -fPIC -march=x86-64 -gdwarf-4 -fno-debug-types-section -fvar-tracking-assignments -g2 -c /tmp/B.Xp46Uc/BUILD/php80-pecl-translit-0.7.0/data/hebrew_transliterate.c -fPIC -DPIC -o data/.libs/hebrew_transliterate.o /bin/sh /tmp/B.Xp46Uc/BUILD/php80-pecl-translit-0.7.0/libtool --mode=compile x86_64-pld-linux-gcc -I. -I/tmp/B.Xp46Uc/BUILD/php80-pecl-translit-0.7.0 -I/tmp/B.Xp46Uc/BUILD/php80-pecl-translit-0.7.0/include -I/tmp/B.Xp46Uc/BUILD/php80-pecl-translit-0.7.0/main -I/tmp/B.Xp46Uc/BUILD/php80-pecl-translit-0.7.0 -I/usr/include/php -I/usr/include/php/main -I/usr/include/php/TSRM -I/usr/include/php/Zend -I/usr/include/php/ext -I/usr/include/php/ext/date/lib -DHAVE_CONFIG_H -O2 -fwrapv -pipe -Wformat -Werror=format-security -gdwarf-4 -fno-debug-types-section -fvar-tracking-assignments -g2 -Wp,-D_FORTIFY_SOURCE=2 -fstack-protector-strong --param=ssp-buffer-size=4 -Werror=trampolines -fPIC -march=x86-64 -gdwarf-4 -fno-debug-types-section -fvar-tracking-assignments -g2 -c /tmp/B.Xp46Uc/BUILD/php80-pecl-translit-0.7.0/data/jamo_transliterate.c -o data/jamo_transliterate.lo libtool: compile: x86_64-pld-linux-gcc -I. -I/tmp/B.Xp46Uc/BUILD/php80-pecl-translit-0.7.0 -I/tmp/B.Xp46Uc/BUILD/php80-pecl-translit-0.7.0/include -I/tmp/B.Xp46Uc/BUILD/php80-pecl-translit-0.7.0/main -I/tmp/B.Xp46Uc/BUILD/php80-pecl-translit-0.7.0 -I/usr/include/php -I/usr/include/php/main -I/usr/include/php/TSRM -I/usr/include/php/Zend -I/usr/include/php/ext -I/usr/include/php/ext/date/lib -DHAVE_CONFIG_H -O2 -fwrapv -pipe -Wformat -Werror=format-security -gdwarf-4 -fno-debug-types-section -fvar-tracking-assignments -g2 -Wp,-D_FORTIFY_SOURCE=2 -fstack-protector-strong --param=ssp-buffer-size=4 -Werror=trampolines -fPIC -march=x86-64 -gdwarf-4 -fno-debug-types-section -fvar-tracking-assignments -g2 -c /tmp/B.Xp46Uc/BUILD/php80-pecl-translit-0.7.0/data/jamo_transliterate.c -fPIC -DPIC -o data/.libs/jamo_transliterate.o /bin/sh /tmp/B.Xp46Uc/BUILD/php80-pecl-translit-0.7.0/libtool --mode=compile x86_64-pld-linux-gcc -I. -I/tmp/B.Xp46Uc/BUILD/php80-pecl-translit-0.7.0 -I/tmp/B.Xp46Uc/BUILD/php80-pecl-translit-0.7.0/include -I/tmp/B.Xp46Uc/BUILD/php80-pecl-translit-0.7.0/main -I/tmp/B.Xp46Uc/BUILD/php80-pecl-translit-0.7.0 -I/usr/include/php -I/usr/include/php/main -I/usr/include/php/TSRM -I/usr/include/php/Zend -I/usr/include/php/ext -I/usr/include/php/ext/date/lib -DHAVE_CONFIG_H -O2 -fwrapv -pipe -Wformat -Werror=format-security -gdwarf-4 -fno-debug-types-section -fvar-tracking-assignments -g2 -Wp,-D_FORTIFY_SOURCE=2 -fstack-protector-strong --param=ssp-buffer-size=4 -Werror=trampolines -fPIC -march=x86-64 -gdwarf-4 -fno-debug-types-section -fvar-tracking-assignments -g2 -c /tmp/B.Xp46Uc/BUILD/php80-pecl-translit-0.7.0/data/diacritical_remove.c -o data/diacritical_remove.lo libtool: compile: x86_64-pld-linux-gcc -I. -I/tmp/B.Xp46Uc/BUILD/php80-pecl-translit-0.7.0 -I/tmp/B.Xp46Uc/BUILD/php80-pecl-translit-0.7.0/include -I/tmp/B.Xp46Uc/BUILD/php80-pecl-translit-0.7.0/main -I/tmp/B.Xp46Uc/BUILD/php80-pecl-translit-0.7.0 -I/usr/include/php -I/usr/include/php/main -I/usr/include/php/TSRM -I/usr/include/php/Zend -I/usr/include/php/ext -I/usr/include/php/ext/date/lib -DHAVE_CONFIG_H -O2 -fwrapv -pipe -Wformat -Werror=format-security -gdwarf-4 -fno-debug-types-section -fvar-tracking-assignments -g2 -Wp,-D_FORTIFY_SOURCE=2 -fstack-protector-strong --param=ssp-buffer-size=4 -Werror=trampolines -fPIC -march=x86-64 -gdwarf-4 -fno-debug-types-section -fvar-tracking-assignments -g2 -c /tmp/B.Xp46Uc/BUILD/php80-pecl-translit-0.7.0/data/diacritical_remove.c -fPIC -DPIC -o data/.libs/diacritical_remove.o /bin/sh /tmp/B.Xp46Uc/BUILD/php80-pecl-translit-0.7.0/libtool --mode=compile x86_64-pld-linux-gcc -I. -I/tmp/B.Xp46Uc/BUILD/php80-pecl-translit-0.7.0 -I/tmp/B.Xp46Uc/BUILD/php80-pecl-translit-0.7.0/include -I/tmp/B.Xp46Uc/BUILD/php80-pecl-translit-0.7.0/main -I/tmp/B.Xp46Uc/BUILD/php80-pecl-translit-0.7.0 -I/usr/include/php -I/usr/include/php/main -I/usr/include/php/TSRM -I/usr/include/php/Zend -I/usr/include/php/ext -I/usr/include/php/ext/date/lib -DHAVE_CONFIG_H -O2 -fwrapv -pipe -Wformat -Werror=format-security -gdwarf-4 -fno-debug-types-section -fvar-tracking-assignments -g2 -Wp,-D_FORTIFY_SOURCE=2 -fstack-protector-strong --param=ssp-buffer-size=4 -Werror=trampolines -fPIC -march=x86-64 -gdwarf-4 -fno-debug-types-section -fvar-tracking-assignments -g2 -c /tmp/B.Xp46Uc/BUILD/php80-pecl-translit-0.7.0/data/greek_transliterate.c -o data/greek_transliterate.lo libtool: compile: x86_64-pld-linux-gcc -I. -I/tmp/B.Xp46Uc/BUILD/php80-pecl-translit-0.7.0 -I/tmp/B.Xp46Uc/BUILD/php80-pecl-translit-0.7.0/include -I/tmp/B.Xp46Uc/BUILD/php80-pecl-translit-0.7.0/main -I/tmp/B.Xp46Uc/BUILD/php80-pecl-translit-0.7.0 -I/usr/include/php -I/usr/include/php/main -I/usr/include/php/TSRM -I/usr/include/php/Zend -I/usr/include/php/ext -I/usr/include/php/ext/date/lib -DHAVE_CONFIG_H -O2 -fwrapv -pipe -Wformat -Werror=format-security -gdwarf-4 -fno-debug-types-section -fvar-tracking-assignments -g2 -Wp,-D_FORTIFY_SOURCE=2 -fstack-protector-strong --param=ssp-buffer-size=4 -Werror=trampolines -fPIC -march=x86-64 -gdwarf-4 -fno-debug-types-section -fvar-tracking-assignments -g2 -c /tmp/B.Xp46Uc/BUILD/php80-pecl-translit-0.7.0/data/greek_transliterate.c -fPIC -DPIC -o data/.libs/greek_transliterate.o /bin/sh /tmp/B.Xp46Uc/BUILD/php80-pecl-translit-0.7.0/libtool --mode=compile x86_64-pld-linux-gcc -I. -I/tmp/B.Xp46Uc/BUILD/php80-pecl-translit-0.7.0 -I/tmp/B.Xp46Uc/BUILD/php80-pecl-translit-0.7.0/include -I/tmp/B.Xp46Uc/BUILD/php80-pecl-translit-0.7.0/main -I/tmp/B.Xp46Uc/BUILD/php80-pecl-translit-0.7.0 -I/usr/include/php -I/usr/include/php/main -I/usr/include/php/TSRM -I/usr/include/php/Zend -I/usr/include/php/ext -I/usr/include/php/ext/date/lib -DHAVE_CONFIG_H -O2 -fwrapv -pipe -Wformat -Werror=format-security -gdwarf-4 -fno-debug-types-section -fvar-tracking-assignments -g2 -Wp,-D_FORTIFY_SOURCE=2 -fstack-protector-strong --param=ssp-buffer-size=4 -Werror=trampolines -fPIC -march=x86-64 -gdwarf-4 -fno-debug-types-section -fvar-tracking-assignments -g2 -c /tmp/B.Xp46Uc/BUILD/php80-pecl-translit-0.7.0/data/cyrillic_transliterate.c -o data/cyrillic_transliterate.lo libtool: compile: x86_64-pld-linux-gcc -I. -I/tmp/B.Xp46Uc/BUILD/php80-pecl-translit-0.7.0 -I/tmp/B.Xp46Uc/BUILD/php80-pecl-translit-0.7.0/include -I/tmp/B.Xp46Uc/BUILD/php80-pecl-translit-0.7.0/main -I/tmp/B.Xp46Uc/BUILD/php80-pecl-translit-0.7.0 -I/usr/include/php -I/usr/include/php/main -I/usr/include/php/TSRM -I/usr/include/php/Zend -I/usr/include/php/ext -I/usr/include/php/ext/date/lib -DHAVE_CONFIG_H -O2 -fwrapv -pipe -Wformat -Werror=format-security -gdwarf-4 -fno-debug-types-section -fvar-tracking-assignments -g2 -Wp,-D_FORTIFY_SOURCE=2 -fstack-protector-strong --param=ssp-buffer-size=4 -Werror=trampolines -fPIC -march=x86-64 -gdwarf-4 -fno-debug-types-section -fvar-tracking-assignments -g2 -c /tmp/B.Xp46Uc/BUILD/php80-pecl-translit-0.7.0/data/cyrillic_transliterate.c -fPIC -DPIC -o data/.libs/cyrillic_transliterate.o /bin/sh /tmp/B.Xp46Uc/BUILD/php80-pecl-translit-0.7.0/libtool --mode=compile x86_64-pld-linux-gcc -I. -I/tmp/B.Xp46Uc/BUILD/php80-pecl-translit-0.7.0 -I/tmp/B.Xp46Uc/BUILD/php80-pecl-translit-0.7.0/include -I/tmp/B.Xp46Uc/BUILD/php80-pecl-translit-0.7.0/main -I/tmp/B.Xp46Uc/BUILD/php80-pecl-translit-0.7.0 -I/usr/include/php -I/usr/include/php/main -I/usr/include/php/TSRM -I/usr/include/php/Zend -I/usr/include/php/ext -I/usr/include/php/ext/date/lib -DHAVE_CONFIG_H -O2 -fwrapv -pipe -Wformat -Werror=format-security -gdwarf-4 -fno-debug-types-section -fvar-tracking-assignments -g2 -Wp,-D_FORTIFY_SOURCE=2 -fstack-protector-strong --param=ssp-buffer-size=4 -Werror=trampolines -fPIC -march=x86-64 -gdwarf-4 -fno-debug-types-section -fvar-tracking-assignments -g2 -c /tmp/B.Xp46Uc/BUILD/php80-pecl-translit-0.7.0/data/hangul_to_jamo_transliterate.c -o data/hangul_to_jamo_transliterate.lo libtool: compile: x86_64-pld-linux-gcc -I. -I/tmp/B.Xp46Uc/BUILD/php80-pecl-translit-0.7.0 -I/tmp/B.Xp46Uc/BUILD/php80-pecl-translit-0.7.0/include -I/tmp/B.Xp46Uc/BUILD/php80-pecl-translit-0.7.0/main -I/tmp/B.Xp46Uc/BUILD/php80-pecl-translit-0.7.0 -I/usr/include/php -I/usr/include/php/main -I/usr/include/php/TSRM -I/usr/include/php/Zend -I/usr/include/php/ext -I/usr/include/php/ext/date/lib -DHAVE_CONFIG_H -O2 -fwrapv -pipe -Wformat -Werror=format-security -gdwarf-4 -fno-debug-types-section -fvar-tracking-assignments -g2 -Wp,-D_FORTIFY_SOURCE=2 -fstack-protector-strong --param=ssp-buffer-size=4 -Werror=trampolines -fPIC -march=x86-64 -gdwarf-4 -fno-debug-types-section -fvar-tracking-assignments -g2 -c /tmp/B.Xp46Uc/BUILD/php80-pecl-translit-0.7.0/data/hangul_to_jamo_transliterate.c -fPIC -DPIC -o data/.libs/hangul_to_jamo_transliterate.o /bin/sh /tmp/B.Xp46Uc/BUILD/php80-pecl-translit-0.7.0/libtool --mode=compile x86_64-pld-linux-gcc -I. -I/tmp/B.Xp46Uc/BUILD/php80-pecl-translit-0.7.0 -I/tmp/B.Xp46Uc/BUILD/php80-pecl-translit-0.7.0/include -I/tmp/B.Xp46Uc/BUILD/php80-pecl-translit-0.7.0/main -I/tmp/B.Xp46Uc/BUILD/php80-pecl-translit-0.7.0 -I/usr/include/php -I/usr/include/php/main -I/usr/include/php/TSRM -I/usr/include/php/Zend -I/usr/include/php/ext -I/usr/include/php/ext/date/lib -DHAVE_CONFIG_H -O2 -fwrapv -pipe -Wformat -Werror=format-security -gdwarf-4 -fno-debug-types-section -fvar-tracking-assignments -g2 -Wp,-D_FORTIFY_SOURCE=2 -fstack-protector-strong --param=ssp-buffer-size=4 -Werror=trampolines -fPIC -march=x86-64 -gdwarf-4 -fno-debug-types-section -fvar-tracking-assignments -g2 -c /tmp/B.Xp46Uc/BUILD/php80-pecl-translit-0.7.0/data/lowercase_cyrillic.c -o data/lowercase_cyrillic.lo libtool: compile: x86_64-pld-linux-gcc -I. -I/tmp/B.Xp46Uc/BUILD/php80-pecl-translit-0.7.0 -I/tmp/B.Xp46Uc/BUILD/php80-pecl-translit-0.7.0/include -I/tmp/B.Xp46Uc/BUILD/php80-pecl-translit-0.7.0/main -I/tmp/B.Xp46Uc/BUILD/php80-pecl-translit-0.7.0 -I/usr/include/php -I/usr/include/php/main -I/usr/include/php/TSRM -I/usr/include/php/Zend -I/usr/include/php/ext -I/usr/include/php/ext/date/lib -DHAVE_CONFIG_H -O2 -fwrapv -pipe -Wformat -Werror=format-security -gdwarf-4 -fno-debug-types-section -fvar-tracking-assignments -g2 -Wp,-D_FORTIFY_SOURCE=2 -fstack-protector-strong --param=ssp-buffer-size=4 -Werror=trampolines -fPIC -march=x86-64 -gdwarf-4 -fno-debug-types-section -fvar-tracking-assignments -g2 -c /tmp/B.Xp46Uc/BUILD/php80-pecl-translit-0.7.0/data/lowercase_cyrillic.c -fPIC -DPIC -o data/.libs/lowercase_cyrillic.o /bin/sh /tmp/B.Xp46Uc/BUILD/php80-pecl-translit-0.7.0/libtool --mode=compile x86_64-pld-linux-gcc -I. -I/tmp/B.Xp46Uc/BUILD/php80-pecl-translit-0.7.0 -I/tmp/B.Xp46Uc/BUILD/php80-pecl-translit-0.7.0/include -I/tmp/B.Xp46Uc/BUILD/php80-pecl-translit-0.7.0/main -I/tmp/B.Xp46Uc/BUILD/php80-pecl-translit-0.7.0 -I/usr/include/php -I/usr/include/php/main -I/usr/include/php/TSRM -I/usr/include/php/Zend -I/usr/include/php/ext -I/usr/include/php/ext/date/lib -DHAVE_CONFIG_H -O2 -fwrapv -pipe -Wformat -Werror=format-security -gdwarf-4 -fno-debug-types-section -fvar-tracking-assignments -g2 -Wp,-D_FORTIFY_SOURCE=2 -fstack-protector-strong --param=ssp-buffer-size=4 -Werror=trampolines -fPIC -march=x86-64 -gdwarf-4 -fno-debug-types-section -fvar-tracking-assignments -g2 -c /tmp/B.Xp46Uc/BUILD/php80-pecl-translit-0.7.0/data/lowercase_greek.c -o data/lowercase_greek.lo libtool: compile: x86_64-pld-linux-gcc -I. -I/tmp/B.Xp46Uc/BUILD/php80-pecl-translit-0.7.0 -I/tmp/B.Xp46Uc/BUILD/php80-pecl-translit-0.7.0/include -I/tmp/B.Xp46Uc/BUILD/php80-pecl-translit-0.7.0/main -I/tmp/B.Xp46Uc/BUILD/php80-pecl-translit-0.7.0 -I/usr/include/php -I/usr/include/php/main -I/usr/include/php/TSRM -I/usr/include/php/Zend -I/usr/include/php/ext -I/usr/include/php/ext/date/lib -DHAVE_CONFIG_H -O2 -fwrapv -pipe -Wformat -Werror=format-security -gdwarf-4 -fno-debug-types-section -fvar-tracking-assignments -g2 -Wp,-D_FORTIFY_SOURCE=2 -fstack-protector-strong --param=ssp-buffer-size=4 -Werror=trampolines -fPIC -march=x86-64 -gdwarf-4 -fno-debug-types-section -fvar-tracking-assignments -g2 -c /tmp/B.Xp46Uc/BUILD/php80-pecl-translit-0.7.0/data/lowercase_greek.c -fPIC -DPIC -o data/.libs/lowercase_greek.o /bin/sh /tmp/B.Xp46Uc/BUILD/php80-pecl-translit-0.7.0/libtool --mode=compile x86_64-pld-linux-gcc -I. -I/tmp/B.Xp46Uc/BUILD/php80-pecl-translit-0.7.0 -I/tmp/B.Xp46Uc/BUILD/php80-pecl-translit-0.7.0/include -I/tmp/B.Xp46Uc/BUILD/php80-pecl-translit-0.7.0/main -I/tmp/B.Xp46Uc/BUILD/php80-pecl-translit-0.7.0 -I/usr/include/php -I/usr/include/php/main -I/usr/include/php/TSRM -I/usr/include/php/Zend -I/usr/include/php/ext -I/usr/include/php/ext/date/lib -DHAVE_CONFIG_H -O2 -fwrapv -pipe -Wformat -Werror=format-security -gdwarf-4 -fno-debug-types-section -fvar-tracking-assignments -g2 -Wp,-D_FORTIFY_SOURCE=2 -fstack-protector-strong --param=ssp-buffer-size=4 -Werror=trampolines -fPIC -march=x86-64 -gdwarf-4 -fno-debug-types-section -fvar-tracking-assignments -g2 -c /tmp/B.Xp46Uc/BUILD/php80-pecl-translit-0.7.0/data/lowercase_latin.c -o data/lowercase_latin.lo libtool: compile: x86_64-pld-linux-gcc -I. -I/tmp/B.Xp46Uc/BUILD/php80-pecl-translit-0.7.0 -I/tmp/B.Xp46Uc/BUILD/php80-pecl-translit-0.7.0/include -I/tmp/B.Xp46Uc/BUILD/php80-pecl-translit-0.7.0/main -I/tmp/B.Xp46Uc/BUILD/php80-pecl-translit-0.7.0 -I/usr/include/php -I/usr/include/php/main -I/usr/include/php/TSRM -I/usr/include/php/Zend -I/usr/include/php/ext -I/usr/include/php/ext/date/lib -DHAVE_CONFIG_H -O2 -fwrapv -pipe -Wformat -Werror=format-security -gdwarf-4 -fno-debug-types-section -fvar-tracking-assignments -g2 -Wp,-D_FORTIFY_SOURCE=2 -fstack-protector-strong --param=ssp-buffer-size=4 -Werror=trampolines -fPIC -march=x86-64 -gdwarf-4 -fno-debug-types-section -fvar-tracking-assignments -g2 -c /tmp/B.Xp46Uc/BUILD/php80-pecl-translit-0.7.0/data/lowercase_latin.c -fPIC -DPIC -o data/.libs/lowercase_latin.o /bin/sh /tmp/B.Xp46Uc/BUILD/php80-pecl-translit-0.7.0/libtool --mode=compile x86_64-pld-linux-gcc -I. -I/tmp/B.Xp46Uc/BUILD/php80-pecl-translit-0.7.0 -I/tmp/B.Xp46Uc/BUILD/php80-pecl-translit-0.7.0/include -I/tmp/B.Xp46Uc/BUILD/php80-pecl-translit-0.7.0/main -I/tmp/B.Xp46Uc/BUILD/php80-pecl-translit-0.7.0 -I/usr/include/php -I/usr/include/php/main -I/usr/include/php/TSRM -I/usr/include/php/Zend -I/usr/include/php/ext -I/usr/include/php/ext/date/lib -DHAVE_CONFIG_H -O2 -fwrapv -pipe -Wformat -Werror=format-security -gdwarf-4 -fno-debug-types-section -fvar-tracking-assignments -g2 -Wp,-D_FORTIFY_SOURCE=2 -fstack-protector-strong --param=ssp-buffer-size=4 -Werror=trampolines -fPIC -march=x86-64 -gdwarf-4 -fno-debug-types-section -fvar-tracking-assignments -g2 -c /tmp/B.Xp46Uc/BUILD/php80-pecl-translit-0.7.0/data/normalize_ligature.c -o data/normalize_ligature.lo libtool: compile: x86_64-pld-linux-gcc -I. -I/tmp/B.Xp46Uc/BUILD/php80-pecl-translit-0.7.0 -I/tmp/B.Xp46Uc/BUILD/php80-pecl-translit-0.7.0/include -I/tmp/B.Xp46Uc/BUILD/php80-pecl-translit-0.7.0/main -I/tmp/B.Xp46Uc/BUILD/php80-pecl-translit-0.7.0 -I/usr/include/php -I/usr/include/php/main -I/usr/include/php/TSRM -I/usr/include/php/Zend -I/usr/include/php/ext -I/usr/include/php/ext/date/lib -DHAVE_CONFIG_H -O2 -fwrapv -pipe -Wformat -Werror=format-security -gdwarf-4 -fno-debug-types-section -fvar-tracking-assignments -g2 -Wp,-D_FORTIFY_SOURCE=2 -fstack-protector-strong --param=ssp-buffer-size=4 -Werror=trampolines -fPIC -march=x86-64 -gdwarf-4 -fno-debug-types-section -fvar-tracking-assignments -g2 -c /tmp/B.Xp46Uc/BUILD/php80-pecl-translit-0.7.0/data/normalize_ligature.c -fPIC -DPIC -o data/.libs/normalize_ligature.o /bin/sh /tmp/B.Xp46Uc/BUILD/php80-pecl-translit-0.7.0/libtool --mode=compile x86_64-pld-linux-gcc -I. -I/tmp/B.Xp46Uc/BUILD/php80-pecl-translit-0.7.0 -I/tmp/B.Xp46Uc/BUILD/php80-pecl-translit-0.7.0/include -I/tmp/B.Xp46Uc/BUILD/php80-pecl-translit-0.7.0/main -I/tmp/B.Xp46Uc/BUILD/php80-pecl-translit-0.7.0 -I/usr/include/php -I/usr/include/php/main -I/usr/include/php/TSRM -I/usr/include/php/Zend -I/usr/include/php/ext -I/usr/include/php/ext/date/lib -DHAVE_CONFIG_H -O2 -fwrapv -pipe -Wformat -Werror=format-security -gdwarf-4 -fno-debug-types-section -fvar-tracking-assignments -g2 -Wp,-D_FORTIFY_SOURCE=2 -fstack-protector-strong --param=ssp-buffer-size=4 -Werror=trampolines -fPIC -march=x86-64 -gdwarf-4 -fno-debug-types-section -fvar-tracking-assignments -g2 -c /tmp/B.Xp46Uc/BUILD/php80-pecl-translit-0.7.0/data/normalize_punctuation.c -o data/normalize_punctuation.lo libtool: compile: x86_64-pld-linux-gcc -I. -I/tmp/B.Xp46Uc/BUILD/php80-pecl-translit-0.7.0 -I/tmp/B.Xp46Uc/BUILD/php80-pecl-translit-0.7.0/include -I/tmp/B.Xp46Uc/BUILD/php80-pecl-translit-0.7.0/main -I/tmp/B.Xp46Uc/BUILD/php80-pecl-translit-0.7.0 -I/usr/include/php -I/usr/include/php/main -I/usr/include/php/TSRM -I/usr/include/php/Zend -I/usr/include/php/ext -I/usr/include/php/ext/date/lib -DHAVE_CONFIG_H -O2 -fwrapv -pipe -Wformat -Werror=format-security -gdwarf-4 -fno-debug-types-section -fvar-tracking-assignments -g2 -Wp,-D_FORTIFY_SOURCE=2 -fstack-protector-strong --param=ssp-buffer-size=4 -Werror=trampolines -fPIC -march=x86-64 -gdwarf-4 -fno-debug-types-section -fvar-tracking-assignments -g2 -c /tmp/B.Xp46Uc/BUILD/php80-pecl-translit-0.7.0/data/normalize_punctuation.c -fPIC -DPIC -o data/.libs/normalize_punctuation.o /bin/sh /tmp/B.Xp46Uc/BUILD/php80-pecl-translit-0.7.0/libtool --mode=compile x86_64-pld-linux-gcc -I. -I/tmp/B.Xp46Uc/BUILD/php80-pecl-translit-0.7.0 -I/tmp/B.Xp46Uc/BUILD/php80-pecl-translit-0.7.0/include -I/tmp/B.Xp46Uc/BUILD/php80-pecl-translit-0.7.0/main -I/tmp/B.Xp46Uc/BUILD/php80-pecl-translit-0.7.0 -I/usr/include/php -I/usr/include/php/main -I/usr/include/php/TSRM -I/usr/include/php/Zend -I/usr/include/php/ext -I/usr/include/php/ext/date/lib -DHAVE_CONFIG_H -O2 -fwrapv -pipe -Wformat -Werror=format-security -gdwarf-4 -fno-debug-types-section -fvar-tracking-assignments -g2 -Wp,-D_FORTIFY_SOURCE=2 -fstack-protector-strong --param=ssp-buffer-size=4 -Werror=trampolines -fPIC -march=x86-64 -gdwarf-4 -fno-debug-types-section -fvar-tracking-assignments -g2 -c /tmp/B.Xp46Uc/BUILD/php80-pecl-translit-0.7.0/data/special_decompose.c -o data/special_decompose.lo libtool: compile: x86_64-pld-linux-gcc -I. -I/tmp/B.Xp46Uc/BUILD/php80-pecl-translit-0.7.0 -I/tmp/B.Xp46Uc/BUILD/php80-pecl-translit-0.7.0/include -I/tmp/B.Xp46Uc/BUILD/php80-pecl-translit-0.7.0/main -I/tmp/B.Xp46Uc/BUILD/php80-pecl-translit-0.7.0 -I/usr/include/php -I/usr/include/php/main -I/usr/include/php/TSRM -I/usr/include/php/Zend -I/usr/include/php/ext -I/usr/include/php/ext/date/lib -DHAVE_CONFIG_H -O2 -fwrapv -pipe -Wformat -Werror=format-security -gdwarf-4 -fno-debug-types-section -fvar-tracking-assignments -g2 -Wp,-D_FORTIFY_SOURCE=2 -fstack-protector-strong --param=ssp-buffer-size=4 -Werror=trampolines -fPIC -march=x86-64 -gdwarf-4 -fno-debug-types-section -fvar-tracking-assignments -g2 -c /tmp/B.Xp46Uc/BUILD/php80-pecl-translit-0.7.0/data/special_decompose.c -fPIC -DPIC -o data/.libs/special_decompose.o /bin/sh /tmp/B.Xp46Uc/BUILD/php80-pecl-translit-0.7.0/libtool --mode=compile x86_64-pld-linux-gcc -I. -I/tmp/B.Xp46Uc/BUILD/php80-pecl-translit-0.7.0 -I/tmp/B.Xp46Uc/BUILD/php80-pecl-translit-0.7.0/include -I/tmp/B.Xp46Uc/BUILD/php80-pecl-translit-0.7.0/main -I/tmp/B.Xp46Uc/BUILD/php80-pecl-translit-0.7.0 -I/usr/include/php -I/usr/include/php/main -I/usr/include/php/TSRM -I/usr/include/php/Zend -I/usr/include/php/ext -I/usr/include/php/ext/date/lib -DHAVE_CONFIG_H -O2 -fwrapv -pipe -Wformat -Werror=format-security -gdwarf-4 -fno-debug-types-section -fvar-tracking-assignments -g2 -Wp,-D_FORTIFY_SOURCE=2 -fstack-protector-strong --param=ssp-buffer-size=4 -Werror=trampolines -fPIC -march=x86-64 -gdwarf-4 -fno-debug-types-section -fvar-tracking-assignments -g2 -c /tmp/B.Xp46Uc/BUILD/php80-pecl-translit-0.7.0/data/uppercase_cyrillic.c -o data/uppercase_cyrillic.lo libtool: compile: x86_64-pld-linux-gcc -I. -I/tmp/B.Xp46Uc/BUILD/php80-pecl-translit-0.7.0 -I/tmp/B.Xp46Uc/BUILD/php80-pecl-translit-0.7.0/include -I/tmp/B.Xp46Uc/BUILD/php80-pecl-translit-0.7.0/main -I/tmp/B.Xp46Uc/BUILD/php80-pecl-translit-0.7.0 -I/usr/include/php -I/usr/include/php/main -I/usr/include/php/TSRM -I/usr/include/php/Zend -I/usr/include/php/ext -I/usr/include/php/ext/date/lib -DHAVE_CONFIG_H -O2 -fwrapv -pipe -Wformat -Werror=format-security -gdwarf-4 -fno-debug-types-section -fvar-tracking-assignments -g2 -Wp,-D_FORTIFY_SOURCE=2 -fstack-protector-strong --param=ssp-buffer-size=4 -Werror=trampolines -fPIC -march=x86-64 -gdwarf-4 -fno-debug-types-section -fvar-tracking-assignments -g2 -c /tmp/B.Xp46Uc/BUILD/php80-pecl-translit-0.7.0/data/uppercase_cyrillic.c -fPIC -DPIC -o data/.libs/uppercase_cyrillic.o /bin/sh /tmp/B.Xp46Uc/BUILD/php80-pecl-translit-0.7.0/libtool --mode=compile x86_64-pld-linux-gcc -I. -I/tmp/B.Xp46Uc/BUILD/php80-pecl-translit-0.7.0 -I/tmp/B.Xp46Uc/BUILD/php80-pecl-translit-0.7.0/include -I/tmp/B.Xp46Uc/BUILD/php80-pecl-translit-0.7.0/main -I/tmp/B.Xp46Uc/BUILD/php80-pecl-translit-0.7.0 -I/usr/include/php -I/usr/include/php/main -I/usr/include/php/TSRM -I/usr/include/php/Zend -I/usr/include/php/ext -I/usr/include/php/ext/date/lib -DHAVE_CONFIG_H -O2 -fwrapv -pipe -Wformat -Werror=format-security -gdwarf-4 -fno-debug-types-section -fvar-tracking-assignments -g2 -Wp,-D_FORTIFY_SOURCE=2 -fstack-protector-strong --param=ssp-buffer-size=4 -Werror=trampolines -fPIC -march=x86-64 -gdwarf-4 -fno-debug-types-section -fvar-tracking-assignments -g2 -c /tmp/B.Xp46Uc/BUILD/php80-pecl-translit-0.7.0/translit.c -o translit.lo libtool: compile: x86_64-pld-linux-gcc -I. -I/tmp/B.Xp46Uc/BUILD/php80-pecl-translit-0.7.0 -I/tmp/B.Xp46Uc/BUILD/php80-pecl-translit-0.7.0/include -I/tmp/B.Xp46Uc/BUILD/php80-pecl-translit-0.7.0/main -I/tmp/B.Xp46Uc/BUILD/php80-pecl-translit-0.7.0 -I/usr/include/php -I/usr/include/php/main -I/usr/include/php/TSRM -I/usr/include/php/Zend -I/usr/include/php/ext -I/usr/include/php/ext/date/lib -DHAVE_CONFIG_H -O2 -fwrapv -pipe -Wformat -Werror=format-security -gdwarf-4 -fno-debug-types-section -fvar-tracking-assignments -g2 -Wp,-D_FORTIFY_SOURCE=2 -fstack-protector-strong --param=ssp-buffer-size=4 -Werror=trampolines -fPIC -march=x86-64 -gdwarf-4 -fno-debug-types-section -fvar-tracking-assignments -g2 -c /tmp/B.Xp46Uc/BUILD/php80-pecl-translit-0.7.0/translit.c -fPIC -DPIC -o .libs/translit.o /bin/sh /tmp/B.Xp46Uc/BUILD/php80-pecl-translit-0.7.0/libtool --mode=compile x86_64-pld-linux-gcc -I. -I/tmp/B.Xp46Uc/BUILD/php80-pecl-translit-0.7.0 -I/tmp/B.Xp46Uc/BUILD/php80-pecl-translit-0.7.0/include -I/tmp/B.Xp46Uc/BUILD/php80-pecl-translit-0.7.0/main -I/tmp/B.Xp46Uc/BUILD/php80-pecl-translit-0.7.0 -I/usr/include/php -I/usr/include/php/main -I/usr/include/php/TSRM -I/usr/include/php/Zend -I/usr/include/php/ext -I/usr/include/php/ext/date/lib -DHAVE_CONFIG_H -O2 -fwrapv -pipe -Wformat -Werror=format-security -gdwarf-4 -fno-debug-types-section -fvar-tracking-assignments -g2 -Wp,-D_FORTIFY_SOURCE=2 -fstack-protector-strong --param=ssp-buffer-size=4 -Werror=trampolines -fPIC -march=x86-64 -gdwarf-4 -fno-debug-types-section -fvar-tracking-assignments -g2 -c /tmp/B.Xp46Uc/BUILD/php80-pecl-translit-0.7.0/data/uppercase_greek.c -o data/uppercase_greek.lo libtool: compile: x86_64-pld-linux-gcc -I. -I/tmp/B.Xp46Uc/BUILD/php80-pecl-translit-0.7.0 -I/tmp/B.Xp46Uc/BUILD/php80-pecl-translit-0.7.0/include -I/tmp/B.Xp46Uc/BUILD/php80-pecl-translit-0.7.0/main -I/tmp/B.Xp46Uc/BUILD/php80-pecl-translit-0.7.0 -I/usr/include/php -I/usr/include/php/main -I/usr/include/php/TSRM -I/usr/include/php/Zend -I/usr/include/php/ext -I/usr/include/php/ext/date/lib -DHAVE_CONFIG_H -O2 -fwrapv -pipe -Wformat -Werror=format-security -gdwarf-4 -fno-debug-types-section -fvar-tracking-assignments -g2 -Wp,-D_FORTIFY_SOURCE=2 -fstack-protector-strong --param=ssp-buffer-size=4 -Werror=trampolines -fPIC -march=x86-64 -gdwarf-4 -fno-debug-types-section -fvar-tracking-assignments -g2 -c /tmp/B.Xp46Uc/BUILD/php80-pecl-translit-0.7.0/data/uppercase_greek.c -fPIC -DPIC -o data/.libs/uppercase_greek.o /bin/sh /tmp/B.Xp46Uc/BUILD/php80-pecl-translit-0.7.0/libtool --mode=compile x86_64-pld-linux-gcc -I. -I/tmp/B.Xp46Uc/BUILD/php80-pecl-translit-0.7.0 -I/tmp/B.Xp46Uc/BUILD/php80-pecl-translit-0.7.0/include -I/tmp/B.Xp46Uc/BUILD/php80-pecl-translit-0.7.0/main -I/tmp/B.Xp46Uc/BUILD/php80-pecl-translit-0.7.0 -I/usr/include/php -I/usr/include/php/main -I/usr/include/php/TSRM -I/usr/include/php/Zend -I/usr/include/php/ext -I/usr/include/php/ext/date/lib -DHAVE_CONFIG_H -O2 -fwrapv -pipe -Wformat -Werror=format-security -gdwarf-4 -fno-debug-types-section -fvar-tracking-assignments -g2 -Wp,-D_FORTIFY_SOURCE=2 -fstack-protector-strong --param=ssp-buffer-size=4 -Werror=trampolines -fPIC -march=x86-64 -gdwarf-4 -fno-debug-types-section -fvar-tracking-assignments -g2 -c /tmp/B.Xp46Uc/BUILD/php80-pecl-translit-0.7.0/data/numbers.c -o data/numbers.lo libtool: compile: x86_64-pld-linux-gcc -I. -I/tmp/B.Xp46Uc/BUILD/php80-pecl-translit-0.7.0 -I/tmp/B.Xp46Uc/BUILD/php80-pecl-translit-0.7.0/include -I/tmp/B.Xp46Uc/BUILD/php80-pecl-translit-0.7.0/main -I/tmp/B.Xp46Uc/BUILD/php80-pecl-translit-0.7.0 -I/usr/include/php -I/usr/include/php/main -I/usr/include/php/TSRM -I/usr/include/php/Zend -I/usr/include/php/ext -I/usr/include/php/ext/date/lib -DHAVE_CONFIG_H -O2 -fwrapv -pipe -Wformat -Werror=format-security -gdwarf-4 -fno-debug-types-section -fvar-tracking-assignments -g2 -Wp,-D_FORTIFY_SOURCE=2 -fstack-protector-strong --param=ssp-buffer-size=4 -Werror=trampolines -fPIC -march=x86-64 -gdwarf-4 -fno-debug-types-section -fvar-tracking-assignments -g2 -c /tmp/B.Xp46Uc/BUILD/php80-pecl-translit-0.7.0/data/numbers.c -fPIC -DPIC -o data/.libs/numbers.o /bin/sh /tmp/B.Xp46Uc/BUILD/php80-pecl-translit-0.7.0/libtool --mode=compile x86_64-pld-linux-gcc -I. -I/tmp/B.Xp46Uc/BUILD/php80-pecl-translit-0.7.0 -I/tmp/B.Xp46Uc/BUILD/php80-pecl-translit-0.7.0/include -I/tmp/B.Xp46Uc/BUILD/php80-pecl-translit-0.7.0/main -I/tmp/B.Xp46Uc/BUILD/php80-pecl-translit-0.7.0 -I/usr/include/php -I/usr/include/php/main -I/usr/include/php/TSRM -I/usr/include/php/Zend -I/usr/include/php/ext -I/usr/include/php/ext/date/lib -DHAVE_CONFIG_H -O2 -fwrapv -pipe -Wformat -Werror=format-security -gdwarf-4 -fno-debug-types-section -fvar-tracking-assignments -g2 -Wp,-D_FORTIFY_SOURCE=2 -fstack-protector-strong --param=ssp-buffer-size=4 -Werror=trampolines -fPIC -march=x86-64 -gdwarf-4 -fno-debug-types-section -fvar-tracking-assignments -g2 -c /tmp/B.Xp46Uc/BUILD/php80-pecl-translit-0.7.0/data/uppercase_latin.c -o data/uppercase_latin.lo libtool: compile: x86_64-pld-linux-gcc -I. -I/tmp/B.Xp46Uc/BUILD/php80-pecl-translit-0.7.0 -I/tmp/B.Xp46Uc/BUILD/php80-pecl-translit-0.7.0/include -I/tmp/B.Xp46Uc/BUILD/php80-pecl-translit-0.7.0/main -I/tmp/B.Xp46Uc/BUILD/php80-pecl-translit-0.7.0 -I/usr/include/php -I/usr/include/php/main -I/usr/include/php/TSRM -I/usr/include/php/Zend -I/usr/include/php/ext -I/usr/include/php/ext/date/lib -DHAVE_CONFIG_H -O2 -fwrapv -pipe -Wformat -Werror=format-security -gdwarf-4 -fno-debug-types-section -fvar-tracking-assignments -g2 -Wp,-D_FORTIFY_SOURCE=2 -fstack-protector-strong --param=ssp-buffer-size=4 -Werror=trampolines -fPIC -march=x86-64 -gdwarf-4 -fno-debug-types-section -fvar-tracking-assignments -g2 -c /tmp/B.Xp46Uc/BUILD/php80-pecl-translit-0.7.0/data/uppercase_latin.c -fPIC -DPIC -o data/.libs/uppercase_latin.o /bin/sh /tmp/B.Xp46Uc/BUILD/php80-pecl-translit-0.7.0/libtool --mode=compile x86_64-pld-linux-gcc -I. -I/tmp/B.Xp46Uc/BUILD/php80-pecl-translit-0.7.0 -I/tmp/B.Xp46Uc/BUILD/php80-pecl-translit-0.7.0/include -I/tmp/B.Xp46Uc/BUILD/php80-pecl-translit-0.7.0/main -I/tmp/B.Xp46Uc/BUILD/php80-pecl-translit-0.7.0 -I/usr/include/php -I/usr/include/php/main -I/usr/include/php/TSRM -I/usr/include/php/Zend -I/usr/include/php/ext -I/usr/include/php/ext/date/lib -DHAVE_CONFIG_H -O2 -fwrapv -pipe -Wformat -Werror=format-security -gdwarf-4 -fno-debug-types-section -fvar-tracking-assignments -g2 -Wp,-D_FORTIFY_SOURCE=2 -fstack-protector-strong --param=ssp-buffer-size=4 -Werror=trampolines -fPIC -march=x86-64 -gdwarf-4 -fno-debug-types-section -fvar-tracking-assignments -g2 -c /tmp/B.Xp46Uc/BUILD/php80-pecl-translit-0.7.0/data/han_transliterate.c -o data/han_transliterate.lo libtool: compile: x86_64-pld-linux-gcc -I. -I/tmp/B.Xp46Uc/BUILD/php80-pecl-translit-0.7.0 -I/tmp/B.Xp46Uc/BUILD/php80-pecl-translit-0.7.0/include -I/tmp/B.Xp46Uc/BUILD/php80-pecl-translit-0.7.0/main -I/tmp/B.Xp46Uc/BUILD/php80-pecl-translit-0.7.0 -I/usr/include/php -I/usr/include/php/main -I/usr/include/php/TSRM -I/usr/include/php/Zend -I/usr/include/php/ext -I/usr/include/php/ext/date/lib -DHAVE_CONFIG_H -O2 -fwrapv -pipe -Wformat -Werror=format-security -gdwarf-4 -fno-debug-types-section -fvar-tracking-assignments -g2 -Wp,-D_FORTIFY_SOURCE=2 -fstack-protector-strong --param=ssp-buffer-size=4 -Werror=trampolines -fPIC -march=x86-64 -gdwarf-4 -fno-debug-types-section -fvar-tracking-assignments -g2 -c /tmp/B.Xp46Uc/BUILD/php80-pecl-translit-0.7.0/data/han_transliterate.c -fPIC -DPIC -o data/.libs/han_transliterate.o /bin/sh /tmp/B.Xp46Uc/BUILD/php80-pecl-translit-0.7.0/libtool --mode=link x86_64-pld-linux-gcc -shared -I/tmp/B.Xp46Uc/BUILD/php80-pecl-translit-0.7.0/include -I/tmp/B.Xp46Uc/BUILD/php80-pecl-translit-0.7.0/main -I/tmp/B.Xp46Uc/BUILD/php80-pecl-translit-0.7.0 -I/usr/include/php -I/usr/include/php/main -I/usr/include/php/TSRM -I/usr/include/php/Zend -I/usr/include/php/ext -I/usr/include/php/ext/date/lib -DHAVE_CONFIG_H -O2 -fwrapv -pipe -Wformat -Werror=format-security -gdwarf-4 -fno-debug-types-section -fvar-tracking-assignments -g2 -Wp,-D_FORTIFY_SOURCE=2 -fstack-protector-strong --param=ssp-buffer-size=4 -Werror=trampolines -fPIC -march=x86-64 -gdwarf-4 -fno-debug-types-section -fvar-tracking-assignments -g2 -Wl,--as-needed -Wl,--no-copy-dt-needed-entries -Wl,-z,relro -Wl,-z,combreloc -o translit.la -export-dynamic -avoid-version -prefer-pic -module -rpath /tmp/B.Xp46Uc/BUILD/php80-pecl-translit-0.7.0/modules translit.lo data/compact_underscores.lo data/cyrillic_transliterate.lo data/diacritical_remove.lo data/greek_transliterate.lo data/han_transliterate.lo data/hangul_to_jamo_transliterate.lo data/jamo_transliterate.lo data/hebrew_transliterate.lo data/lowercase_cyrillic.lo data/lowercase_greek.lo data/lowercase_latin.lo data/normalize_ligature.lo data/normalize_punctuation.lo data/numbers.lo data/special_decompose.lo data/uppercase_cyrillic.lo data/uppercase_greek.lo data/uppercase_latin.lo libtool: link: x86_64-pld-linux-gcc -shared -fPIC -DPIC -O2 -gdwarf-4 -g2 -fstack-protector-strong -march=x86-64 -gdwarf-4 -g2 -Wl,--as-needed -Wl,--no-copy-dt-needed-entries -Wl,-z -Wl,relro -Wl,-z -Wl,combreloc .libs/translit.o data/.libs/compact_underscores.o data/.libs/cyrillic_transliterate.o data/.libs/diacritical_remove.o data/.libs/greek_transliterate.o data/.libs/han_transliterate.o data/.libs/hangul_to_jamo_transliterate.o data/.libs/jamo_transliterate.o data/.libs/hebrew_transliterate.o data/.libs/lowercase_cyrillic.o data/.libs/lowercase_greek.o data/.libs/lowercase_latin.o data/.libs/normalize_ligature.o data/.libs/normalize_punctuation.o data/.libs/numbers.o data/.libs/special_decompose.o data/.libs/uppercase_cyrillic.o data/.libs/uppercase_greek.o data/.libs/uppercase_latin.o -Wl,-soname -Wl,translit.so -o .libs/translit.so libtool: link: ( cd ".libs" && rm -f "translit.la" && ln -s "../translit.la" "translit.la" ) /bin/sh /tmp/B.Xp46Uc/BUILD/php80-pecl-translit-0.7.0/libtool --mode=install cp ./translit.la /tmp/B.Xp46Uc/BUILD/php80-pecl-translit-0.7.0/modules libtool: install: cp ./.libs/translit.so /tmp/B.Xp46Uc/BUILD/php80-pecl-translit-0.7.0/modules/translit.so libtool: install: cp ./.libs/translit.lai /tmp/B.Xp46Uc/BUILD/php80-pecl-translit-0.7.0/modules/translit.la libtool: finish: PATH="/home/users/builder/GNUstep/Tools:/bin:/usr/bin:/usr/local/bin:/home/users/builder/bin:/sbin" ldconfig -n /tmp/B.Xp46Uc/BUILD/php80-pecl-translit-0.7.0/modules ---------------------------------------------------------------------- Libraries have been installed in: /tmp/B.Xp46Uc/BUILD/php80-pecl-translit-0.7.0/modules If you ever happen to want to link against installed libraries in a given directory, LIBDIR, you must either use libtool, and specify the full pathname of the library, or use the '-LLIBDIR' flag during linking and do at least one of the following: - add LIBDIR to the 'LD_LIBRARY_PATH' environment variable during execution - add LIBDIR to the 'LD_RUN_PATH' environment variable during linking - use the '-Wl,-rpath -Wl,LIBDIR' linker flag - have your system administrator add LIBDIR to '/etc/ld.so.conf' See any operating system documentation about shared libraries for more information, such as the ld(1) and ld.so(8) manual pages. ---------------------------------------------------------------------- Build complete. Don't forget to run 'make test'. + >modules.log + /usr/bin/php80 -n -q -d 'extension_dir=modules' -d 'extension=/usr/lib64/php80/iconv.so' -d 'extension=translit.so' -m + grep translit modules.log Warning: Missing arginfo for transliterate() in Unknown on line 0 Warning: Missing arginfo for transliterate_filters_get() in Unknown on line 0 translit + ./run-tests.sh --show-diff Build complete. Don't forget to run 'make test'. ===================================================================== PHP : /usr/bin/php80 Warning: Missing arginfo for transliterate() in Unknown on line 0 Warning: Missing arginfo for transliterate_filters_get() in Unknown on line 0 PHP_SAPI : cli PHP_VERSION : 8.0.0RC5 ZEND_VERSION: 4.0.0-dev PHP_OS : Linux - Linux ymir 5.9.3-1 #1 SMP Tue Nov 3 19:26:12 CET 2020 x86_64 INI actual : /tmp/B.Xp46Uc/BUILD/php80-pecl-translit-0.7.0/tmp-php.ini More .INIs : CWD : /tmp/B.Xp46Uc/BUILD/php80-pecl-translit-0.7.0 Extra dirs : VALGRIND : Not used ===================================================================== TIME START 2020-11-19 15:19:16 ===================================================================== TEST 1/15 [tests/cyrillic-transliterate.phpt] ========DIFF======== 001+ Warning: Missing arginfo for transliterate() in Unknown on line 0 002+  003+ Warning: Missing arginfo for transliterate_filters_get() in Unknown on line 0 ============================ Running filter 'cyrillic_transliterate': -- ========DONE======== FAIL Test for cyrillic transliterate filter [tests/cyrillic-transliterate.phpt] TEST 2/15 [tests/decompose.phpt] ========DIFF======== 001+ Warning: Missing arginfo for transliterate() in Unknown on line 0 002+  003+ Warning: Missing arginfo for transliterate_filters_get() in Unknown on line 0 Decompose currency: ecu C Cr Fr L m N Pts Rs W NS d eur T -- ========DONE======== FAIL Test for decomposition filters [tests/decompose.phpt] TEST 3/15 [tests/diacritical-remove.phpt] ========DIFF======== 001+ Warning: Missing arginfo for transliterate() in Unknown on line 0 002+  003+ Warning: Missing arginfo for transliterate_filters_get() in Unknown on line 0 Vr sa god ========DONE======== FAIL Test for diacritical removal filter [tests/diacritical-remove.phpt] TEST 4/15 [tests/greek-transliterate.phpt] ========DIFF======== 001+ Warning: Missing arginfo for transliterate() in Unknown on line 0 002+  003+ Warning: Missing arginfo for transliterate_filters_get() in Unknown on line 0 ============================ Running filter 'greek_transliterate': -- ========DONE======== FAIL Test for greek transliterate filter [tests/greek-transliterate.phpt] TEST 5/15 [tests/han-transliterate.phpt] ========DIFF======== 001+ Warning: Missing arginfo for transliterate() in Unknown on line 0 002+  003+ Warning: Missing arginfo for transliterate_filters_get() in Unknown on line 0 Running filter 'han_transliterate': dà píng kuàng nán sǐ zhě zēng zhì 66rén zhèng méi suǒ shǔ méi kuàng quán tíng chǎn -- ========DONE======== FAIL Test for han transliterate filter [tests/han-transliterate.phpt] TEST 6/15 [tests/han-transliterate1.phpt] ========DIFF======== 001+ Warning: Missing arginfo for transliterate() in Unknown on line 0 002+  003+ Warning: Missing arginfo for transliterate_filters_get() in Unknown on line 0 Running filter 'han_transliterate': yú tián chuān shén shè cān dào jī ========DONE======== FAIL Test for han transliterate filter - 1 [tests/han-transliterate1.phpt] TEST 7/15 [tests/hangul-to-jamo.phpt] ========DIFF======== 001+ Warning: Missing arginfo for transliterate() in Unknown on line 0 002+  003+ Warning: Missing arginfo for transliterate_filters_get() in Unknown on line 0 don Quijote nge ngosinkeosngeur hwanngyeonghapnita! sonnimngi seupenginkwa ratinngamerikangui keungeoneuhagkyoreur seontaeghangyeo hagseuphateunji sonnimngeun hantanragngui -- ========DONE======== FAIL Test for hangul to jamo conversion filter [tests/hangul-to-jamo.phpt] TEST 8/15 [tests/hebrew-transliterate.phpt] ========DIFF======== 001+ Warning: Missing arginfo for transliterate() in Unknown on line 0 002+  003+ Warning: Missing arginfo for transliterate_filters_get() in Unknown on line 0 Running filter 'hebrew_transliterate': pzzot mrgmh pg'o bbtym bgos 6 -- ========DONE======== FAIL Test for hebrew transliterate filter [tests/hebrew-transliterate.phpt] TEST 9/15 [tests/latin-lowercase-001.phpt] ========DIFF======== 001+ Warning: Missing arginfo for transliterate() in Unknown on line 0 002+  003+ Warning: Missing arginfo for transliterate_filters_get() in Unknown on line 0 diacritical remove: latin-1 supplement -- ========DONE======== FAIL Test for lowercasing latin filter [tests/latin-lowercase-001.phpt] TEST 10/15 [tests/latin-lowercase-002.phpt] ========DIFF======== 001+ Warning: Missing arginfo for transliterate() in Unknown on line 0 002+  003+ Warning: Missing arginfo for transliterate_filters_get() in Unknown on line 0 diacritical remove: latin-1 supplement -- ========DONE======== FAIL Test for lowercasing latin filter [tests/latin-lowercase-002.phpt] TEST 11/15 [tests/normalize-ligature.phpt] ========DIFF======== 001+ Warning: Missing arginfo for transliterate() in Unknown on line 0 002+  003+ Warning: Missing arginfo for transliterate_filters_get() in Unknown on line 0 Running filter 'normalize_ligature': Latin-1 Supplement -- ========DONE======== FAIL Test for normalizing ligature filter [tests/normalize-ligature.phpt] TEST 12/15 [tests/numbers.phpt] ========DIFF======== 001+ Warning: Missing arginfo for transliterate() in Unknown on line 0 002+  003+ Warning: Missing arginfo for transliterate_filters_get() in Unknown on line 0 004+  =================================================== Running filter 'normalize_superscript_numbers': normalize superscript numbers: -- ========DONE======== FAIL Test for filters with numbers [tests/numbers.phpt] TEST 13/15 [tests/punctuation.phpt] ========DIFF======== 001+ Warning: Missing arginfo for transliterate() in Unknown on line 0 002+  003+ Warning: Missing arginfo for transliterate_filters_get() in Unknown on line 0 ================================= Running filter 'normalize_punctuation': -- ========DONE======== FAIL Test for punctuation ligature filter [tests/punctuation.phpt] TEST 14/15 [tests/simple-filter.phpt] ========DIFF======== 001+ Warning: Missing arginfo for transliterate() in Unknown on line 0 002+  003+ Warning: Missing arginfo for transliterate_filters_get() in Unknown on line 0 004+  =================================================== Running filter 'diacritical_remove': abcdefgh ========DONE======== FAIL Test for simple diacritical remove filter [tests/simple-filter.phpt] TEST 15/15 [tests/special-decompose.phpt] ========DIFF======== 001+ Warning: Missing arginfo for transliterate() in Unknown on line 0 002+  003+ Warning: Missing arginfo for transliterate_filters_get() in Unknown on line 0 004+  =================================================== Running filter 'decompose_special': decompose special: -- ========DONE======== FAIL Test for special decomposition filters [tests/special-decompose.phpt] ===================================================================== TIME END 2020-11-19 15:19:17 ===================================================================== TEST RESULT SUMMARY --------------------------------------------------------------------- Exts skipped : 0 Exts tested : 11 --------------------------------------------------------------------- Number of tests : 15 15 Tests skipped : 0 ( 0.0%) -------- Tests warned : 0 ( 0.0%) ( 0.0%) Tests failed : 15 (100.0%) (100.0%) Tests passed : 0 ( 0.0%) ( 0.0%) --------------------------------------------------------------------- Time taken : 1 seconds ===================================================================== ===================================================================== FAILED TEST SUMMARY --------------------------------------------------------------------- Test for cyrillic transliterate filter [tests/cyrillic-transliterate.phpt] Test for decomposition filters [tests/decompose.phpt] Test for diacritical removal filter [tests/diacritical-remove.phpt] Test for greek transliterate filter [tests/greek-transliterate.phpt] Test for han transliterate filter [tests/han-transliterate.phpt] Test for han transliterate filter - 1 [tests/han-transliterate1.phpt] Test for hangul to jamo conversion filter [tests/hangul-to-jamo.phpt] Test for hebrew transliterate filter [tests/hebrew-transliterate.phpt] Test for lowercasing latin filter [tests/latin-lowercase-001.phpt] Test for lowercasing latin filter [tests/latin-lowercase-002.phpt] Test for normalizing ligature filter [tests/normalize-ligature.phpt] Test for filters with numbers [tests/numbers.phpt] Test for punctuation ligature filter [tests/punctuation.phpt] Test for simple diacritical remove filter [tests/simple-filter.phpt] Test for special decomposition filters [tests/special-decompose.phpt] ===================================================================== make: *** [Makefile:148: test] Error 1 error: Bad exit status from /tmp/B.Xp46Uc/BUILD/tmp/rpm-tmp.60672 (%build) RPM build errors: Bad exit status from /tmp/B.Xp46Uc/BUILD/tmp/rpm-tmp.60672 (%build) ended at: Thu Nov 19 15:19:17 2020, done in 0:00:05.149304 error: No files produced. + chmod -R u+rwX /tmp/B.Xp46Uc/BUILD + rm -rf /tmp/B.Xp46Uc/tmp /tmp/B.Xp46Uc/BUILD + rm -rf /tmp/B.Xp46Uc Begin-PLD-Builder-Info Build-Time: user:14.59s sys:3.62s real:18.08s (faults io:44667 non-io:904145) End-PLD-Builder-Info
[Back to list of logs] [View rpm -qa of builder]