FailedOk

th/SRPMS[OK]
th/x32[OK]
th/i686[OK]
th/x86_64[OK]

ac/SRPMS[OK]
ac/i386[OK]
ac/i586[OK]
ac/i686[OK]
ac/alpha[OK]
ac/amd64[OK]
ac/athlon[OK]
ac/ppc[OK]
ac/sparc[OK]
ac/sparc64[OK]

Advanced Search
main()
Powered by PLD Linux
(c) 2002-2020 PLD Team
$Revision: 1.37 $
Powered by DWARF.
Your IP: 3.236.126.69

ploop 29c9c433-d189-4a60-8ab9-edadec4c3451

Status:Failed
Source URL:https://buildlogs.pld-linux.org/pld/th/x86_64/FAIL/ploop,29c9c433-d189-4a60-8ab9-edadec4c3451.bz2
text/plain URL:View!
rpm -qa of builder:View!
Date:2020/06/27 19:43:07
Runtime:0:00:02.519770

Toc:

  • prep
  • Executing(%prep): /bin/sh -e /tmp/B.6zjAC2/BUILD/tmp/rpm-tmp.35704
  • build
  • Executing(%build): /bin/sh -e /tmp/B.6zjAC2/BUILD/tmp/rpm-tmp.35704
  • error 1
  • /usr/include/bits/string_fortified.h:106:10: error: '__builtin_strncpy' specified bound 4096 equals destination size [-Werror=stringop-truncation]
  • error 2
  • /usr/include/bits/string_fortified.h:106:10: error: '__builtin_strncpy' specified bound 4096 equals destination size [-Werror=stringop-truncation]
  • error 3
  • make[1]: *** [../Makefile.inc:60: xml.o] Error 1
  • error 4
  • error: Bad exit status from /tmp/B.6zjAC2/BUILD/tmp/rpm-tmp.35704 (%build)
  • error 5
  • RPM build errors:
  • error 6
  • error: No files produced.

Content:

request from: qboosh
checking if we should skip the build
started at: Sat Jun 27 19:43:01 2020
killing old processes on a builder
sending signal 9 to pid -1
Killed
cleaning up /tmp
fetching https://srcbuilder.pld-linux.org/th//srpms/29c9c433-d189-4a60-8ab9-edadec4c3451/ploop-8.0.14-1.src.rpm
fetched 205559 bytes, 428.5 K/s
installing srpm: ploop-8.0.14-1.src.rpm
+ install -d /tmp/B.6zjAC2/BUILD /tmp/B.6zjAC2/RPMS
+ LC_ALL=en_US.UTF-8
+ rpm -qp --changelog ploop-8.0.14-1.src.rpm
* Sat Jun 27 2020 PLD Linux Team <feedback@pld-linux.org>
- For complete changelog see: http://git.pld-linux.org/?p=packages/ploop.git;a=log;h=master
* Sat Jun 27 2020 Jakub Bogusz <qboosh@pld-linux.org> b3efbc6
- new URLs, updated to 8.0.14 (new soname) - added types patch (fixes for ILP32 archs) - added python patch (fix install prefix and async keyword issue with python 3.6+) + rpm -Uhv --nodeps --define '_topdir /tmp/B.6zjAC2' --define '_specdir %{_topdir}' --define '_sourcedir %{_specdir}' --define '_rpmdir %{_topdir}/RPMS' --define '_builddir %{_topdir}/BUILD' ploop-8.0.14-1.src.rpm Preparing... ################################################## ploop ################################################## + rm -f ploop-8.0.14-1.src.rpm + install -m 700 -d /tmp/B.6zjAC2/BUILD/tmp + TMPDIR=/tmp/B.6zjAC2/BUILD/tmp + exec nice -n 0 rpmbuild -bp --short-circuit --nodeps --define '_topdir /tmp/B.6zjAC2' --define '_specdir %{_topdir}' --define '_sourcedir %{_specdir}' --define '_rpmdir %{_topdir}/RPMS' --define '_builddir %{_topdir}/BUILD' --target x86_64-pld-linux --define 'prep exit 0' /tmp/B.6zjAC2/ploop.spec Building target platforms: x86_64-pld-linux checking BuildConflict-ing packages no BuildConflicts found checking BR rpm: Building target platforms: x86_64-pld-linux no BR needed building RPM using: set -ex; : build-id: 29c9c433-d189-4a60-8ab9-edadec4c3451; TMPDIR=/tmp/B.6zjAC2/BUILD/tmp exec nice -n 0 rpmbuild -bb --define '_smp_mflags -j9' --define '_make_opts -Otarget' --define '_pld_builder 1' --define '_topdir /tmp/B.6zjAC2' --define '_specdir %{_topdir}' --define '_sourcedir %{_specdir}' --define '_rpmdir %{_topdir}/RPMS' --define '_builddir %{_topdir}/BUILD' --target x86_64-pld-linux /tmp/B.6zjAC2/ploop.spec + : build-id: 29c9c433-d189-4a60-8ab9-edadec4c3451 + TMPDIR=/tmp/B.6zjAC2/BUILD/tmp + exec nice -n 0 rpmbuild -bb --define '_smp_mflags -j9' --define '_make_opts -Otarget' --define '_pld_builder 1' --define '_topdir /tmp/B.6zjAC2' --define '_specdir %{_topdir}' --define '_sourcedir %{_specdir}' --define '_rpmdir %{_topdir}/RPMS' --define '_builddir %{_topdir}/BUILD' --target x86_64-pld-linux /tmp/B.6zjAC2/ploop.spec Building target platforms: x86_64-pld-linux Executing(%prep): /bin/sh -e /tmp/B.6zjAC2/BUILD/tmp/rpm-tmp.35704 + umask 022 + cd /tmp/B.6zjAC2/BUILD + cd /tmp/B.6zjAC2/BUILD + rm -rf ploop-8.0.14 + /bin/gzip -dc /tmp/B.6zjAC2/ploop-8.0.14.tar.gz + /bin/tar -xf - + STATUS=0 + '[' 0 -ne 0 ']' + cd ploop-8.0.14 + /bin/id -u + '[' 1000 '=' 0 ']' + /bin/id -u + '[' 1000 '=' 0 ']' + /bin/chmod -Rf a+rX,u+w,g-w,o-w . + echo 'Patch #0 (ploop-types.patch):' Patch #0 (ploop-types.patch): + '[' -f /tmp/B.6zjAC2/ploop-types.patch ']' + /bin/cat /tmp/B.6zjAC2/ploop-types.patch + /usr/bin/patch -s -p1 + echo 'Patch #1 (ploop-python.patch):' Patch #1 (ploop-python.patch): + '[' -f /tmp/B.6zjAC2/ploop-python.patch ']' + /bin/cat /tmp/B.6zjAC2/ploop-python.patch + /usr/bin/patch -s -p1 + /bin/sed -i -e '/exe = / s,/usr/libexec,/usr/libexec,' scripts/crypthelper + /bin/sed -i -e '/define CRYPT_BIN/ s,/usr/libexec,/usr/libexec,' lib/crypt.c + /bin/sed -i -e '/\/usr\/libexec\/.*2fs/d' lib/fsutils.c + exit 0 Executing(%build): /bin/sh -e /tmp/B.6zjAC2/BUILD/tmp/rpm-tmp.35704 TMP=/home/users/builder/tmp HOME=/home/users/builder PATH=/home/users/builder/GNUstep/Tools:/bin:/usr/bin:/usr/local/bin:/home/users/builder/bin TMPDIR=/tmp/B.6zjAC2/BUILD/tmp + umask 022 + cd /tmp/B.6zjAC2/BUILD + cd ploop-8.0.14 + LDFLAGS='-Wl,--as-needed -Wl,--no-copy-dt-needed-entries -Wl,-z,relro -Wl,-z,combreloc ' LDLIBS=-lpthread /usr/bin/make -Otarget -j9 all 'V=1' 'DEBUG=' 'CC=x86_64-pld-linux-gcc' 'CPPFLAGS=' 'RPM_OPT_FLAGS=-O2 -fwrapv -pipe -Wformat -Werror=format-security -gdwarf-4 -fno-debug-types-section -fvar-tracking-assignments -g2 -Wp,-D_FORTIFY_SOURCE=2 -fstack-protector-strong --param=ssp-buffer-size=4 -Werror=trampolines -fPIC -march=x86-64 -gdwarf-4 -fno-debug-types-section -fvar-tracking-assignments -g2 ' 'LIBDIR=/usr/lib64' make[1]: Entering directory '/tmp/B.6zjAC2/BUILD/ploop-8.0.14/include' ../gensym.sh libploop.h new-dynload.h sed -e '1,/^struct ploop_functions {$/d' \ -e '/\/\* struct ploop_functions \*\/$/,$d' dynload.h | \ grep -vE '^[[:space:]]*/\*.**/$' | \ grep -v '^ void \*padding\[' | \ grep -v '^ void (\*obsolete_' | \ sort > cur-dynload.h diff -u cur-dynload.h new-dynload.h || \ ( echo "*** API CHANGED, PLEASE UPDATE dynload.h"; exit 1 ) rm -f cur-dynload.h new-dynload.h make[1]: Leaving directory '/tmp/B.6zjAC2/BUILD/ploop-8.0.14/include' make[1]: Entering directory '/tmp/B.6zjAC2/BUILD/ploop-8.0.14/lib' x86_64-pld-linux-gcc -O2 -O2 -I. -I../include -fno-strict-aliasing -Wall -Wstrict-prototypes -Werror -Wformat-security -Werror=format-truncation=0 -D_GNU_SOURCE -D_LARGEFILE64_SOURCE -D_FILE_OFFSET_BITS=64 -DPRODUCT_NAME_SHORT=\"OpenVZ\" -O2 -fwrapv -pipe -Wformat -Werror=format-security -gdwarf-4 -fno-debug-types-section -fvar-tracking-assignments -g2 -Wp,-D_FORTIFY_SOURCE=2 -fstack-protector-strong --param=ssp-buffer-size=4 -Werror=trampolines -fPIC -march=x86-64 -gdwarf-4 -fno-debug-types-section -fvar-tracking-assignments -g2 -I. -I../include -fno-strict-aliasing -Wall -Wstrict-prototypes -Werror -Wformat-security -Werror=format-truncation=0 -D_GNU_SOURCE -D_LARGEFILE64_SOURCE -D_FILE_OFFSET_BITS=64 -DPRODUCT_NAME_SHORT=\"OpenVZ\" -O2 -fwrapv -pipe -Wformat -Werror=format-security -gdwarf-4 -fno-debug-types-section -fvar-tracking-assignments -g2 -Wp,-D_FORTIFY_SOURCE=2 -fstack-protector-strong --param=ssp-buffer-size=4 -Werror=trampolines -fPIC -march=x86-64 -gdwarf-4 -fno-debug-types-section -fvar-tracking-assignments -g2 -I/usr/include/libxml2 -fPIC -fvisibility=hidden -M uuid.c delta_read.c delta_sysfs.c dm.c balloon_util.c check.c crypt.c defrag.c ploop.c xml.c logger.c balloon.c lock.c loop.c fsutils.c gpt.c crc32.c merge.c util.c ploop-copy.c di.c cleanup.c deprecated.c snapshot.c cbt.c volume.c > .depend make[1]: Leaving directory '/tmp/B.6zjAC2/BUILD/ploop-8.0.14/lib' make[1]: Entering directory '/tmp/B.6zjAC2/BUILD/ploop-8.0.14/lib' x86_64-pld-linux-gcc -O2 -O2 -I. -I../include -fno-strict-aliasing -Wall -Wstrict-prototypes -Werror -Wformat-security -Werror=format-truncation=0 -D_GNU_SOURCE -D_LARGEFILE64_SOURCE -D_FILE_OFFSET_BITS=64 -DPRODUCT_NAME_SHORT=\"OpenVZ\" -O2 -fwrapv -pipe -Wformat -Werror=format-security -gdwarf-4 -fno-debug-types-section -fvar-tracking-assignments -g2 -Wp,-D_FORTIFY_SOURCE=2 -fstack-protector-strong --param=ssp-buffer-size=4 -Werror=trampolines -fPIC -march=x86-64 -gdwarf-4 -fno-debug-types-section -fvar-tracking-assignments -g2 -I. -I../include -fno-strict-aliasing -Wall -Wstrict-prototypes -Werror -Wformat-security -Werror=format-truncation=0 -D_GNU_SOURCE -D_LARGEFILE64_SOURCE -D_FILE_OFFSET_BITS=64 -DPRODUCT_NAME_SHORT=\"OpenVZ\" -O2 -fwrapv -pipe -Wformat -Werror=format-security -gdwarf-4 -fno-debug-types-section -fvar-tracking-assignments -g2 -Wp,-D_FORTIFY_SOURCE=2 -fstack-protector-strong --param=ssp-buffer-size=4 -Werror=trampolines -fPIC -march=x86-64 -gdwarf-4 -fno-debug-types-section -fvar-tracking-assignments -g2 -I/usr/include/libxml2 -fPIC -fvisibility=hidden -c uuid.c -o uuid.o make[1]: Leaving directory '/tmp/B.6zjAC2/BUILD/ploop-8.0.14/lib' make[1]: Entering directory '/tmp/B.6zjAC2/BUILD/ploop-8.0.14/lib' x86_64-pld-linux-gcc -O2 -O2 -I. -I../include -fno-strict-aliasing -Wall -Wstrict-prototypes -Werror -Wformat-security -Werror=format-truncation=0 -D_GNU_SOURCE -D_LARGEFILE64_SOURCE -D_FILE_OFFSET_BITS=64 -DPRODUCT_NAME_SHORT=\"OpenVZ\" -O2 -fwrapv -pipe -Wformat -Werror=format-security -gdwarf-4 -fno-debug-types-section -fvar-tracking-assignments -g2 -Wp,-D_FORTIFY_SOURCE=2 -fstack-protector-strong --param=ssp-buffer-size=4 -Werror=trampolines -fPIC -march=x86-64 -gdwarf-4 -fno-debug-types-section -fvar-tracking-assignments -g2 -I. -I../include -fno-strict-aliasing -Wall -Wstrict-prototypes -Werror -Wformat-security -Werror=format-truncation=0 -D_GNU_SOURCE -D_LARGEFILE64_SOURCE -D_FILE_OFFSET_BITS=64 -DPRODUCT_NAME_SHORT=\"OpenVZ\" -O2 -fwrapv -pipe -Wformat -Werror=format-security -gdwarf-4 -fno-debug-types-section -fvar-tracking-assignments -g2 -Wp,-D_FORTIFY_SOURCE=2 -fstack-protector-strong --param=ssp-buffer-size=4 -Werror=trampolines -fPIC -march=x86-64 -gdwarf-4 -fno-debug-types-section -fvar-tracking-assignments -g2 -I/usr/include/libxml2 -fPIC -fvisibility=hidden -c crypt.c -o crypt.o make[1]: Leaving directory '/tmp/B.6zjAC2/BUILD/ploop-8.0.14/lib' make[1]: Entering directory '/tmp/B.6zjAC2/BUILD/ploop-8.0.14/lib' x86_64-pld-linux-gcc -O2 -O2 -I. -I../include -fno-strict-aliasing -Wall -Wstrict-prototypes -Werror -Wformat-security -Werror=format-truncation=0 -D_GNU_SOURCE -D_LARGEFILE64_SOURCE -D_FILE_OFFSET_BITS=64 -DPRODUCT_NAME_SHORT=\"OpenVZ\" -O2 -fwrapv -pipe -Wformat -Werror=format-security -gdwarf-4 -fno-debug-types-section -fvar-tracking-assignments -g2 -Wp,-D_FORTIFY_SOURCE=2 -fstack-protector-strong --param=ssp-buffer-size=4 -Werror=trampolines -fPIC -march=x86-64 -gdwarf-4 -fno-debug-types-section -fvar-tracking-assignments -g2 -I. -I../include -fno-strict-aliasing -Wall -Wstrict-prototypes -Werror -Wformat-security -Werror=format-truncation=0 -D_GNU_SOURCE -D_LARGEFILE64_SOURCE -D_FILE_OFFSET_BITS=64 -DPRODUCT_NAME_SHORT=\"OpenVZ\" -O2 -fwrapv -pipe -Wformat -Werror=format-security -gdwarf-4 -fno-debug-types-section -fvar-tracking-assignments -g2 -Wp,-D_FORTIFY_SOURCE=2 -fstack-protector-strong --param=ssp-buffer-size=4 -Werror=trampolines -fPIC -march=x86-64 -gdwarf-4 -fno-debug-types-section -fvar-tracking-assignments -g2 -I/usr/include/libxml2 -fPIC -fvisibility=hidden -c delta_sysfs.c -o delta_sysfs.o make[1]: Leaving directory '/tmp/B.6zjAC2/BUILD/ploop-8.0.14/lib' make[1]: Entering directory '/tmp/B.6zjAC2/BUILD/ploop-8.0.14/lib' x86_64-pld-linux-gcc -O2 -O2 -I. -I../include -fno-strict-aliasing -Wall -Wstrict-prototypes -Werror -Wformat-security -Werror=format-truncation=0 -D_GNU_SOURCE -D_LARGEFILE64_SOURCE -D_FILE_OFFSET_BITS=64 -DPRODUCT_NAME_SHORT=\"OpenVZ\" -O2 -fwrapv -pipe -Wformat -Werror=format-security -gdwarf-4 -fno-debug-types-section -fvar-tracking-assignments -g2 -Wp,-D_FORTIFY_SOURCE=2 -fstack-protector-strong --param=ssp-buffer-size=4 -Werror=trampolines -fPIC -march=x86-64 -gdwarf-4 -fno-debug-types-section -fvar-tracking-assignments -g2 -I. -I../include -fno-strict-aliasing -Wall -Wstrict-prototypes -Werror -Wformat-security -Werror=format-truncation=0 -D_GNU_SOURCE -D_LARGEFILE64_SOURCE -D_FILE_OFFSET_BITS=64 -DPRODUCT_NAME_SHORT=\"OpenVZ\" -O2 -fwrapv -pipe -Wformat -Werror=format-security -gdwarf-4 -fno-debug-types-section -fvar-tracking-assignments -g2 -Wp,-D_FORTIFY_SOURCE=2 -fstack-protector-strong --param=ssp-buffer-size=4 -Werror=trampolines -fPIC -march=x86-64 -gdwarf-4 -fno-debug-types-section -fvar-tracking-assignments -g2 -I/usr/include/libxml2 -fPIC -fvisibility=hidden -c logger.c -o logger.o make[1]: Leaving directory '/tmp/B.6zjAC2/BUILD/ploop-8.0.14/lib' make[1]: Entering directory '/tmp/B.6zjAC2/BUILD/ploop-8.0.14/lib' x86_64-pld-linux-gcc -O2 -O2 -I. -I../include -fno-strict-aliasing -Wall -Wstrict-prototypes -Werror -Wformat-security -Werror=format-truncation=0 -D_GNU_SOURCE -D_LARGEFILE64_SOURCE -D_FILE_OFFSET_BITS=64 -DPRODUCT_NAME_SHORT=\"OpenVZ\" -O2 -fwrapv -pipe -Wformat -Werror=format-security -gdwarf-4 -fno-debug-types-section -fvar-tracking-assignments -g2 -Wp,-D_FORTIFY_SOURCE=2 -fstack-protector-strong --param=ssp-buffer-size=4 -Werror=trampolines -fPIC -march=x86-64 -gdwarf-4 -fno-debug-types-section -fvar-tracking-assignments -g2 -I. -I../include -fno-strict-aliasing -Wall -Wstrict-prototypes -Werror -Wformat-security -Werror=format-truncation=0 -D_GNU_SOURCE -D_LARGEFILE64_SOURCE -D_FILE_OFFSET_BITS=64 -DPRODUCT_NAME_SHORT=\"OpenVZ\" -O2 -fwrapv -pipe -Wformat -Werror=format-security -gdwarf-4 -fno-debug-types-section -fvar-tracking-assignments -g2 -Wp,-D_FORTIFY_SOURCE=2 -fstack-protector-strong --param=ssp-buffer-size=4 -Werror=trampolines -fPIC -march=x86-64 -gdwarf-4 -fno-debug-types-section -fvar-tracking-assignments -g2 -I/usr/include/libxml2 -fPIC -fvisibility=hidden -c check.c -o check.o make[1]: Leaving directory '/tmp/B.6zjAC2/BUILD/ploop-8.0.14/lib' make[1]: Entering directory '/tmp/B.6zjAC2/BUILD/ploop-8.0.14/lib' x86_64-pld-linux-gcc -O2 -O2 -I. -I../include -fno-strict-aliasing -Wall -Wstrict-prototypes -Werror -Wformat-security -Werror=format-truncation=0 -D_GNU_SOURCE -D_LARGEFILE64_SOURCE -D_FILE_OFFSET_BITS=64 -DPRODUCT_NAME_SHORT=\"OpenVZ\" -O2 -fwrapv -pipe -Wformat -Werror=format-security -gdwarf-4 -fno-debug-types-section -fvar-tracking-assignments -g2 -Wp,-D_FORTIFY_SOURCE=2 -fstack-protector-strong --param=ssp-buffer-size=4 -Werror=trampolines -fPIC -march=x86-64 -gdwarf-4 -fno-debug-types-section -fvar-tracking-assignments -g2 -I. -I../include -fno-strict-aliasing -Wall -Wstrict-prototypes -Werror -Wformat-security -Werror=format-truncation=0 -D_GNU_SOURCE -D_LARGEFILE64_SOURCE -D_FILE_OFFSET_BITS=64 -DPRODUCT_NAME_SHORT=\"OpenVZ\" -O2 -fwrapv -pipe -Wformat -Werror=format-security -gdwarf-4 -fno-debug-types-section -fvar-tracking-assignments -g2 -Wp,-D_FORTIFY_SOURCE=2 -fstack-protector-strong --param=ssp-buffer-size=4 -Werror=trampolines -fPIC -march=x86-64 -gdwarf-4 -fno-debug-types-section -fvar-tracking-assignments -g2 -I/usr/include/libxml2 -fPIC -fvisibility=hidden -c delta_read.c -o delta_read.o make[1]: Leaving directory '/tmp/B.6zjAC2/BUILD/ploop-8.0.14/lib' make[1]: Entering directory '/tmp/B.6zjAC2/BUILD/ploop-8.0.14/lib' x86_64-pld-linux-gcc -O2 -O2 -I. -I../include -fno-strict-aliasing -Wall -Wstrict-prototypes -Werror -Wformat-security -Werror=format-truncation=0 -D_GNU_SOURCE -D_LARGEFILE64_SOURCE -D_FILE_OFFSET_BITS=64 -DPRODUCT_NAME_SHORT=\"OpenVZ\" -O2 -fwrapv -pipe -Wformat -Werror=format-security -gdwarf-4 -fno-debug-types-section -fvar-tracking-assignments -g2 -Wp,-D_FORTIFY_SOURCE=2 -fstack-protector-strong --param=ssp-buffer-size=4 -Werror=trampolines -fPIC -march=x86-64 -gdwarf-4 -fno-debug-types-section -fvar-tracking-assignments -g2 -I. -I../include -fno-strict-aliasing -Wall -Wstrict-prototypes -Werror -Wformat-security -Werror=format-truncation=0 -D_GNU_SOURCE -D_LARGEFILE64_SOURCE -D_FILE_OFFSET_BITS=64 -DPRODUCT_NAME_SHORT=\"OpenVZ\" -O2 -fwrapv -pipe -Wformat -Werror=format-security -gdwarf-4 -fno-debug-types-section -fvar-tracking-assignments -g2 -Wp,-D_FORTIFY_SOURCE=2 -fstack-protector-strong --param=ssp-buffer-size=4 -Werror=trampolines -fPIC -march=x86-64 -gdwarf-4 -fno-debug-types-section -fvar-tracking-assignments -g2 -I/usr/include/libxml2 -fPIC -fvisibility=hidden -c balloon_util.c -o balloon_util.o make[1]: Leaving directory '/tmp/B.6zjAC2/BUILD/ploop-8.0.14/lib' make[1]: Entering directory '/tmp/B.6zjAC2/BUILD/ploop-8.0.14/lib' x86_64-pld-linux-gcc -O2 -O2 -I. -I../include -fno-strict-aliasing -Wall -Wstrict-prototypes -Werror -Wformat-security -Werror=format-truncation=0 -D_GNU_SOURCE -D_LARGEFILE64_SOURCE -D_FILE_OFFSET_BITS=64 -DPRODUCT_NAME_SHORT=\"OpenVZ\" -O2 -fwrapv -pipe -Wformat -Werror=format-security -gdwarf-4 -fno-debug-types-section -fvar-tracking-assignments -g2 -Wp,-D_FORTIFY_SOURCE=2 -fstack-protector-strong --param=ssp-buffer-size=4 -Werror=trampolines -fPIC -march=x86-64 -gdwarf-4 -fno-debug-types-section -fvar-tracking-assignments -g2 -I. -I../include -fno-strict-aliasing -Wall -Wstrict-prototypes -Werror -Wformat-security -Werror=format-truncation=0 -D_GNU_SOURCE -D_LARGEFILE64_SOURCE -D_FILE_OFFSET_BITS=64 -DPRODUCT_NAME_SHORT=\"OpenVZ\" -O2 -fwrapv -pipe -Wformat -Werror=format-security -gdwarf-4 -fno-debug-types-section -fvar-tracking-assignments -g2 -Wp,-D_FORTIFY_SOURCE=2 -fstack-protector-strong --param=ssp-buffer-size=4 -Werror=trampolines -fPIC -march=x86-64 -gdwarf-4 -fno-debug-types-section -fvar-tracking-assignments -g2 -I/usr/include/libxml2 -fPIC -fvisibility=hidden -c dm.c -o dm.o make[1]: Leaving directory '/tmp/B.6zjAC2/BUILD/ploop-8.0.14/lib' make[1]: Entering directory '/tmp/B.6zjAC2/BUILD/ploop-8.0.14/lib' x86_64-pld-linux-gcc -O2 -O2 -I. -I../include -fno-strict-aliasing -Wall -Wstrict-prototypes -Werror -Wformat-security -Werror=format-truncation=0 -D_GNU_SOURCE -D_LARGEFILE64_SOURCE -D_FILE_OFFSET_BITS=64 -DPRODUCT_NAME_SHORT=\"OpenVZ\" -O2 -fwrapv -pipe -Wformat -Werror=format-security -gdwarf-4 -fno-debug-types-section -fvar-tracking-assignments -g2 -Wp,-D_FORTIFY_SOURCE=2 -fstack-protector-strong --param=ssp-buffer-size=4 -Werror=trampolines -fPIC -march=x86-64 -gdwarf-4 -fno-debug-types-section -fvar-tracking-assignments -g2 -I. -I../include -fno-strict-aliasing -Wall -Wstrict-prototypes -Werror -Wformat-security -Werror=format-truncation=0 -D_GNU_SOURCE -D_LARGEFILE64_SOURCE -D_FILE_OFFSET_BITS=64 -DPRODUCT_NAME_SHORT=\"OpenVZ\" -O2 -fwrapv -pipe -Wformat -Werror=format-security -gdwarf-4 -fno-debug-types-section -fvar-tracking-assignments -g2 -Wp,-D_FORTIFY_SOURCE=2 -fstack-protector-strong --param=ssp-buffer-size=4 -Werror=trampolines -fPIC -march=x86-64 -gdwarf-4 -fno-debug-types-section -fvar-tracking-assignments -g2 -I/usr/include/libxml2 -fPIC -fvisibility=hidden -c crc32.c -o crc32.o make[1]: Leaving directory '/tmp/B.6zjAC2/BUILD/ploop-8.0.14/lib' make[1]: Entering directory '/tmp/B.6zjAC2/BUILD/ploop-8.0.14/lib' x86_64-pld-linux-gcc -O2 -O2 -I. -I../include -fno-strict-aliasing -Wall -Wstrict-prototypes -Werror -Wformat-security -Werror=format-truncation=0 -D_GNU_SOURCE -D_LARGEFILE64_SOURCE -D_FILE_OFFSET_BITS=64 -DPRODUCT_NAME_SHORT=\"OpenVZ\" -O2 -fwrapv -pipe -Wformat -Werror=format-security -gdwarf-4 -fno-debug-types-section -fvar-tracking-assignments -g2 -Wp,-D_FORTIFY_SOURCE=2 -fstack-protector-strong --param=ssp-buffer-size=4 -Werror=trampolines -fPIC -march=x86-64 -gdwarf-4 -fno-debug-types-section -fvar-tracking-assignments -g2 -I. -I../include -fno-strict-aliasing -Wall -Wstrict-prototypes -Werror -Wformat-security -Werror=format-truncation=0 -D_GNU_SOURCE -D_LARGEFILE64_SOURCE -D_FILE_OFFSET_BITS=64 -DPRODUCT_NAME_SHORT=\"OpenVZ\" -O2 -fwrapv -pipe -Wformat -Werror=format-security -gdwarf-4 -fno-debug-types-section -fvar-tracking-assignments -g2 -Wp,-D_FORTIFY_SOURCE=2 -fstack-protector-strong --param=ssp-buffer-size=4 -Werror=trampolines -fPIC -march=x86-64 -gdwarf-4 -fno-debug-types-section -fvar-tracking-assignments -g2 -I/usr/include/libxml2 -fPIC -fvisibility=hidden -c lock.c -o lock.o make[1]: Leaving directory '/tmp/B.6zjAC2/BUILD/ploop-8.0.14/lib' make[1]: Entering directory '/tmp/B.6zjAC2/BUILD/ploop-8.0.14/lib' x86_64-pld-linux-gcc -O2 -O2 -I. -I../include -fno-strict-aliasing -Wall -Wstrict-prototypes -Werror -Wformat-security -Werror=format-truncation=0 -D_GNU_SOURCE -D_LARGEFILE64_SOURCE -D_FILE_OFFSET_BITS=64 -DPRODUCT_NAME_SHORT=\"OpenVZ\" -O2 -fwrapv -pipe -Wformat -Werror=format-security -gdwarf-4 -fno-debug-types-section -fvar-tracking-assignments -g2 -Wp,-D_FORTIFY_SOURCE=2 -fstack-protector-strong --param=ssp-buffer-size=4 -Werror=trampolines -fPIC -march=x86-64 -gdwarf-4 -fno-debug-types-section -fvar-tracking-assignments -g2 -I. -I../include -fno-strict-aliasing -Wall -Wstrict-prototypes -Werror -Wformat-security -Werror=format-truncation=0 -D_GNU_SOURCE -D_LARGEFILE64_SOURCE -D_FILE_OFFSET_BITS=64 -DPRODUCT_NAME_SHORT=\"OpenVZ\" -O2 -fwrapv -pipe -Wformat -Werror=format-security -gdwarf-4 -fno-debug-types-section -fvar-tracking-assignments -g2 -Wp,-D_FORTIFY_SOURCE=2 -fstack-protector-strong --param=ssp-buffer-size=4 -Werror=trampolines -fPIC -march=x86-64 -gdwarf-4 -fno-debug-types-section -fvar-tracking-assignments -g2 -I/usr/include/libxml2 -fPIC -fvisibility=hidden -c fsutils.c -o fsutils.o make[1]: Leaving directory '/tmp/B.6zjAC2/BUILD/ploop-8.0.14/lib' make[1]: Entering directory '/tmp/B.6zjAC2/BUILD/ploop-8.0.14/lib' x86_64-pld-linux-gcc -O2 -O2 -I. -I../include -fno-strict-aliasing -Wall -Wstrict-prototypes -Werror -Wformat-security -Werror=format-truncation=0 -D_GNU_SOURCE -D_LARGEFILE64_SOURCE -D_FILE_OFFSET_BITS=64 -DPRODUCT_NAME_SHORT=\"OpenVZ\" -O2 -fwrapv -pipe -Wformat -Werror=format-security -gdwarf-4 -fno-debug-types-section -fvar-tracking-assignments -g2 -Wp,-D_FORTIFY_SOURCE=2 -fstack-protector-strong --param=ssp-buffer-size=4 -Werror=trampolines -fPIC -march=x86-64 -gdwarf-4 -fno-debug-types-section -fvar-tracking-assignments -g2 -I. -I../include -fno-strict-aliasing -Wall -Wstrict-prototypes -Werror -Wformat-security -Werror=format-truncation=0 -D_GNU_SOURCE -D_LARGEFILE64_SOURCE -D_FILE_OFFSET_BITS=64 -DPRODUCT_NAME_SHORT=\"OpenVZ\" -O2 -fwrapv -pipe -Wformat -Werror=format-security -gdwarf-4 -fno-debug-types-section -fvar-tracking-assignments -g2 -Wp,-D_FORTIFY_SOURCE=2 -fstack-protector-strong --param=ssp-buffer-size=4 -Werror=trampolines -fPIC -march=x86-64 -gdwarf-4 -fno-debug-types-section -fvar-tracking-assignments -g2 -I/usr/include/libxml2 -fPIC -fvisibility=hidden -c xml.c -o xml.o In file included from /usr/include/string.h:495, from xml.c:23: In function 'strncpy', inlined from 'get_basedir' at xml.c:436:2, inlined from 'read_dd' at xml.c:557:2: /usr/include/bits/string_fortified.h:106:10: error: '__builtin_strncpy' specified bound 4096 equals destination size [-Werror=stringop-truncation] 106 | return __builtin___strncpy_chk (__dest, __src, __len, __bos (__dest)); | ^~~~~~~~~~~~~~~~~~~~~~~~~~~~~~~~~~~~~~~~~~~~~~~~~~~~~~~~~~~~~~ In function 'strncpy', inlined from 'get_basedir' at xml.c:436:2, inlined from 'store_diskdescriptor' at xml.c:700:2: /usr/include/bits/string_fortified.h:106:10: error: '__builtin_strncpy' specified bound 4096 equals destination size [-Werror=stringop-truncation] 106 | return __builtin___strncpy_chk (__dest, __src, __len, __bos (__dest)); | ^~~~~~~~~~~~~~~~~~~~~~~~~~~~~~~~~~~~~~~~~~~~~~~~~~~~~~~~~~~~~~ cc1: all warnings being treated as errors make[1]: *** [../Makefile.inc:60: xml.o] Error 1 make[1]: Leaving directory '/tmp/B.6zjAC2/BUILD/ploop-8.0.14/lib' make[1]: *** Waiting for unfinished jobs.... make[1]: Entering directory '/tmp/B.6zjAC2/BUILD/ploop-8.0.14/lib' x86_64-pld-linux-gcc -O2 -O2 -I. -I../include -fno-strict-aliasing -Wall -Wstrict-prototypes -Werror -Wformat-security -Werror=format-truncation=0 -D_GNU_SOURCE -D_LARGEFILE64_SOURCE -D_FILE_OFFSET_BITS=64 -DPRODUCT_NAME_SHORT=\"OpenVZ\" -O2 -fwrapv -pipe -Wformat -Werror=format-security -gdwarf-4 -fno-debug-types-section -fvar-tracking-assignments -g2 -Wp,-D_FORTIFY_SOURCE=2 -fstack-protector-strong --param=ssp-buffer-size=4 -Werror=trampolines -fPIC -march=x86-64 -gdwarf-4 -fno-debug-types-section -fvar-tracking-assignments -g2 -I. -I../include -fno-strict-aliasing -Wall -Wstrict-prototypes -Werror -Wformat-security -Werror=format-truncation=0 -D_GNU_SOURCE -D_LARGEFILE64_SOURCE -D_FILE_OFFSET_BITS=64 -DPRODUCT_NAME_SHORT=\"OpenVZ\" -O2 -fwrapv -pipe -Wformat -Werror=format-security -gdwarf-4 -fno-debug-types-section -fvar-tracking-assignments -g2 -Wp,-D_FORTIFY_SOURCE=2 -fstack-protector-strong --param=ssp-buffer-size=4 -Werror=trampolines -fPIC -march=x86-64 -gdwarf-4 -fno-debug-types-section -fvar-tracking-assignments -g2 -I/usr/include/libxml2 -fPIC -fvisibility=hidden -c gpt.c -o gpt.o make[1]: Leaving directory '/tmp/B.6zjAC2/BUILD/ploop-8.0.14/lib' make[1]: Entering directory '/tmp/B.6zjAC2/BUILD/ploop-8.0.14/lib' x86_64-pld-linux-gcc -O2 -O2 -I. -I../include -fno-strict-aliasing -Wall -Wstrict-prototypes -Werror -Wformat-security -Werror=format-truncation=0 -D_GNU_SOURCE -D_LARGEFILE64_SOURCE -D_FILE_OFFSET_BITS=64 -DPRODUCT_NAME_SHORT=\"OpenVZ\" -O2 -fwrapv -pipe -Wformat -Werror=format-security -gdwarf-4 -fno-debug-types-section -fvar-tracking-assignments -g2 -Wp,-D_FORTIFY_SOURCE=2 -fstack-protector-strong --param=ssp-buffer-size=4 -Werror=trampolines -fPIC -march=x86-64 -gdwarf-4 -fno-debug-types-section -fvar-tracking-assignments -g2 -I. -I../include -fno-strict-aliasing -Wall -Wstrict-prototypes -Werror -Wformat-security -Werror=format-truncation=0 -D_GNU_SOURCE -D_LARGEFILE64_SOURCE -D_FILE_OFFSET_BITS=64 -DPRODUCT_NAME_SHORT=\"OpenVZ\" -O2 -fwrapv -pipe -Wformat -Werror=format-security -gdwarf-4 -fno-debug-types-section -fvar-tracking-assignments -g2 -Wp,-D_FORTIFY_SOURCE=2 -fstack-protector-strong --param=ssp-buffer-size=4 -Werror=trampolines -fPIC -march=x86-64 -gdwarf-4 -fno-debug-types-section -fvar-tracking-assignments -g2 -I/usr/include/libxml2 -fPIC -fvisibility=hidden -c util.c -o util.o make[1]: Leaving directory '/tmp/B.6zjAC2/BUILD/ploop-8.0.14/lib' make[1]: Entering directory '/tmp/B.6zjAC2/BUILD/ploop-8.0.14/lib' x86_64-pld-linux-gcc -O2 -O2 -I. -I../include -fno-strict-aliasing -Wall -Wstrict-prototypes -Werror -Wformat-security -Werror=format-truncation=0 -D_GNU_SOURCE -D_LARGEFILE64_SOURCE -D_FILE_OFFSET_BITS=64 -DPRODUCT_NAME_SHORT=\"OpenVZ\" -O2 -fwrapv -pipe -Wformat -Werror=format-security -gdwarf-4 -fno-debug-types-section -fvar-tracking-assignments -g2 -Wp,-D_FORTIFY_SOURCE=2 -fstack-protector-strong --param=ssp-buffer-size=4 -Werror=trampolines -fPIC -march=x86-64 -gdwarf-4 -fno-debug-types-section -fvar-tracking-assignments -g2 -I. -I../include -fno-strict-aliasing -Wall -Wstrict-prototypes -Werror -Wformat-security -Werror=format-truncation=0 -D_GNU_SOURCE -D_LARGEFILE64_SOURCE -D_FILE_OFFSET_BITS=64 -DPRODUCT_NAME_SHORT=\"OpenVZ\" -O2 -fwrapv -pipe -Wformat -Werror=format-security -gdwarf-4 -fno-debug-types-section -fvar-tracking-assignments -g2 -Wp,-D_FORTIFY_SOURCE=2 -fstack-protector-strong --param=ssp-buffer-size=4 -Werror=trampolines -fPIC -march=x86-64 -gdwarf-4 -fno-debug-types-section -fvar-tracking-assignments -g2 -I/usr/include/libxml2 -fPIC -fvisibility=hidden -c balloon.c -o balloon.o make[1]: Leaving directory '/tmp/B.6zjAC2/BUILD/ploop-8.0.14/lib' make[1]: Entering directory '/tmp/B.6zjAC2/BUILD/ploop-8.0.14/lib' x86_64-pld-linux-gcc -O2 -O2 -I. -I../include -fno-strict-aliasing -Wall -Wstrict-prototypes -Werror -Wformat-security -Werror=format-truncation=0 -D_GNU_SOURCE -D_LARGEFILE64_SOURCE -D_FILE_OFFSET_BITS=64 -DPRODUCT_NAME_SHORT=\"OpenVZ\" -O2 -fwrapv -pipe -Wformat -Werror=format-security -gdwarf-4 -fno-debug-types-section -fvar-tracking-assignments -g2 -Wp,-D_FORTIFY_SOURCE=2 -fstack-protector-strong --param=ssp-buffer-size=4 -Werror=trampolines -fPIC -march=x86-64 -gdwarf-4 -fno-debug-types-section -fvar-tracking-assignments -g2 -I. -I../include -fno-strict-aliasing -Wall -Wstrict-prototypes -Werror -Wformat-security -Werror=format-truncation=0 -D_GNU_SOURCE -D_LARGEFILE64_SOURCE -D_FILE_OFFSET_BITS=64 -DPRODUCT_NAME_SHORT=\"OpenVZ\" -O2 -fwrapv -pipe -Wformat -Werror=format-security -gdwarf-4 -fno-debug-types-section -fvar-tracking-assignments -g2 -Wp,-D_FORTIFY_SOURCE=2 -fstack-protector-strong --param=ssp-buffer-size=4 -Werror=trampolines -fPIC -march=x86-64 -gdwarf-4 -fno-debug-types-section -fvar-tracking-assignments -g2 -I/usr/include/libxml2 -fPIC -fvisibility=hidden -c di.c -o di.o make[1]: Leaving directory '/tmp/B.6zjAC2/BUILD/ploop-8.0.14/lib' make[1]: Entering directory '/tmp/B.6zjAC2/BUILD/ploop-8.0.14/lib' x86_64-pld-linux-gcc -O2 -O2 -I. -I../include -fno-strict-aliasing -Wall -Wstrict-prototypes -Werror -Wformat-security -Werror=format-truncation=0 -D_GNU_SOURCE -D_LARGEFILE64_SOURCE -D_FILE_OFFSET_BITS=64 -DPRODUCT_NAME_SHORT=\"OpenVZ\" -O2 -fwrapv -pipe -Wformat -Werror=format-security -gdwarf-4 -fno-debug-types-section -fvar-tracking-assignments -g2 -Wp,-D_FORTIFY_SOURCE=2 -fstack-protector-strong --param=ssp-buffer-size=4 -Werror=trampolines -fPIC -march=x86-64 -gdwarf-4 -fno-debug-types-section -fvar-tracking-assignments -g2 -I. -I../include -fno-strict-aliasing -Wall -Wstrict-prototypes -Werror -Wformat-security -Werror=format-truncation=0 -D_GNU_SOURCE -D_LARGEFILE64_SOURCE -D_FILE_OFFSET_BITS=64 -DPRODUCT_NAME_SHORT=\"OpenVZ\" -O2 -fwrapv -pipe -Wformat -Werror=format-security -gdwarf-4 -fno-debug-types-section -fvar-tracking-assignments -g2 -Wp,-D_FORTIFY_SOURCE=2 -fstack-protector-strong --param=ssp-buffer-size=4 -Werror=trampolines -fPIC -march=x86-64 -gdwarf-4 -fno-debug-types-section -fvar-tracking-assignments -g2 -I/usr/include/libxml2 -fPIC -fvisibility=hidden -c ploop-copy.c -o ploop-copy.o make[1]: Leaving directory '/tmp/B.6zjAC2/BUILD/ploop-8.0.14/lib' make[1]: Entering directory '/tmp/B.6zjAC2/BUILD/ploop-8.0.14/lib' x86_64-pld-linux-gcc -O2 -O2 -I. -I../include -fno-strict-aliasing -Wall -Wstrict-prototypes -Werror -Wformat-security -Werror=format-truncation=0 -D_GNU_SOURCE -D_LARGEFILE64_SOURCE -D_FILE_OFFSET_BITS=64 -DPRODUCT_NAME_SHORT=\"OpenVZ\" -O2 -fwrapv -pipe -Wformat -Werror=format-security -gdwarf-4 -fno-debug-types-section -fvar-tracking-assignments -g2 -Wp,-D_FORTIFY_SOURCE=2 -fstack-protector-strong --param=ssp-buffer-size=4 -Werror=trampolines -fPIC -march=x86-64 -gdwarf-4 -fno-debug-types-section -fvar-tracking-assignments -g2 -I. -I../include -fno-strict-aliasing -Wall -Wstrict-prototypes -Werror -Wformat-security -Werror=format-truncation=0 -D_GNU_SOURCE -D_LARGEFILE64_SOURCE -D_FILE_OFFSET_BITS=64 -DPRODUCT_NAME_SHORT=\"OpenVZ\" -O2 -fwrapv -pipe -Wformat -Werror=format-security -gdwarf-4 -fno-debug-types-section -fvar-tracking-assignments -g2 -Wp,-D_FORTIFY_SOURCE=2 -fstack-protector-strong --param=ssp-buffer-size=4 -Werror=trampolines -fPIC -march=x86-64 -gdwarf-4 -fno-debug-types-section -fvar-tracking-assignments -g2 -I/usr/include/libxml2 -fPIC -fvisibility=hidden -c merge.c -o merge.o make[1]: Leaving directory '/tmp/B.6zjAC2/BUILD/ploop-8.0.14/lib' make[1]: Entering directory '/tmp/B.6zjAC2/BUILD/ploop-8.0.14/lib' x86_64-pld-linux-gcc -O2 -O2 -I. -I../include -fno-strict-aliasing -Wall -Wstrict-prototypes -Werror -Wformat-security -Werror=format-truncation=0 -D_GNU_SOURCE -D_LARGEFILE64_SOURCE -D_FILE_OFFSET_BITS=64 -DPRODUCT_NAME_SHORT=\"OpenVZ\" -O2 -fwrapv -pipe -Wformat -Werror=format-security -gdwarf-4 -fno-debug-types-section -fvar-tracking-assignments -g2 -Wp,-D_FORTIFY_SOURCE=2 -fstack-protector-strong --param=ssp-buffer-size=4 -Werror=trampolines -fPIC -march=x86-64 -gdwarf-4 -fno-debug-types-section -fvar-tracking-assignments -g2 -I. -I../include -fno-strict-aliasing -Wall -Wstrict-prototypes -Werror -Wformat-security -Werror=format-truncation=0 -D_GNU_SOURCE -D_LARGEFILE64_SOURCE -D_FILE_OFFSET_BITS=64 -DPRODUCT_NAME_SHORT=\"OpenVZ\" -O2 -fwrapv -pipe -Wformat -Werror=format-security -gdwarf-4 -fno-debug-types-section -fvar-tracking-assignments -g2 -Wp,-D_FORTIFY_SOURCE=2 -fstack-protector-strong --param=ssp-buffer-size=4 -Werror=trampolines -fPIC -march=x86-64 -gdwarf-4 -fno-debug-types-section -fvar-tracking-assignments -g2 -I/usr/include/libxml2 -fPIC -fvisibility=hidden -c ploop.c -o ploop.o make[1]: Leaving directory '/tmp/B.6zjAC2/BUILD/ploop-8.0.14/lib' make: *** [Makefile:11: all] Error 2 error: Bad exit status from /tmp/B.6zjAC2/BUILD/tmp/rpm-tmp.35704 (%build) RPM build errors: Bad exit status from /tmp/B.6zjAC2/BUILD/tmp/rpm-tmp.35704 (%build) ended at: Sat Jun 27 19:43:07 2020, done in 0:00:02.519770 error: No files produced. + chmod -R u+rwX /tmp/B.6zjAC2/BUILD + rm -rf /tmp/B.6zjAC2/tmp /tmp/B.6zjAC2/BUILD + rm -rf /tmp/B.6zjAC2 Begin-PLD-Builder-Info Build-Time: user:8.70s sys:0.80s real:5.98s (faults io:0 non-io:277245) End-PLD-Builder-Info
[Back to list of logs] [View rpm -qa of builder]