FailedOk

th/SRPMS[OK]
th/x32[OK]
th/i686[OK]
th/x86_64[OK]

ac/SRPMS[OK]
ac/i386[OK]
ac/i586[OK]
ac/i686[OK]
ac/alpha[OK]
ac/amd64[OK]
ac/athlon[OK]
ac/ppc[OK]
ac/sparc[OK]
ac/sparc64[OK]

Advanced Search
main()
Powered by PLD Linux
(c) 2002-2018 PLD Team
$Revision: 1.37 $
Powered by X.
Your IP: 54.159.51.118

pluto da4aece3-66b0-42fd-9519-428458a18327

Status:Failed
Source URL:ftp://buildlogs.pld-linux.org/th/x86_64/FAIL/pluto,da4aece3-66b0-42fd-9519-428458a18327.bz2
text/plain URL:View!
full text:View!
rpm -qa of builder:View!
Date:2018/07/29 00:22:15
Runtime:0:00:19.049980

Toc:

  • error 1
  • pluto_codegen_if.c:231:19: error: 'CloogOptions' {aka 'struct cloogoptions'} has no member named 'fs'; did you mean 'f'?
  • error 2
  • pluto_codegen_if.c:232:19: error: 'CloogOptions' {aka 'struct cloogoptions'} has no member named 'ls'; did you mean 'l'?
  • error 3
  • pluto_codegen_if.c:233:17: error: 'CloogOptions' {aka 'struct cloogoptions'} has no member named 'fs_ls_size'
  • error 4
  • pluto_codegen_if.c:236:23: error: 'CloogOptions' {aka 'struct cloogoptions'} has no member named 'fs'; did you mean 'f'?
  • error 5
  • pluto_codegen_if.c:237:23: error: 'CloogOptions' {aka 'struct cloogoptions'} has no member named 'ls'; did you mean 'l'?
  • error 6
  • pluto_codegen_if.c:258:31: error: 'CloogOptions' {aka 'struct cloogoptions'} has no member named 'fs'; did you mean 'f'?
  • error 7
  • pluto_codegen_if.c:259:31: error: 'CloogOptions' {aka 'struct cloogoptions'} has no member named 'ls'; did you mean 'l'?
  • error 8
  • pluto_codegen_if.c:271:42: error: 'CloogOptions' {aka 'struct cloogoptions'} has no member named 'fs'; did you mean 'f'?
  • error 9
  • pluto_codegen_if.c:274:59: error: 'CloogOptions' {aka 'struct cloogoptions'} has no member named 'fs'; did you mean 'f'?
  • error 10
  • pluto_codegen_if.c:275:39: error: 'CloogOptions' {aka 'struct cloogoptions'} has no member named 'ls'; did you mean 'l'?
  • error 11
  • make[3]: *** [Makefile:891: pluto-pluto_codegen_if.o] Error 1
  • error 12
  • ast_transform.c:67:9: error: unknown type name 'ClastFilter'
  • error 13
  • ast_transform.c:67:65: error: 'subset' undeclared (first use in this function); did you mean 'strsep'?
  • error 14
  • ast_transform.c:79:25: error: 'struct clast_for' has no member named 'parallel'
  • error 15
  • ast_transform.c:79:38: error: 'CLAST_PARALLEL_NOT' undeclared (first use in this function); did you mean 'PIPE_PARALLEL'?
  • error 16
  • ast_transform.c:84:29: error: 'struct clast_for' has no member named 'parallel'
  • error 17
  • ast_transform.c:84:42: error: 'CLAST_PARALLEL_OMP' undeclared (first use in this function); did you mean 'PIPE_PARALLEL'?
  • error 18
  • ast_transform.c:90:25: error: 'struct clast_for' has no member named 'private_vars'
  • error 19
  • ast_transform.c:139:9: error: unknown type name 'ClastFilter'
  • error 20
  • ast_transform.c:139:65: error: 'subset' undeclared (first use in this function); did you mean 'strsep'?
  • error 21
  • ast_transform.c:152:21: error: 'struct clast_for' has no member named 'parallel'
  • error 22
  • ast_transform.c:152:35: error: 'CLAST_PARALLEL_VEC' undeclared (first use in this function); did you mean 'PIPE_PARALLEL'?
  • error 23
  • make[3]: *** [Makefile:919: pluto-ast_transform.o] Error 1
  • error 24
  • make[2]: *** [Makefile:1015: all-recursive] Error 1
  • error 25
  • make[1]: *** [Makefile:518: all-recursive] Error 1
  • error 26
  • error: Bad exit status from /tmp/B.EZo17Q/BUILD/tmp/rpm-tmp.24320 (%build)
  • error 27
  • RPM build errors:
  • error 28
  • error: No files produced.

Content:

checking if x86_64-pld-linux-g++ PIC flag -fPIC -DPIC works... yes
checking if x86_64-pld-linux-g++ static flag -static works... yes
checking if x86_64-pld-linux-g++ supports -c -o file.o... yes
checking if x86_64-pld-linux-g++ supports -c -o file.o... (cached) yes
checking whether the x86_64-pld-linux-g++ linker (/usr/bin/ld -m elf_x86_64) supports shared libraries... yes
checking dynamic linker characteristics... (cached) GNU/Linux ld.so
checking how to hardcode library paths into programs... immediate
checking for perl... perl
checking for pdflatex... pdflatex
checking for pod2html... pod2html
checking for stdint types... stdint.h (shortcircuit)
make use of stdint.h in include/isl/stdint.h (assuming C99 compatible system)
checking which gmp to use... system
checking gmp.h usability... yes
checking gmp.h presence... yes
checking for gmp.h... yes
checking for main in -lgmp... yes
checking whether mp_get_memory_functions is declared... yes
checking whether ffs is declared... yes
checking whether __builtin_ffs is declared... yes
checking which clang to use... no
checking for C compiler vendor... (cached) gnu
checking our pkgconfig libname... isl
checking our pkgconfig version... 0.12.1
checking our pkgconfig_libdir... ${libdir}/pkgconfig
expanded our pkgconfig_libdir... /usr/lib/pkgconfig
checking our pkgconfig_libfile... isl.pc
checking our package / suffix... isl / 
checking our pkgconfig description... isl Library
checking our pkgconfig requires... 
checking our pkgconfig ext libs... -lisl -lgmp
checking our pkgconfig cppflags... 
checking our pkgconfig ldflags... 
noninstalled pkgconfig -L /tmp/B.EZo17Q/BUILD/pluto-0.11.4/isl/.libs
noninstalled pkgconfig -I /tmp/B.EZo17Q/BUILD/pluto-0.11.4/isl/./include
checking that generated files are newer than configure... done
configure: creating ./config.status
config.status: creating Makefile
config.status: creating doc/Makefile
config.status: creating bound_test.sh
config.status: creating codegen_test.sh
config.status: creating pip_test.sh
config.status: creating isl_config.h
config.status: creating include/isl/config.h
config.status: executing depfiles commands
config.status: executing libtool commands
config.status: executing include/isl/stdint.h commands
config.status: creating include/isl/stdint.h : _ISL_INCLUDE_ISL_STDINT_H
config.status: executing isl.pc commands
config.status: creating isl.pc.in
config.status: creating isl.pc
config.status: creating isl-uninstalled.pc
config.status: creating isl-uninstalled.sh
checking for bash... /bin/bash
checking that generated files are newer than configure... done
configure: creating ./config.status
config.status: creating getversion.sh
config.status: creating Makefile
config.status: creating src/Makefile
config.status: creating polycc.sh
config.status: creating config.h
config.status: executing depfiles commands
config.status: executing libtool commands
config.status: executing version.h commands
 /*-----------------------------------------------*
  *           PLUTO configuration is OK           *
  *-----------------------------------------------*/
Your system is ready to compile PLUTO
Run 'make' next to compile
Then, run 'make test' to check if everything is working correctly
Use polycc (see README)
+ /usr/bin/make -Otarget -j9
/usr/bin/make  all-recursive
Making all in src
make[3]: Entering directory '/tmp/B.EZo17Q/BUILD/pluto-0.11.4/src'
x86_64-pld-linux-gcc -DHAVE_CONFIG_H -I. -I..  -O3 -funroll-loops -fopenmp  -funroll-loops -fopenmp -DSCOPLIB_INT_T_IS_MP -DCLOOG_INT_GMP -I../include   -Wall -MT pluto-constraints_polylib.o -MD -MP -MF .deps/pluto-constraints_polylib.Tpo -c -o pluto-constraints_polylib.o `test -f 'constraints_polylib.c' || echo './'`constraints_polylib.c
mv -f .deps/pluto-constraints_polylib.Tpo .deps/pluto-constraints_polylib.Po
make[3]: Leaving directory '/tmp/B.EZo17Q/BUILD/pluto-0.11.4/src'
make[3]: Entering directory '/tmp/B.EZo17Q/BUILD/pluto-0.11.4/src'
x86_64-pld-linux-gcc -DHAVE_CONFIG_H -I. -I..  -O3 -funroll-loops -fopenmp  -funroll-loops -fopenmp -DSCOPLIB_INT_T_IS_MP -DCLOOG_INT_GMP -I../include   -Wall -MT pluto-ddg.o -MD -MP -MF .deps/pluto-ddg.Tpo -c -o pluto-ddg.o `test -f 'ddg.c' || echo './'`ddg.c
mv -f .deps/pluto-ddg.Tpo .deps/pluto-ddg.Po
make[3]: Leaving directory '/tmp/B.EZo17Q/BUILD/pluto-0.11.4/src'
make[3]: Entering directory '/tmp/B.EZo17Q/BUILD/pluto-0.11.4/src'
x86_64-pld-linux-gcc -DHAVE_CONFIG_H -I. -I..  -O3 -funroll-loops -fopenmp  -funroll-loops -fopenmp -DSCOPLIB_INT_T_IS_MP -DCLOOG_INT_GMP -I../include   -Wall -MT pluto-transforms.o -MD -MP -MF .deps/pluto-transforms.Tpo -c -o pluto-transforms.o `test -f 'transforms.c' || echo './'`transforms.c
transforms.c: In function 'pluto_sink_statement':
transforms.c:35:21: warning: '%d' directive writing between 1 and 11 bytes into a region of size 4 [-Wformat-overflow=]
     sprintf(iter, "d%d", stmt->dim);
                     ^~
transforms.c:35:19: note: directive argument in the range [-2147483648, 2147483646]
     sprintf(iter, "d%d", stmt->dim);
                   ^~~~~
transforms.c:35:5: note: 'sprintf' output between 3 and 13 bytes into a destination of size 5
     sprintf(iter, "d%d", stmt->dim);
     ^~~~~~~~~~~~~~~~~~~~~~~~~~~~~~~
mv -f .deps/pluto-transforms.Tpo .deps/pluto-transforms.Po
make[3]: Leaving directory '/tmp/B.EZo17Q/BUILD/pluto-0.11.4/src'
make[3]: Entering directory '/tmp/B.EZo17Q/BUILD/pluto-0.11.4/src'
x86_64-pld-linux-gcc -DHAVE_CONFIG_H -I. -I..  -O3 -funroll-loops -fopenmp  -funroll-loops -fopenmp -DSCOPLIB_INT_T_IS_MP -DCLOOG_INT_GMP -I../include   -Wall -MT pluto-pluto_codegen_if.o -MD -MP -MF .deps/pluto-pluto_codegen_if.Tpo -c -o pluto-pluto_codegen_if.o `test -f 'pluto_codegen_if.c' || echo './'`pluto_codegen_if.c
pluto_codegen_if.c: In function 'pluto_gen_cloog_code':
pluto_codegen_if.c:231:19: error: 'CloogOptions' {aka 'struct cloogoptions'} has no member named 'fs'; did you mean 'f'?
     cloogOptions->fs = malloc (nstmts*sizeof(int));
                   ^~
                   f
pluto_codegen_if.c:232:19: error: 'CloogOptions' {aka 'struct cloogoptions'} has no member named 'ls'; did you mean 'l'?
     cloogOptions->ls = malloc(nstmts*sizeof(int));
                   ^~
                   l
pluto_codegen_if.c:233:17: error: 'CloogOptions' {aka 'struct cloogoptions'} has no member named 'fs_ls_size'
     cloogOptions->fs_ls_size = nstmts;
                 ^~
pluto_codegen_if.c:236:23: error: 'CloogOptions' {aka 'struct cloogoptions'} has no member named 'fs'; did you mean 'f'?
         cloogOptions->fs[i] = -1;
                       ^~
                       f
pluto_codegen_if.c:237:23: error: 'CloogOptions' {aka 'struct cloogoptions'} has no member named 'ls'; did you mean 'l'?
         cloogOptions->ls[i] = -1;
                       ^~
                       l
pluto_codegen_if.c:258:31: error: 'CloogOptions' {aka 'struct cloogoptions'} has no member named 'fs'; did you mean 'f'?
                 cloogOptions->fs[i] = get_first_point_loop(stmts[i], prog)+1;
                               ^~
                               f
pluto_codegen_if.c:259:31: error: 'CloogOptions' {aka 'struct cloogoptions'} has no member named 'ls'; did you mean 'l'?
                 cloogOptions->ls[i] = prog->num_hyperplanes;
                               ^~
                               l
pluto_codegen_if.c:271:42: error: 'CloogOptions' {aka 'struct cloogoptions'} has no member named 'fs'; did you mean 'f'?
         if (nstmts >= 1 && cloogOptions->fs[0] >= 1) {
                                          ^~
                                          f
pluto_codegen_if.c:274:59: error: 'CloogOptions' {aka 'struct cloogoptions'} has no member named 'fs'; did you mean 'f'?
                 printf("S%d(%d,%d), ", i+1, cloogOptions->fs[i],
                                                           ^~
                                                           f
pluto_codegen_if.c:275:39: error: 'CloogOptions' {aka 'struct cloogoptions'} has no member named 'ls'; did you mean 'l'?
                         cloogOptions->ls[i]);
                                       ^~
                                       l
make[3]: *** [Makefile:891: pluto-pluto_codegen_if.o] Error 1
make[3]: Leaving directory '/tmp/B.EZo17Q/BUILD/pluto-0.11.4/src'
make[3]: *** Waiting for unfinished jobs....
make[3]: Entering directory '/tmp/B.EZo17Q/BUILD/pluto-0.11.4/src'
x86_64-pld-linux-gcc -DHAVE_CONFIG_H -I. -I..  -O3 -funroll-loops -fopenmp  -funroll-loops -fopenmp -DSCOPLIB_INT_T_IS_MP -DCLOOG_INT_GMP -I../include   -Wall -MT pluto-constraints_isl.o -MD -MP -MF .deps/pluto-constraints_isl.Tpo -c -o pluto-constraints_isl.o `test -f 'constraints_isl.c' || echo './'`constraints_isl.c
mv -f .deps/pluto-constraints_isl.Tpo .deps/pluto-constraints_isl.Po
make[3]: Leaving directory '/tmp/B.EZo17Q/BUILD/pluto-0.11.4/src'
make[3]: Entering directory '/tmp/B.EZo17Q/BUILD/pluto-0.11.4/src'
x86_64-pld-linux-gcc -DHAVE_CONFIG_H -I. -I..  -O3 -funroll-loops -fopenmp  -funroll-loops -fopenmp -DSCOPLIB_INT_T_IS_MP -DCLOOG_INT_GMP -I../include   -Wall -MT pluto-ast_transform.o -MD -MP -MF .deps/pluto-ast_transform.Tpo -c -o pluto-ast_transform.o `test -f 'ast_transform.c' || echo './'`ast_transform.c
ast_transform.c: In function 'pluto_mark_parallel':
ast_transform.c:67:9: error: unknown type name 'ClastFilter'
         ClastFilter filter = {iter, stmtids, ploops[i]->nstmts, subset};
         ^~~~~~~~~~~
ast_transform.c:67:31: warning: initialization of 'int' from 'char *' makes integer from pointer without a cast [-Wint-conversion]
         ClastFilter filter = {iter, stmtids, ploops[i]->nstmts, subset};
                               ^~~~
ast_transform.c:67:31: note: (near initialization for 'filter')
ast_transform.c:67:37: warning: excess elements in scalar initializer
         ClastFilter filter = {iter, stmtids, ploops[i]->nstmts, subset};
                                     ^~~~~~~
ast_transform.c:67:37: note: (near initialization for 'filter')
ast_transform.c:67:46: warning: excess elements in scalar initializer
         ClastFilter filter = {iter, stmtids, ploops[i]->nstmts, subset};
                                              ^~~~~~
ast_transform.c:67:46: note: (near initialization for 'filter')
ast_transform.c:67:65: error: 'subset' undeclared (first use in this function); did you mean 'strsep'?
         ClastFilter filter = {iter, stmtids, ploops[i]->nstmts, subset};
                                                                 ^~~~~~
                                                                 strsep
ast_transform.c:67:65: note: each undeclared identifier is reported only once for each function it appears in
ast_transform.c:67:65: warning: excess elements in scalar initializer
ast_transform.c:67:65: note: (near initialization for 'filter')
ast_transform.c:68:9: warning: implicit declaration of function 'clast_filter'; did you mean 'clast_pprint'? [-Wimplicit-function-declaration]
         clast_filter(root, filter, &loops, &nloops, &stmts, &nstmts);
         ^~~~~~~~~~~~
         clast_pprint
ast_transform.c:79:25: error: 'struct clast_for' has no member named 'parallel'
                 loops[j]->parallel = CLAST_PARALLEL_NOT;
                         ^~
ast_transform.c:79:38: error: 'CLAST_PARALLEL_NOT' undeclared (first use in this function); did you mean 'PIPE_PARALLEL'?
                 loops[j]->parallel = CLAST_PARALLEL_NOT;
                                      ^~~~~~~~~~~~~~~~~~
                                      PIPE_PARALLEL
ast_transform.c:84:29: error: 'struct clast_for' has no member named 'parallel'
                     loops[j]->parallel = CLAST_PARALLEL_OMP;
                             ^~
ast_transform.c:84:42: error: 'CLAST_PARALLEL_OMP' undeclared (first use in this function); did you mean 'PIPE_PARALLEL'?
                     loops[j]->parallel = CLAST_PARALLEL_OMP;
                                          ^~~~~~~~~~~~~~~~~~
                                          PIPE_PARALLEL
ast_transform.c:90:25: error: 'struct clast_for' has no member named 'private_vars'
                 loops[j]->private_vars = strdup(private_vars);
                         ^~
ast_transform.c: In function 'pluto_mark_vector':
ast_transform.c:139:9: error: unknown type name 'ClastFilter'
         ClastFilter filter = {iter, stmtids, ploops[i]->nstmts, subset};
         ^~~~~~~~~~~
ast_transform.c:139:31: warning: initialization of 'int' from 'char *' makes integer from pointer without a cast [-Wint-conversion]
         ClastFilter filter = {iter, stmtids, ploops[i]->nstmts, subset};
                               ^~~~
ast_transform.c:139:31: note: (near initialization for 'filter')
ast_transform.c:139:37: warning: excess elements in scalar initializer
         ClastFilter filter = {iter, stmtids, ploops[i]->nstmts, subset};
                                     ^~~~~~~
ast_transform.c:139:37: note: (near initialization for 'filter')
ast_transform.c:139:46: warning: excess elements in scalar initializer
         ClastFilter filter = {iter, stmtids, ploops[i]->nstmts, subset};
                                              ^~~~~~
ast_transform.c:139:46: note: (near initialization for 'filter')
ast_transform.c:139:65: error: 'subset' undeclared (first use in this function); did you mean 'strsep'?
         ClastFilter filter = {iter, stmtids, ploops[i]->nstmts, subset};
                                                                 ^~~~~~
                                                                 strsep
ast_transform.c:139:65: warning: excess elements in scalar initializer
ast_transform.c:139:65: note: (near initialization for 'filter')
ast_transform.c:152:21: error: 'struct clast_for' has no member named 'parallel'
             loops[j]->parallel += CLAST_PARALLEL_VEC;
                     ^~
ast_transform.c:152:35: error: 'CLAST_PARALLEL_VEC' undeclared (first use in this function); did you mean 'PIPE_PARALLEL'?
             loops[j]->parallel += CLAST_PARALLEL_VEC;
                                   ^~~~~~~~~~~~~~~~~~
                                   PIPE_PARALLEL
make[3]: *** [Makefile:919: pluto-ast_transform.o] Error 1
make[3]: Leaving directory '/tmp/B.EZo17Q/BUILD/pluto-0.11.4/src'
make[3]: Entering directory '/tmp/B.EZo17Q/BUILD/pluto-0.11.4/src'
x86_64-pld-linux-gcc -DHAVE_CONFIG_H -I. -I..  -O3 -funroll-loops -fopenmp  -funroll-loops -fopenmp -DSCOPLIB_INT_T_IS_MP -DCLOOG_INT_GMP -I../include   -Wall -MT pluto-post_transform.o -MD -MP -MF .deps/pluto-post_transform.Tpo -c -o pluto-post_transform.o `test -f 'post_transform.c' || echo './'`post_transform.c
mv -f .deps/pluto-post_transform.Tpo .deps/pluto-post_transform.Po
make[3]: Leaving directory '/tmp/B.EZo17Q/BUILD/pluto-0.11.4/src'
make[3]: Entering directory '/tmp/B.EZo17Q/BUILD/pluto-0.11.4/src'
x86_64-pld-linux-gcc -DHAVE_CONFIG_H -I. -I..  -O3 -funroll-loops -fopenmp  -funroll-loops -fopenmp -DSCOPLIB_INT_T_IS_MP -DCLOOG_INT_GMP -I../include   -Wall -MT pluto-polyloop.o -MD -MP -MF .deps/pluto-polyloop.Tpo -c -o pluto-polyloop.o `test -f 'polyloop.c' || echo './'`polyloop.c
mv -f .deps/pluto-polyloop.Tpo .deps/pluto-polyloop.Po
make[3]: Leaving directory '/tmp/B.EZo17Q/BUILD/pluto-0.11.4/src'
make[3]: Entering directory '/tmp/B.EZo17Q/BUILD/pluto-0.11.4/src'
x86_64-pld-linux-gcc -DHAVE_CONFIG_H -I. -I..  -O3 -funroll-loops -fopenmp  -funroll-loops -fopenmp -DSCOPLIB_INT_T_IS_MP -DCLOOG_INT_GMP -I../include   -Wall -MT pluto-math_support.o -MD -MP -MF .deps/pluto-math_support.Tpo -c -o pluto-math_support.o `test -f 'math_support.c' || echo './'`math_support.c
mv -f .deps/pluto-math_support.Tpo .deps/pluto-math_support.Po
make[3]: Leaving directory '/tmp/B.EZo17Q/BUILD/pluto-0.11.4/src'
make[3]: Entering directory '/tmp/B.EZo17Q/BUILD/pluto-0.11.4/src'
x86_64-pld-linux-gcc -DHAVE_CONFIG_H -I. -I..  -O3 -funroll-loops -fopenmp  -funroll-loops -fopenmp -DSCOPLIB_INT_T_IS_MP -DCLOOG_INT_GMP -I../include   -Wall -MT pluto-framework.o -MD -MP -MF .deps/pluto-framework.Tpo -c -o pluto-framework.o `test -f 'framework.c' || echo './'`framework.c
mv -f .deps/pluto-framework.Tpo .deps/pluto-framework.Po
make[3]: Leaving directory '/tmp/B.EZo17Q/BUILD/pluto-0.11.4/src'
make[3]: Entering directory '/tmp/B.EZo17Q/BUILD/pluto-0.11.4/src'
x86_64-pld-linux-gcc -DHAVE_CONFIG_H -I. -I..  -O3 -funroll-loops -fopenmp  -funroll-loops -fopenmp -DSCOPLIB_INT_T_IS_MP -DCLOOG_INT_GMP -I../include   -Wall -MT pluto-pluto.o -MD -MP -MF .deps/pluto-pluto.Tpo -c -o pluto-pluto.o `test -f 'pluto.c' || echo './'`pluto.c
mv -f .deps/pluto-pluto.Tpo .deps/pluto-pluto.Po
make[3]: Leaving directory '/tmp/B.EZo17Q/BUILD/pluto-0.11.4/src'
make[3]: Entering directory '/tmp/B.EZo17Q/BUILD/pluto-0.11.4/src'
x86_64-pld-linux-gcc -DHAVE_CONFIG_H -I. -I..  -O3 -funroll-loops -fopenmp  -funroll-loops -fopenmp -DSCOPLIB_INT_T_IS_MP -DCLOOG_INT_GMP -I../include   -Wall -MT pluto-constraints.o -MD -MP -MF .deps/pluto-constraints.Tpo -c -o pluto-constraints.o `test -f 'constraints.c' || echo './'`constraints.c
constraints.c: In function 'pluto_constraints_cplex_print':
constraints.c:1028:38: warning: '%d' directive writing between 1 and 10 bytes into a region of size 4 [-Wformat-overflow=]
                 else sprintf(var, "c_%d", j);
                                      ^~
constraints.c:1028:35: note: directive argument in the range [0, 2147483647]
                 else sprintf(var, "c_%d", j);
                                   ^~~~~~
constraints.c:1028:22: note: 'sprintf' output between 4 and 13 bytes into a destination of size 6
                 else sprintf(var, "c_%d", j);
                      ^~~~~~~~~~~~~~~~~~~~~~~
constraints.c: In function 'fourier_motzkin_eliminate':
constraints.c:545:25: warning: argument 1 range [18446744065119617024, 18446744073709551612] exceeds maximum object size 9223372036854775807 [-Walloc-size-larger-than=]
         bound = (int *) malloc(cst->nrows*sizeof(int));
                         ^~~~~~~~~~~~~~~~~~~~~~~~~~~~~~
In file included from constraints.c:23:
/usr/include/stdlib.h:539:14: note: in a call to allocation function 'malloc' declared here
 extern void *malloc (size_t __size) __THROW __attribute_malloc__ __wur;
              ^~~~~~
In function 'fourier_motzkin_eliminate_smart.part.16',
    inlined from 'fourier_motzkin_eliminate_smart':
constraints.c:2233:25: warning: argument 1 range [18446744065119617024, 18446744073709551612] exceeds maximum object size 9223372036854775807 [-Walloc-size-larger-than=]
         bound = (int *) malloc(cst->nrows*sizeof(int));
                         ^~~~~~~~~~~~~~~~~~~~~~~~~~~~~~
In file included from constraints.c:23:
constraints.c: In function 'fourier_motzkin_eliminate_smart':
/usr/include/stdlib.h:539:14: note: in a call to allocation function 'malloc' declared here
 extern void *malloc (size_t __size) __THROW __attribute_malloc__ __wur;
              ^~~~~~
mv -f .deps/pluto-constraints.Tpo .deps/pluto-constraints.Po
make[3]: Leaving directory '/tmp/B.EZo17Q/BUILD/pluto-0.11.4/src'
make[2]: *** [Makefile:1015: all-recursive] Error 1
make[1]: *** [Makefile:518: all-recursive] Error 1
make: *** [Makefile:390: all] Error 2
error: Bad exit status from /tmp/B.EZo17Q/BUILD/tmp/rpm-tmp.24320 (%build)


RPM build errors:
    Bad exit status from /tmp/B.EZo17Q/BUILD/tmp/rpm-tmp.24320 (%build)
ended at: Sun Jul 29 00:22:15 2018, done in 0:00:19.049980
error: No files produced.
mesg: ttyname failed: Inappropriate ioctl for device
+ chmod -R u+rwX /tmp/B.EZo17Q/BUILD
+ rm -rf /tmp/B.EZo17Q/tmp /tmp/B.EZo17Q/BUILD
mesg: ttyname failed: Inappropriate ioctl for device
+ rm -rf /tmp/B.EZo17Q
Begin-PLD-Builder-Info
Build-Time: user:18.11s sys:2.60s real:22.16s (faults io:0 non-io:1326766)

End-PLD-Builder-Info
[Back to list of logs] [View rpm -qa of builder]