FailedOk

th/SRPMS[OK]
th/x32[OK]
th/i686[OK]
th/x86_64[OK]

ac/SRPMS[OK]
ac/i386[OK]
ac/i586[OK]
ac/i686[OK]
ac/alpha[OK]
ac/amd64[OK]
ac/athlon[OK]
ac/ppc[OK]
ac/sparc[OK]
ac/sparc64[OK]

Advanced Search
main()
Powered by PLD Linux
(c) 2002-2017 PLD Team
$Revision: 1.37 $
Powered by six Cray XMT Supercomputers.
Your IP: 54.158.4.4

primecoin-hp d874153d-22a2-4f6c-94cb-d992d614bc8e

Status:Failed
Source URL:ftp://buildlogs.pld-linux.org/th/x86_64/FAIL/primecoin-hp,d874153d-22a2-4f6c-94cb-d992d614bc8e.bz2
text/plain URL:View!
rpm -qa of builder:View!
Date:2017/04/16 14:28:45
Runtime:0:01:09.114629

Toc:

  • prep
  • Executing(%prep): /bin/sh -e /tmp/B.28JnVz/BUILD/tmp/rpm-tmp.80454
  • build
  • Executing(%build): /bin/sh -e /tmp/B.28JnVz/BUILD/tmp/rpm-tmp.40531
  • error 1
  • src/net.cpp:1089:68: error: invalid conversion from 'int*' to 'unsigned char' [-fpermissive]
  • error 2
  • src/net.cpp:1089:74: error: too few arguments to function 'UPNPDev* upnpDiscover(int, const char*, const char*, int, int, unsigned char, int*)'
  • error 3
  • error: Bad exit status from /tmp/B.28JnVz/BUILD/tmp/rpm-tmp.40531 (%build)
  • error 4
  • RPM build errors:
  • error 5
  • error: No files produced.

Content:

request from: baggins
checking if we should skip the build
started at: Sun Apr 16 14:27:32 2017
fetching https://srcbuilder.pld-linux.org/th//srpms/d874153d-22a2-4f6c-94cb-d992d614bc8e/primecoin-hp-0.1.2.hp14-5.src.rpm
fetched 3097402 bytes, 2380.7 K/s
installing srpm: primecoin-hp-0.1.2.hp14-5.src.rpm
mesg: ttyname failed: Inappropriate ioctl for device
+ install -d /tmp/B.28JnVz/BUILD /tmp/B.28JnVz/RPMS
+ LC_ALL=en_US.UTF-8
+ rpm -qp --changelog primecoin-hp-0.1.2.hp14-5.src.rpm
* Sun Apr 16 2017 PLD Linux Team <feedback@pld-linux.org>
- For complete changelog see: http://git.pld-linux.org/?p=packages/primecoin-hp.git;a=log;h=master
* Sun Apr 16 2017 Jan Rękorajski <baggins@pld-linux.org> e9e0c19
- rebuild with miniupnpc 2.0 - release 5 (by relup.sh) * Sun Apr 09 2017 Jan Rękorajski <baggins@pld-linux.org> 876475a
- rebuild with boost 1.63.0 - release 4 (by relup.sh) * Tue May 17 2016 Elan Ruusamäe <glen@delfi.ee> 2b98fd9
- boost 1.61 rebuild - release 3 (by relup.sh) + rpm -Uhv --nodeps --define '_topdir /tmp/B.28JnVz' --define '_specdir %{_topdir}' --define '_sourcedir %{_specdir}' --define '_rpmdir %{_topdir}/RPMS' --define '_builddir %{_topdir}/BUILD' primecoin-hp-0.1.2.hp14-5.src.rpm Preparing... ################################################## primecoin-hp ################################################## + rm -f primecoin-hp-0.1.2.hp14-5.src.rpm mesg: ttyname failed: Inappropriate ioctl for device + install -m 700 -d /tmp/B.28JnVz/BUILD/tmp mesg: ttyname failed: Inappropriate ioctl for device + TMPDIR=/tmp/B.28JnVz/BUILD/tmp + exec nice -n 0 rpmbuild -bp --short-circuit --nodeps --define '_topdir /tmp/B.28JnVz' --define '_specdir %{_topdir}' --define '_sourcedir %{_specdir}' --define '_rpmdir %{_topdir}/RPMS' --define '_builddir %{_topdir}/BUILD' --target x86_64-pld-linux --define 'prep exit 0' /tmp/B.28JnVz/primecoin-hp.spec Building target platforms: x86_64-pld-linux checking BuildConflict-ing packages no BuildConflicts found checking BR rpm: Building target platforms: x86_64-pld-linux no BR needed building RPM using: set -ex; : build-id: d874153d-22a2-4f6c-94cb-d992d614bc8e; TMPDIR=/tmp/B.28JnVz/BUILD/tmp exec nice -n 0 rpmbuild -bb --define '_smp_mflags -j5' --define '_make_opts -Otarget' --define '_pld_builder 1' --define '_topdir /tmp/B.28JnVz' --define '_specdir %{_topdir}' --define '_sourcedir %{_specdir}' --define '_rpmdir %{_topdir}/RPMS' --define '_builddir %{_topdir}/BUILD' --target x86_64-pld-linux /tmp/B.28JnVz/primecoin-hp.spec mesg: ttyname failed: Inappropriate ioctl for device + : build-id: d874153d-22a2-4f6c-94cb-d992d614bc8e + TMPDIR=/tmp/B.28JnVz/BUILD/tmp + exec nice -n 0 rpmbuild -bb --define '_smp_mflags -j5' --define '_make_opts -Otarget' --define '_pld_builder 1' --define '_topdir /tmp/B.28JnVz' --define '_specdir %{_topdir}' --define '_sourcedir %{_specdir}' --define '_rpmdir %{_topdir}/RPMS' --define '_builddir %{_topdir}/BUILD' --target x86_64-pld-linux /tmp/B.28JnVz/primecoin-hp.spec Building target platforms: x86_64-pld-linux Executing(%prep): /bin/sh -e /tmp/B.28JnVz/BUILD/tmp/rpm-tmp.80454 + umask 022 + cd /tmp/B.28JnVz/BUILD + cd /tmp/B.28JnVz/BUILD + rm -rf primecoin-0.1.2-hp14 + /usr/bin/bzip2 -dc /tmp/B.28JnVz/primecoin-0.1.2-hp14.tar.bz2 + /bin/tar -xf - + STATUS=0 + '[' 0 -ne 0 ']' + cd primecoin-0.1.2-hp14 + /bin/id -u + '[' 1000 '=' 0 ']' + /bin/id -u + '[' 1000 '=' 0 ']' + /bin/chmod -Rf a+rX,u+w,g-w,o-w . + echo 'Patch #0 (build-i486.patch):' Patch #0 (build-i486.patch): + '[' -f /tmp/B.28JnVz/build-i486.patch ']' + /bin/cat /tmp/B.28JnVz/build-i486.patch + /usr/bin/patch -s -p1 + echo 'Patch #1 (boost-1.58.patch):' Patch #1 (boost-1.58.patch): + '[' -f /tmp/B.28JnVz/boost-1.58.patch ']' + /bin/cat /tmp/B.28JnVz/boost-1.58.patch + /usr/bin/patch -s -p1 + exit 0 Executing(%build): /bin/sh -e /tmp/B.28JnVz/BUILD/tmp/rpm-tmp.40531 TMP=/home/users/builder/tmp HOME=/home/users/builder PATH=/home/users/builder/GNUstep/Tools:/usr/local/bin:/usr/bin:/bin:/home/users/builder/bin TMPDIR=/tmp/B.28JnVz/BUILD/tmp + umask 022 + cd /tmp/B.28JnVz/BUILD + cd primecoin-0.1.2-hp14 + qmake-qt4 'USE_UPNP=1' 'USE_DBUS=1' 'USE_QRCODE=1' bitcoin-qt.pro Project MESSAGE: Building with QRCode support Project MESSAGE: Building with UPNP support Project MESSAGE: Building with DBUS (Freedesktop notifications) support Removed plural forms as the target language has less forms. If this sounds wrong, possibly the target language is not set or recognized. Removed plural forms as the target language has less forms. If this sounds wrong, possibly the target language is not set or recognized. Removed plural forms as the target language has less forms. If this sounds wrong, possibly the target language is not set or recognized. Removed plural forms as the target language has less forms. If this sounds wrong, possibly the target language is not set or recognized. + /usr/bin/make -Otarget -j5 cd /tmp/B.28JnVz/BUILD/primecoin-0.1.2-hp14/src/leveldb && CC=x86_64-pld-linux-gcc CXX=x86_64-pld-linux-g++ /usr/bin/make OPT="-pipe -fstack-protector-all -D_FORTIFY_SOURCE=2 -O2 -O2 -fwrapv -pipe -Wformat -Werror=format-security -gdwarf-4 -fno-debug-types-section -fvar-tracking-assignments -g2 -Wp,-D_FORTIFY_SOURCE=2 -fno-strict-aliasing -std=gnu++98 -fstack-protector-strong --param=ssp-buffer-size=4 -fPIC -march=x86-64 -gdwarf-4 -fno-debug-types-section -fvar-tracking-assignments -g2" libleveldb.a libmemenv.a /usr/lib64/qt4/bin/uic src/qt/forms/sendcoinsdialog.ui -o build/ui_sendcoinsdialog.h /usr/lib64/qt4/bin/uic src/qt/forms/addressbookpage.ui -o build/ui_addressbookpage.h /usr/lib64/qt4/bin/uic src/qt/forms/signverifymessagedialog.ui -o build/ui_signverifymessagedialog.h /usr/lib64/qt4/bin/uic src/qt/forms/aboutdialog.ui -o build/ui_aboutdialog.h /usr/lib64/qt4/bin/uic src/qt/forms/editaddressdialog.ui -o build/ui_editaddressdialog.h /usr/lib64/qt4/bin/uic src/qt/forms/transactiondescdialog.ui -o build/ui_transactiondescdialog.h /usr/lib64/qt4/bin/uic src/qt/forms/sendcoinsentry.ui -o build/ui_sendcoinsentry.h /usr/lib64/qt4/bin/uic src/qt/forms/overviewpage.ui -o build/ui_overviewpage.h /usr/lib64/qt4/bin/uic src/qt/forms/askpassphrasedialog.ui -o build/ui_askpassphrasedialog.h /usr/lib64/qt4/bin/uic src/qt/forms/rpcconsole.ui -o build/ui_rpcconsole.h /usr/lib64/qt4/bin/uic src/qt/forms/qrcodedialog.ui -o build/ui_qrcodedialog.h /usr/lib64/qt4/bin/uic src/qt/forms/optionsdialog.ui -o build/ui_optionsdialog.h cd /tmp/B.28JnVz/BUILD/primecoin-0.1.2-hp14; /bin/sh share/genbuild.sh /tmp/B.28JnVz/BUILD/primecoin-0.1.2-hp14/build/build.h fatal: Not a git repository (or any of the parent directories): .git make[1]: Entering directory '/tmp/B.28JnVz/BUILD/primecoin-0.1.2-hp14/src/leveldb' x86_64-pld-linux-g++ -I. -I./include -pthread -DOS_LINUX -DLEVELDB_PLATFORM_POSIX -pipe -fstack-protector-all -D_FORTIFY_SOURCE=2 -O2 -O2 -fwrapv -pipe -Wformat -Werror=format-security -gdwarf-4 -fno-debug-types-section -fvar-tracking-assignments -g2 -Wp,-D_FORTIFY_SOURCE=2 -fno-strict-aliasing -std=gnu++98 -fstack-protector-strong --param=ssp-buffer-size=4 -fPIC -march=x86-64 -gdwarf-4 -fno-debug-types-section -fvar-tracking-assignments -g2 -c db/builder.cc -o db/builder.o make[1]: Leaving directory '/tmp/B.28JnVz/BUILD/primecoin-0.1.2-hp14/src/leveldb' make[1]: Entering directory '/tmp/B.28JnVz/BUILD/primecoin-0.1.2-hp14/src/leveldb' x86_64-pld-linux-g++ -I. -I./include -pthread -DOS_LINUX -DLEVELDB_PLATFORM_POSIX -pipe -fstack-protector-all -D_FORTIFY_SOURCE=2 -O2 -O2 -fwrapv -pipe -Wformat -Werror=format-security -gdwarf-4 -fno-debug-types-section -fvar-tracking-assignments -g2 -Wp,-D_FORTIFY_SOURCE=2 -fno-strict-aliasing -std=gnu++98 -fstack-protector-strong --param=ssp-buffer-size=4 -fPIC -march=x86-64 -gdwarf-4 -fno-debug-types-section -fvar-tracking-assignments -g2 -c db/c.cc -o db/c.o make[1]: Leaving directory '/tmp/B.28JnVz/BUILD/primecoin-0.1.2-hp14/src/leveldb' make[1]: Entering directory '/tmp/B.28JnVz/BUILD/primecoin-0.1.2-hp14/src/leveldb' x86_64-pld-linux-g++ -I. -I./include -pthread -DOS_LINUX -DLEVELDB_PLATFORM_POSIX -pipe -fstack-protector-all -D_FORTIFY_SOURCE=2 -O2 -O2 -fwrapv -pipe -Wformat -Werror=format-security -gdwarf-4 -fno-debug-types-section -fvar-tracking-assignments -g2 -Wp,-D_FORTIFY_SOURCE=2 -fno-strict-aliasing -std=gnu++98 -fstack-protector-strong --param=ssp-buffer-size=4 -fPIC -march=x86-64 -gdwarf-4 -fno-debug-types-section -fvar-tracking-assignments -g2 -c db/db_impl.cc -o db/db_impl.o make[1]: Leaving directory '/tmp/B.28JnVz/BUILD/primecoin-0.1.2-hp14/src/leveldb' make[1]: Entering directory '/tmp/B.28JnVz/BUILD/primecoin-0.1.2-hp14/src/leveldb' x86_64-pld-linux-g++ -I. -I./include -pthread -DOS_LINUX -DLEVELDB_PLATFORM_POSIX -pipe -fstack-protector-all -D_FORTIFY_SOURCE=2 -O2 -O2 -fwrapv -pipe -Wformat -Werror=format-security -gdwarf-4 -fno-debug-types-section -fvar-tracking-assignments -g2 -Wp,-D_FORTIFY_SOURCE=2 -fno-strict-aliasing -std=gnu++98 -fstack-protector-strong --param=ssp-buffer-size=4 -fPIC -march=x86-64 -gdwarf-4 -fno-debug-types-section -fvar-tracking-assignments -g2 -c db/db_iter.cc -o db/db_iter.o make[1]: Leaving directory '/tmp/B.28JnVz/BUILD/primecoin-0.1.2-hp14/src/leveldb' make[1]: Entering directory '/tmp/B.28JnVz/BUILD/primecoin-0.1.2-hp14/src/leveldb' x86_64-pld-linux-g++ -I. -I./include -pthread -DOS_LINUX -DLEVELDB_PLATFORM_POSIX -pipe -fstack-protector-all -D_FORTIFY_SOURCE=2 -O2 -O2 -fwrapv -pipe -Wformat -Werror=format-security -gdwarf-4 -fno-debug-types-section -fvar-tracking-assignments -g2 -Wp,-D_FORTIFY_SOURCE=2 -fno-strict-aliasing -std=gnu++98 -fstack-protector-strong --param=ssp-buffer-size=4 -fPIC -march=x86-64 -gdwarf-4 -fno-debug-types-section -fvar-tracking-assignments -g2 -c db/dbformat.cc -o db/dbformat.o make[1]: Leaving directory '/tmp/B.28JnVz/BUILD/primecoin-0.1.2-hp14/src/leveldb' make[1]: Entering directory '/tmp/B.28JnVz/BUILD/primecoin-0.1.2-hp14/src/leveldb' x86_64-pld-linux-g++ -I. -I./include -pthread -DOS_LINUX -DLEVELDB_PLATFORM_POSIX -pipe -fstack-protector-all -D_FORTIFY_SOURCE=2 -O2 -O2 -fwrapv -pipe -Wformat -Werror=format-security -gdwarf-4 -fno-debug-types-section -fvar-tracking-assignments -g2 -Wp,-D_FORTIFY_SOURCE=2 -fno-strict-aliasing -std=gnu++98 -fstack-protector-strong --param=ssp-buffer-size=4 -fPIC -march=x86-64 -gdwarf-4 -fno-debug-types-section -fvar-tracking-assignments -g2 -c db/filename.cc -o db/filename.o make[1]: Leaving directory '/tmp/B.28JnVz/BUILD/primecoin-0.1.2-hp14/src/leveldb' make[1]: Entering directory '/tmp/B.28JnVz/BUILD/primecoin-0.1.2-hp14/src/leveldb' x86_64-pld-linux-g++ -I. -I./include -pthread -DOS_LINUX -DLEVELDB_PLATFORM_POSIX -pipe -fstack-protector-all -D_FORTIFY_SOURCE=2 -O2 -O2 -fwrapv -pipe -Wformat -Werror=format-security -gdwarf-4 -fno-debug-types-section -fvar-tracking-assignments -g2 -Wp,-D_FORTIFY_SOURCE=2 -fno-strict-aliasing -std=gnu++98 -fstack-protector-strong --param=ssp-buffer-size=4 -fPIC -march=x86-64 -gdwarf-4 -fno-debug-types-section -fvar-tracking-assignments -g2 -c db/log_reader.cc -o db/log_reader.o make[1]: Leaving directory '/tmp/B.28JnVz/BUILD/primecoin-0.1.2-hp14/src/leveldb' make[1]: Entering directory '/tmp/B.28JnVz/BUILD/primecoin-0.1.2-hp14/src/leveldb' x86_64-pld-linux-g++ -I. -I./include -pthread -DOS_LINUX -DLEVELDB_PLATFORM_POSIX -pipe -fstack-protector-all -D_FORTIFY_SOURCE=2 -O2 -O2 -fwrapv -pipe -Wformat -Werror=format-security -gdwarf-4 -fno-debug-types-section -fvar-tracking-assignments -g2 -Wp,-D_FORTIFY_SOURCE=2 -fno-strict-aliasing -std=gnu++98 -fstack-protector-strong --param=ssp-buffer-size=4 -fPIC -march=x86-64 -gdwarf-4 -fno-debug-types-section -fvar-tracking-assignments -g2 -c db/log_writer.cc -o db/log_writer.o make[1]: Leaving directory '/tmp/B.28JnVz/BUILD/primecoin-0.1.2-hp14/src/leveldb' make[1]: Entering directory '/tmp/B.28JnVz/BUILD/primecoin-0.1.2-hp14/src/leveldb' x86_64-pld-linux-g++ -I. -I./include -pthread -DOS_LINUX -DLEVELDB_PLATFORM_POSIX -pipe -fstack-protector-all -D_FORTIFY_SOURCE=2 -O2 -O2 -fwrapv -pipe -Wformat -Werror=format-security -gdwarf-4 -fno-debug-types-section -fvar-tracking-assignments -g2 -Wp,-D_FORTIFY_SOURCE=2 -fno-strict-aliasing -std=gnu++98 -fstack-protector-strong --param=ssp-buffer-size=4 -fPIC -march=x86-64 -gdwarf-4 -fno-debug-types-section -fvar-tracking-assignments -g2 -c db/memtable.cc -o db/memtable.o make[1]: Leaving directory '/tmp/B.28JnVz/BUILD/primecoin-0.1.2-hp14/src/leveldb' make[1]: Entering directory '/tmp/B.28JnVz/BUILD/primecoin-0.1.2-hp14/src/leveldb' x86_64-pld-linux-g++ -I. -I./include -pthread -DOS_LINUX -DLEVELDB_PLATFORM_POSIX -pipe -fstack-protector-all -D_FORTIFY_SOURCE=2 -O2 -O2 -fwrapv -pipe -Wformat -Werror=format-security -gdwarf-4 -fno-debug-types-section -fvar-tracking-assignments -g2 -Wp,-D_FORTIFY_SOURCE=2 -fno-strict-aliasing -std=gnu++98 -fstack-protector-strong --param=ssp-buffer-size=4 -fPIC -march=x86-64 -gdwarf-4 -fno-debug-types-section -fvar-tracking-assignments -g2 -c db/repair.cc -o db/repair.o make[1]: Leaving directory '/tmp/B.28JnVz/BUILD/primecoin-0.1.2-hp14/src/leveldb' make[1]: Entering directory '/tmp/B.28JnVz/BUILD/primecoin-0.1.2-hp14/src/leveldb' x86_64-pld-linux-g++ -I. -I./include -pthread -DOS_LINUX -DLEVELDB_PLATFORM_POSIX -pipe -fstack-protector-all -D_FORTIFY_SOURCE=2 -O2 -O2 -fwrapv -pipe -Wformat -Werror=format-security -gdwarf-4 -fno-debug-types-section -fvar-tracking-assignments -g2 -Wp,-D_FORTIFY_SOURCE=2 -fno-strict-aliasing -std=gnu++98 -fstack-protector-strong --param=ssp-buffer-size=4 -fPIC -march=x86-64 -gdwarf-4 -fno-debug-types-section -fvar-tracking-assignments -g2 -c db/table_cache.cc -o db/table_cache.o make[1]: Leaving directory '/tmp/B.28JnVz/BUILD/primecoin-0.1.2-hp14/src/leveldb' make[1]: Entering directory '/tmp/B.28JnVz/BUILD/primecoin-0.1.2-hp14/src/leveldb' x86_64-pld-linux-g++ -I. -I./include -pthread -DOS_LINUX -DLEVELDB_PLATFORM_POSIX -pipe -fstack-protector-all -D_FORTIFY_SOURCE=2 -O2 -O2 -fwrapv -pipe -Wformat -Werror=format-security -gdwarf-4 -fno-debug-types-section -fvar-tracking-assignments -g2 -Wp,-D_FORTIFY_SOURCE=2 -fno-strict-aliasing -std=gnu++98 -fstack-protector-strong --param=ssp-buffer-size=4 -fPIC -march=x86-64 -gdwarf-4 -fno-debug-types-section -fvar-tracking-assignments -g2 -c db/version_edit.cc -o db/version_edit.o make[1]: Leaving directory '/tmp/B.28JnVz/BUILD/primecoin-0.1.2-hp14/src/leveldb' x86_64-pld-linux-g++ -c -pipe -fstack-protector-all -D_FORTIFY_SOURCE=2 -O2 -O2 -fwrapv -pipe -Wformat -Werror=format-security -gdwarf-4 -fno-debug-types-section -fvar-tracking-assignments -g2 -Wp,-D_FORTIFY_SOURCE=2 -fno-strict-aliasing -std=gnu++98 -fstack-protector-strong --param=ssp-buffer-size=4 -fPIC -march=x86-64 -gdwarf-4 -fno-debug-types-section -fvar-tracking-assignments -g2 -D_REENTRANT -fdiagnostics-show-option -Wall -Wextra -Wformat -Wformat-security -Wno-unused-parameter -Wstack-protector -DQT_GUI -DBOOST_THREAD_USE_LIB -DBOOST_SPIRIT_THREADSAFE -DUSE_QRCODE -DUSE_UPNP=1 -DSTATICLIB -DUSE_DBUS -DUSE_IPV6=1 -DHAVE_BUILD_INFO -DLINUX -D_FILE_OFFSET_BITS=64 -DQT_NO_DEBUG -DQT_DBUS_LIB -DQT_GUI_LIB -DQT_NETWORK_LIB -DQT_CORE_LIB -I/usr/share/qt4/mkspecs/linux-g++ -I/usr/include/qt4/QtCore -I/usr/include/qt4/QtNetwork -I/usr/include/qt4/QtGui -I/usr/include/qt4/QtDBus -I/usr/include/qt4 -Isrc -Isrc/json -Isrc/qt -Isrc/leveldb/include -Isrc/leveldb/helpers -Ibuild -Ibuild -o build/bitcoingui.o src/qt/bitcoingui.cpp In file included from src/ui_interface.h:9:0, from src/qt/bitcoingui.cpp:26: src/util.h:251:22: warning: C++11 requires a space between string literal and macro [-Wc++11-compat] return strprintf("%"PRI64d, n); ^ In file included from src/main.h:12:0, from src/wallet.h:13, from src/qt/bitcoingui.cpp:27: src/net.h:368:20: warning: C++11 requires a space between string literal and macro [-Wc++11-compat] printf("askfor %s %"PRI64d" (%s)\n", inv.ToString().c_str(), nRequestTime, DateTimeStrFormat("%H:%M:%S", nRequestTime/1000000).c_str()); ^ In file included from src/wallet.h:13:0, from src/qt/bitcoingui.cpp:27: src/main.h:458:26: warning: C++11 requires a space between string literal and macro [-Wc++11-compat] return strprintf("CTxOut(nValue=%"PRI64d".%08"PRI64d", scriptPubKey=%s)", nValue / COIN, nValue % COIN, scriptPubKey.ToString().substr(0,30).c_str()); ^ src/main.h:458:49: warning: C++11 requires a space between string literal and macro [-Wc++11-compat] return strprintf("CTxOut(nValue=%"PRI64d".%08"PRI64d", scriptPubKey=%s)", nValue / COIN, nValue % COIN, scriptPubKey.ToString().substr(0,30).c_str()); ^ src/main.h:651:26: warning: C++11 requires a space between string literal and macro [-Wc++11-compat] str += strprintf("CTransaction(hash=%s, ver=%d, vin.size=%"PRIszu", vout.size=%"PRIszu", nLockTime=%u)\n", ^ src/main.h:651:74: warning: C++11 requires a space between string literal and macro [-Wc++11-compat] str += strprintf("CTransaction(hash=%s, ver=%d, vin.size=%"PRIszu", vout.size=%"PRIszu", nLockTime=%u)\n", ^ src/main.h:1508:16: warning: C++11 requires a space between string literal and macro [-Wc++11-compat] printf("CBlock(hash=%s, hashBlockHeader=%s, ver=%d, hashPrevBlock=%s, hashMerkleRoot=%s, nTime=%u, nBits=%08x, nNonce=%u, vtx=%"PRIszu")\n", ^ x86_64-pld-linux-g++ -c -pipe -fstack-protector-all -D_FORTIFY_SOURCE=2 -O2 -O2 -fwrapv -pipe -Wformat -Werror=format-security -gdwarf-4 -fno-debug-types-section -fvar-tracking-assignments -g2 -Wp,-D_FORTIFY_SOURCE=2 -fno-strict-aliasing -std=gnu++98 -fstack-protector-strong --param=ssp-buffer-size=4 -fPIC -march=x86-64 -gdwarf-4 -fno-debug-types-section -fvar-tracking-assignments -g2 -D_REENTRANT -fdiagnostics-show-option -Wall -Wextra -Wformat -Wformat-security -Wno-unused-parameter -Wstack-protector -DQT_GUI -DBOOST_THREAD_USE_LIB -DBOOST_SPIRIT_THREADSAFE -DUSE_QRCODE -DUSE_UPNP=1 -DSTATICLIB -DUSE_DBUS -DUSE_IPV6=1 -DHAVE_BUILD_INFO -DLINUX -D_FILE_OFFSET_BITS=64 -DQT_NO_DEBUG -DQT_DBUS_LIB -DQT_GUI_LIB -DQT_NETWORK_LIB -DQT_CORE_LIB -I/usr/share/qt4/mkspecs/linux-g++ -I/usr/include/qt4/QtCore -I/usr/include/qt4/QtNetwork -I/usr/include/qt4/QtGui -I/usr/include/qt4/QtDBus -I/usr/include/qt4 -Isrc -Isrc/json -Isrc/qt -Isrc/leveldb/include -Isrc/leveldb/helpers -Ibuild -Ibuild -o build/transactiontablemodel.o src/qt/transactiontablemodel.cpp In file included from src/bignum.h:12:0, from src/main.h:10, from src/wallet.h:13, from src/qt/transactiontablemodel.cpp:12: src/util.h:251:22: warning: C++11 requires a space between string literal and macro [-Wc++11-compat] return strprintf("%"PRI64d, n); ^ In file included from src/main.h:12:0, from src/wallet.h:13, from src/qt/transactiontablemodel.cpp:12: src/net.h:368:20: warning: C++11 requires a space between string literal and macro [-Wc++11-compat] printf("askfor %s %"PRI64d" (%s)\n", inv.ToString().c_str(), nRequestTime, DateTimeStrFormat("%H:%M:%S", nRequestTime/1000000).c_str()); ^ In file included from src/wallet.h:13:0, from src/qt/transactiontablemodel.cpp:12: src/main.h:458:26: warning: C++11 requires a space between string literal and macro [-Wc++11-compat] return strprintf("CTxOut(nValue=%"PRI64d".%08"PRI64d", scriptPubKey=%s)", nValue / COIN, nValue % COIN, scriptPubKey.ToString().substr(0,30).c_str()); ^ src/main.h:458:49: warning: C++11 requires a space between string literal and macro [-Wc++11-compat] return strprintf("CTxOut(nValue=%"PRI64d".%08"PRI64d", scriptPubKey=%s)", nValue / COIN, nValue % COIN, scriptPubKey.ToString().substr(0,30).c_str()); ^ src/main.h:651:26: warning: C++11 requires a space between string literal and macro [-Wc++11-compat] str += strprintf("CTransaction(hash=%s, ver=%d, vin.size=%"PRIszu", vout.size=%"PRIszu", nLockTime=%u)\n", ^ src/main.h:651:74: warning: C++11 requires a space between string literal and macro [-Wc++11-compat] str += strprintf("CTransaction(hash=%s, ver=%d, vin.size=%"PRIszu", vout.size=%"PRIszu", nLockTime=%u)\n", ^ src/main.h:1508:16: warning: C++11 requires a space between string literal and macro [-Wc++11-compat] printf("CBlock(hash=%s, hashBlockHeader=%s, ver=%d, hashPrevBlock=%s, hashMerkleRoot=%s, nTime=%u, nBits=%08x, nNonce=%u, vtx=%"PRIszu")\n", ^ x86_64-pld-linux-g++ -c -pipe -fstack-protector-all -D_FORTIFY_SOURCE=2 -O2 -O2 -fwrapv -pipe -Wformat -Werror=format-security -gdwarf-4 -fno-debug-types-section -fvar-tracking-assignments -g2 -Wp,-D_FORTIFY_SOURCE=2 -fno-strict-aliasing -std=gnu++98 -fstack-protector-strong --param=ssp-buffer-size=4 -fPIC -march=x86-64 -gdwarf-4 -fno-debug-types-section -fvar-tracking-assignments -g2 -D_REENTRANT -fdiagnostics-show-option -Wall -Wextra -Wformat -Wformat-security -Wno-unused-parameter -Wstack-protector -DQT_GUI -DBOOST_THREAD_USE_LIB -DBOOST_SPIRIT_THREADSAFE -DUSE_QRCODE -DUSE_UPNP=1 -DSTATICLIB -DUSE_DBUS -DUSE_IPV6=1 -DHAVE_BUILD_INFO -DLINUX -D_FILE_OFFSET_BITS=64 -DQT_NO_DEBUG -DQT_DBUS_LIB -DQT_GUI_LIB -DQT_NETWORK_LIB -DQT_CORE_LIB -I/usr/share/qt4/mkspecs/linux-g++ -I/usr/include/qt4/QtCore -I/usr/include/qt4/QtNetwork -I/usr/include/qt4/QtGui -I/usr/include/qt4/QtDBus -I/usr/include/qt4 -Isrc -Isrc/json -Isrc/qt -Isrc/leveldb/include -Isrc/leveldb/helpers -Ibuild -Ibuild -o build/addresstablemodel.o src/qt/addresstablemodel.cpp In file included from src/bignum.h:12:0, from src/main.h:10, from src/wallet.h:13, from src/qt/addresstablemodel.cpp:6: src/util.h:251:22: warning: C++11 requires a space between string literal and macro [-Wc++11-compat] return strprintf("%"PRI64d, n); ^ In file included from src/main.h:12:0, from src/wallet.h:13, from src/qt/addresstablemodel.cpp:6: src/net.h:368:20: warning: C++11 requires a space between string literal and macro [-Wc++11-compat] printf("askfor %s %"PRI64d" (%s)\n", inv.ToString().c_str(), nRequestTime, DateTimeStrFormat("%H:%M:%S", nRequestTime/1000000).c_str()); ^ In file included from src/wallet.h:13:0, from src/qt/addresstablemodel.cpp:6: src/main.h:458:26: warning: C++11 requires a space between string literal and macro [-Wc++11-compat] return strprintf("CTxOut(nValue=%"PRI64d".%08"PRI64d", scriptPubKey=%s)", nValue / COIN, nValue % COIN, scriptPubKey.ToString().substr(0,30).c_str()); ^ src/main.h:458:49: warning: C++11 requires a space between string literal and macro [-Wc++11-compat] return strprintf("CTxOut(nValue=%"PRI64d".%08"PRI64d", scriptPubKey=%s)", nValue / COIN, nValue % COIN, scriptPubKey.ToString().substr(0,30).c_str()); ^ src/main.h:651:26: warning: C++11 requires a space between string literal and macro [-Wc++11-compat] str += strprintf("CTransaction(hash=%s, ver=%d, vin.size=%"PRIszu", vout.size=%"PRIszu", nLockTime=%u)\n", ^ src/main.h:651:74: warning: C++11 requires a space between string literal and macro [-Wc++11-compat] str += strprintf("CTransaction(hash=%s, ver=%d, vin.size=%"PRIszu", vout.size=%"PRIszu", nLockTime=%u)\n", ^ src/main.h:1508:16: warning: C++11 requires a space between string literal and macro [-Wc++11-compat] printf("CBlock(hash=%s, hashBlockHeader=%s, ver=%d, hashPrevBlock=%s, hashMerkleRoot=%s, nTime=%u, nBits=%08x, nNonce=%u, vtx=%"PRIszu")\n", ^ x86_64-pld-linux-g++ -c -pipe -fstack-protector-all -D_FORTIFY_SOURCE=2 -O2 -O2 -fwrapv -pipe -Wformat -Werror=format-security -gdwarf-4 -fno-debug-types-section -fvar-tracking-assignments -g2 -Wp,-D_FORTIFY_SOURCE=2 -fno-strict-aliasing -std=gnu++98 -fstack-protector-strong --param=ssp-buffer-size=4 -fPIC -march=x86-64 -gdwarf-4 -fno-debug-types-section -fvar-tracking-assignments -g2 -D_REENTRANT -fdiagnostics-show-option -Wall -Wextra -Wformat -Wformat-security -Wno-unused-parameter -Wstack-protector -DQT_GUI -DBOOST_THREAD_USE_LIB -DBOOST_SPIRIT_THREADSAFE -DUSE_QRCODE -DUSE_UPNP=1 -DSTATICLIB -DUSE_DBUS -DUSE_IPV6=1 -DHAVE_BUILD_INFO -DLINUX -D_FILE_OFFSET_BITS=64 -DQT_NO_DEBUG -DQT_DBUS_LIB -DQT_GUI_LIB -DQT_NETWORK_LIB -DQT_CORE_LIB -I/usr/share/qt4/mkspecs/linux-g++ -I/usr/include/qt4/QtCore -I/usr/include/qt4/QtNetwork -I/usr/include/qt4/QtGui -I/usr/include/qt4/QtDBus -I/usr/include/qt4 -Isrc -Isrc/json -Isrc/qt -Isrc/leveldb/include -Isrc/leveldb/helpers -Ibuild -Ibuild -o build/addressbookpage.o src/qt/addressbookpage.cpp make[1]: Entering directory '/tmp/B.28JnVz/BUILD/primecoin-0.1.2-hp14/src/leveldb' x86_64-pld-linux-g++ -I. -I./include -pthread -DOS_LINUX -DLEVELDB_PLATFORM_POSIX -pipe -fstack-protector-all -D_FORTIFY_SOURCE=2 -O2 -O2 -fwrapv -pipe -Wformat -Werror=format-security -gdwarf-4 -fno-debug-types-section -fvar-tracking-assignments -g2 -Wp,-D_FORTIFY_SOURCE=2 -fno-strict-aliasing -std=gnu++98 -fstack-protector-strong --param=ssp-buffer-size=4 -fPIC -march=x86-64 -gdwarf-4 -fno-debug-types-section -fvar-tracking-assignments -g2 -c db/version_set.cc -o db/version_set.o make[1]: Leaving directory '/tmp/B.28JnVz/BUILD/primecoin-0.1.2-hp14/src/leveldb' x86_64-pld-linux-g++ -c -pipe -fstack-protector-all -D_FORTIFY_SOURCE=2 -O2 -O2 -fwrapv -pipe -Wformat -Werror=format-security -gdwarf-4 -fno-debug-types-section -fvar-tracking-assignments -g2 -Wp,-D_FORTIFY_SOURCE=2 -fno-strict-aliasing -std=gnu++98 -fstack-protector-strong --param=ssp-buffer-size=4 -fPIC -march=x86-64 -gdwarf-4 -fno-debug-types-section -fvar-tracking-assignments -g2 -D_REENTRANT -fdiagnostics-show-option -Wall -Wextra -Wformat -Wformat-security -Wno-unused-parameter -Wstack-protector -DQT_GUI -DBOOST_THREAD_USE_LIB -DBOOST_SPIRIT_THREADSAFE -DUSE_QRCODE -DUSE_UPNP=1 -DSTATICLIB -DUSE_DBUS -DUSE_IPV6=1 -DHAVE_BUILD_INFO -DLINUX -D_FILE_OFFSET_BITS=64 -DQT_NO_DEBUG -DQT_DBUS_LIB -DQT_GUI_LIB -DQT_NETWORK_LIB -DQT_CORE_LIB -I/usr/share/qt4/mkspecs/linux-g++ -I/usr/include/qt4/QtCore -I/usr/include/qt4/QtNetwork -I/usr/include/qt4/QtGui -I/usr/include/qt4/QtDBus -I/usr/include/qt4 -Isrc -Isrc/json -Isrc/qt -Isrc/leveldb/include -Isrc/leveldb/helpers -Ibuild -Ibuild -o build/bitcoin.o src/qt/bitcoin.cpp In file included from src/bignum.h:12:0, from src/main.h:10, from src/wallet.h:13, from src/init.h:8, from src/qt/bitcoin.cpp:13: src/util.h:251:22: warning: C++11 requires a space between string literal and macro [-Wc++11-compat] return strprintf("%"PRI64d, n); ^ In file included from src/main.h:12:0, from src/wallet.h:13, from src/init.h:8, from src/qt/bitcoin.cpp:13: src/net.h:368:20: warning: C++11 requires a space between string literal and macro [-Wc++11-compat] printf("askfor %s %"PRI64d" (%s)\n", inv.ToString().c_str(), nRequestTime, DateTimeStrFormat("%H:%M:%S", nRequestTime/1000000).c_str()); ^ In file included from src/wallet.h:13:0, from src/init.h:8, from src/qt/bitcoin.cpp:13: src/main.h:458:26: warning: C++11 requires a space between string literal and macro [-Wc++11-compat] return strprintf("CTxOut(nValue=%"PRI64d".%08"PRI64d", scriptPubKey=%s)", nValue / COIN, nValue % COIN, scriptPubKey.ToString().substr(0,30).c_str()); ^ src/main.h:458:49: warning: C++11 requires a space between string literal and macro [-Wc++11-compat] return strprintf("CTxOut(nValue=%"PRI64d".%08"PRI64d", scriptPubKey=%s)", nValue / COIN, nValue % COIN, scriptPubKey.ToString().substr(0,30).c_str()); ^ src/main.h:651:26: warning: C++11 requires a space between string literal and macro [-Wc++11-compat] str += strprintf("CTransaction(hash=%s, ver=%d, vin.size=%"PRIszu", vout.size=%"PRIszu", nLockTime=%u)\n", ^ src/main.h:651:74: warning: C++11 requires a space between string literal and macro [-Wc++11-compat] str += strprintf("CTransaction(hash=%s, ver=%d, vin.size=%"PRIszu", vout.size=%"PRIszu", nLockTime=%u)\n", ^ src/main.h:1508:16: warning: C++11 requires a space between string literal and macro [-Wc++11-compat] printf("CBlock(hash=%s, hashBlockHeader=%s, ver=%d, hashPrevBlock=%s, hashMerkleRoot=%s, nTime=%u, nBits=%08x, nNonce=%u, vtx=%"PRIszu")\n", ^ make[1]: Entering directory '/tmp/B.28JnVz/BUILD/primecoin-0.1.2-hp14/src/leveldb' x86_64-pld-linux-g++ -I. -I./include -pthread -DOS_LINUX -DLEVELDB_PLATFORM_POSIX -pipe -fstack-protector-all -D_FORTIFY_SOURCE=2 -O2 -O2 -fwrapv -pipe -Wformat -Werror=format-security -gdwarf-4 -fno-debug-types-section -fvar-tracking-assignments -g2 -Wp,-D_FORTIFY_SOURCE=2 -fno-strict-aliasing -std=gnu++98 -fstack-protector-strong --param=ssp-buffer-size=4 -fPIC -march=x86-64 -gdwarf-4 -fno-debug-types-section -fvar-tracking-assignments -g2 -c db/write_batch.cc -o db/write_batch.o make[1]: Leaving directory '/tmp/B.28JnVz/BUILD/primecoin-0.1.2-hp14/src/leveldb' make[1]: Entering directory '/tmp/B.28JnVz/BUILD/primecoin-0.1.2-hp14/src/leveldb' x86_64-pld-linux-g++ -I. -I./include -pthread -DOS_LINUX -DLEVELDB_PLATFORM_POSIX -pipe -fstack-protector-all -D_FORTIFY_SOURCE=2 -O2 -O2 -fwrapv -pipe -Wformat -Werror=format-security -gdwarf-4 -fno-debug-types-section -fvar-tracking-assignments -g2 -Wp,-D_FORTIFY_SOURCE=2 -fno-strict-aliasing -std=gnu++98 -fstack-protector-strong --param=ssp-buffer-size=4 -fPIC -march=x86-64 -gdwarf-4 -fno-debug-types-section -fvar-tracking-assignments -g2 -c table/block.cc -o table/block.o make[1]: Leaving directory '/tmp/B.28JnVz/BUILD/primecoin-0.1.2-hp14/src/leveldb' make[1]: Entering directory '/tmp/B.28JnVz/BUILD/primecoin-0.1.2-hp14/src/leveldb' x86_64-pld-linux-g++ -I. -I./include -pthread -DOS_LINUX -DLEVELDB_PLATFORM_POSIX -pipe -fstack-protector-all -D_FORTIFY_SOURCE=2 -O2 -O2 -fwrapv -pipe -Wformat -Werror=format-security -gdwarf-4 -fno-debug-types-section -fvar-tracking-assignments -g2 -Wp,-D_FORTIFY_SOURCE=2 -fno-strict-aliasing -std=gnu++98 -fstack-protector-strong --param=ssp-buffer-size=4 -fPIC -march=x86-64 -gdwarf-4 -fno-debug-types-section -fvar-tracking-assignments -g2 -c table/block_builder.cc -o table/block_builder.o make[1]: Leaving directory '/tmp/B.28JnVz/BUILD/primecoin-0.1.2-hp14/src/leveldb' x86_64-pld-linux-g++ -c -pipe -fstack-protector-all -D_FORTIFY_SOURCE=2 -O2 -O2 -fwrapv -pipe -Wformat -Werror=format-security -gdwarf-4 -fno-debug-types-section -fvar-tracking-assignments -g2 -Wp,-D_FORTIFY_SOURCE=2 -fno-strict-aliasing -std=gnu++98 -fstack-protector-strong --param=ssp-buffer-size=4 -fPIC -march=x86-64 -gdwarf-4 -fno-debug-types-section -fvar-tracking-assignments -g2 -D_REENTRANT -fdiagnostics-show-option -Wall -Wextra -Wformat -Wformat-security -Wno-unused-parameter -Wstack-protector -DQT_GUI -DBOOST_THREAD_USE_LIB -DBOOST_SPIRIT_THREADSAFE -DUSE_QRCODE -DUSE_UPNP=1 -DSTATICLIB -DUSE_DBUS -DUSE_IPV6=1 -DHAVE_BUILD_INFO -DLINUX -D_FILE_OFFSET_BITS=64 -DQT_NO_DEBUG -DQT_DBUS_LIB -DQT_GUI_LIB -DQT_NETWORK_LIB -DQT_CORE_LIB -I/usr/share/qt4/mkspecs/linux-g++ -I/usr/include/qt4/QtCore -I/usr/include/qt4/QtNetwork -I/usr/include/qt4/QtGui -I/usr/include/qt4/QtDBus -I/usr/include/qt4 -Isrc -Isrc/json -Isrc/qt -Isrc/leveldb/include -Isrc/leveldb/helpers -Ibuild -Ibuild -o build/aboutdialog.o src/qt/aboutdialog.cpp make[1]: Entering directory '/tmp/B.28JnVz/BUILD/primecoin-0.1.2-hp14/src/leveldb' x86_64-pld-linux-g++ -I. -I./include -pthread -DOS_LINUX -DLEVELDB_PLATFORM_POSIX -pipe -fstack-protector-all -D_FORTIFY_SOURCE=2 -O2 -O2 -fwrapv -pipe -Wformat -Werror=format-security -gdwarf-4 -fno-debug-types-section -fvar-tracking-assignments -g2 -Wp,-D_FORTIFY_SOURCE=2 -fno-strict-aliasing -std=gnu++98 -fstack-protector-strong --param=ssp-buffer-size=4 -fPIC -march=x86-64 -gdwarf-4 -fno-debug-types-section -fvar-tracking-assignments -g2 -c table/filter_block.cc -o table/filter_block.o make[1]: Leaving directory '/tmp/B.28JnVz/BUILD/primecoin-0.1.2-hp14/src/leveldb' make[1]: Entering directory '/tmp/B.28JnVz/BUILD/primecoin-0.1.2-hp14/src/leveldb' x86_64-pld-linux-g++ -I. -I./include -pthread -DOS_LINUX -DLEVELDB_PLATFORM_POSIX -pipe -fstack-protector-all -D_FORTIFY_SOURCE=2 -O2 -O2 -fwrapv -pipe -Wformat -Werror=format-security -gdwarf-4 -fno-debug-types-section -fvar-tracking-assignments -g2 -Wp,-D_FORTIFY_SOURCE=2 -fno-strict-aliasing -std=gnu++98 -fstack-protector-strong --param=ssp-buffer-size=4 -fPIC -march=x86-64 -gdwarf-4 -fno-debug-types-section -fvar-tracking-assignments -g2 -c table/format.cc -o table/format.o make[1]: Leaving directory '/tmp/B.28JnVz/BUILD/primecoin-0.1.2-hp14/src/leveldb' x86_64-pld-linux-g++ -c -pipe -fstack-protector-all -D_FORTIFY_SOURCE=2 -O2 -O2 -fwrapv -pipe -Wformat -Werror=format-security -gdwarf-4 -fno-debug-types-section -fvar-tracking-assignments -g2 -Wp,-D_FORTIFY_SOURCE=2 -fno-strict-aliasing -std=gnu++98 -fstack-protector-strong --param=ssp-buffer-size=4 -fPIC -march=x86-64 -gdwarf-4 -fno-debug-types-section -fvar-tracking-assignments -g2 -D_REENTRANT -fdiagnostics-show-option -Wall -Wextra -Wformat -Wformat-security -Wno-unused-parameter -Wstack-protector -DQT_GUI -DBOOST_THREAD_USE_LIB -DBOOST_SPIRIT_THREADSAFE -DUSE_QRCODE -DUSE_UPNP=1 -DSTATICLIB -DUSE_DBUS -DUSE_IPV6=1 -DHAVE_BUILD_INFO -DLINUX -D_FILE_OFFSET_BITS=64 -DQT_NO_DEBUG -DQT_DBUS_LIB -DQT_GUI_LIB -DQT_NETWORK_LIB -DQT_CORE_LIB -I/usr/share/qt4/mkspecs/linux-g++ -I/usr/include/qt4/QtCore -I/usr/include/qt4/QtNetwork -I/usr/include/qt4/QtGui -I/usr/include/qt4/QtDBus -I/usr/include/qt4 -Isrc -Isrc/json -Isrc/qt -Isrc/leveldb/include -Isrc/leveldb/helpers -Ibuild -Ibuild -o build/editaddressdialog.o src/qt/editaddressdialog.cpp make[1]: Entering directory '/tmp/B.28JnVz/BUILD/primecoin-0.1.2-hp14/src/leveldb' x86_64-pld-linux-g++ -I. -I./include -pthread -DOS_LINUX -DLEVELDB_PLATFORM_POSIX -pipe -fstack-protector-all -D_FORTIFY_SOURCE=2 -O2 -O2 -fwrapv -pipe -Wformat -Werror=format-security -gdwarf-4 -fno-debug-types-section -fvar-tracking-assignments -g2 -Wp,-D_FORTIFY_SOURCE=2 -fno-strict-aliasing -std=gnu++98 -fstack-protector-strong --param=ssp-buffer-size=4 -fPIC -march=x86-64 -gdwarf-4 -fno-debug-types-section -fvar-tracking-assignments -g2 -c table/iterator.cc -o table/iterator.o make[1]: Leaving directory '/tmp/B.28JnVz/BUILD/primecoin-0.1.2-hp14/src/leveldb' x86_64-pld-linux-g++ -c -pipe -fstack-protector-all -D_FORTIFY_SOURCE=2 -O2 -O2 -fwrapv -pipe -Wformat -Werror=format-security -gdwarf-4 -fno-debug-types-section -fvar-tracking-assignments -g2 -Wp,-D_FORTIFY_SOURCE=2 -fno-strict-aliasing -std=gnu++98 -fstack-protector-strong --param=ssp-buffer-size=4 -fPIC -march=x86-64 -gdwarf-4 -fno-debug-types-section -fvar-tracking-assignments -g2 -D_REENTRANT -fdiagnostics-show-option -Wall -Wextra -Wformat -Wformat-security -Wno-unused-parameter -Wstack-protector -DQT_GUI -DBOOST_THREAD_USE_LIB -DBOOST_SPIRIT_THREADSAFE -DUSE_QRCODE -DUSE_UPNP=1 -DSTATICLIB -DUSE_DBUS -DUSE_IPV6=1 -DHAVE_BUILD_INFO -DLINUX -D_FILE_OFFSET_BITS=64 -DQT_NO_DEBUG -DQT_DBUS_LIB -DQT_GUI_LIB -DQT_NETWORK_LIB -DQT_CORE_LIB -I/usr/share/qt4/mkspecs/linux-g++ -I/usr/include/qt4/QtCore -I/usr/include/qt4/QtNetwork -I/usr/include/qt4/QtGui -I/usr/include/qt4/QtDBus -I/usr/include/qt4 -Isrc -Isrc/json -Isrc/qt -Isrc/leveldb/include -Isrc/leveldb/helpers -Ibuild -Ibuild -o build/optionsdialog.o src/qt/optionsdialog.cpp make[1]: Entering directory '/tmp/B.28JnVz/BUILD/primecoin-0.1.2-hp14/src/leveldb' x86_64-pld-linux-g++ -I. -I./include -pthread -DOS_LINUX -DLEVELDB_PLATFORM_POSIX -pipe -fstack-protector-all -D_FORTIFY_SOURCE=2 -O2 -O2 -fwrapv -pipe -Wformat -Werror=format-security -gdwarf-4 -fno-debug-types-section -fvar-tracking-assignments -g2 -Wp,-D_FORTIFY_SOURCE=2 -fno-strict-aliasing -std=gnu++98 -fstack-protector-strong --param=ssp-buffer-size=4 -fPIC -march=x86-64 -gdwarf-4 -fno-debug-types-section -fvar-tracking-assignments -g2 -c table/merger.cc -o table/merger.o make[1]: Leaving directory '/tmp/B.28JnVz/BUILD/primecoin-0.1.2-hp14/src/leveldb' x86_64-pld-linux-g++ -c -pipe -fstack-protector-all -D_FORTIFY_SOURCE=2 -O2 -O2 -fwrapv -pipe -Wformat -Werror=format-security -gdwarf-4 -fno-debug-types-section -fvar-tracking-assignments -g2 -Wp,-D_FORTIFY_SOURCE=2 -fno-strict-aliasing -std=gnu++98 -fstack-protector-strong --param=ssp-buffer-size=4 -fPIC -march=x86-64 -gdwarf-4 -fno-debug-types-section -fvar-tracking-assignments -g2 -D_REENTRANT -fdiagnostics-show-option -Wall -Wextra -Wformat -Wformat-security -Wno-unused-parameter -Wstack-protector -DQT_GUI -DBOOST_THREAD_USE_LIB -DBOOST_SPIRIT_THREADSAFE -DUSE_QRCODE -DUSE_UPNP=1 -DSTATICLIB -DUSE_DBUS -DUSE_IPV6=1 -DHAVE_BUILD_INFO -DLINUX -D_FILE_OFFSET_BITS=64 -DQT_NO_DEBUG -DQT_DBUS_LIB -DQT_GUI_LIB -DQT_NETWORK_LIB -DQT_CORE_LIB -I/usr/share/qt4/mkspecs/linux-g++ -I/usr/include/qt4/QtCore -I/usr/include/qt4/QtNetwork -I/usr/include/qt4/QtGui -I/usr/include/qt4/QtDBus -I/usr/include/qt4 -Isrc -Isrc/json -Isrc/qt -Isrc/leveldb/include -Isrc/leveldb/helpers -Ibuild -Ibuild -o build/bitcoinaddressvalidator.o src/qt/bitcoinaddressvalidator.cpp x86_64-pld-linux-g++ -c -pipe -fstack-protector-all -D_FORTIFY_SOURCE=2 -O2 -O2 -fwrapv -pipe -Wformat -Werror=format-security -gdwarf-4 -fno-debug-types-section -fvar-tracking-assignments -g2 -Wp,-D_FORTIFY_SOURCE=2 -fno-strict-aliasing -std=gnu++98 -fstack-protector-strong --param=ssp-buffer-size=4 -fPIC -march=x86-64 -gdwarf-4 -fno-debug-types-section -fvar-tracking-assignments -g2 -D_REENTRANT -fdiagnostics-show-option -Wall -Wextra -Wformat -Wformat-security -Wno-unused-parameter -Wstack-protector -DQT_GUI -DBOOST_THREAD_USE_LIB -DBOOST_SPIRIT_THREADSAFE -DUSE_QRCODE -DUSE_UPNP=1 -DSTATICLIB -DUSE_DBUS -DUSE_IPV6=1 -DHAVE_BUILD_INFO -DLINUX -D_FILE_OFFSET_BITS=64 -DQT_NO_DEBUG -DQT_DBUS_LIB -DQT_GUI_LIB -DQT_NETWORK_LIB -DQT_CORE_LIB -I/usr/share/qt4/mkspecs/linux-g++ -I/usr/include/qt4/QtCore -I/usr/include/qt4/QtNetwork -I/usr/include/qt4/QtGui -I/usr/include/qt4/QtDBus -I/usr/include/qt4 -Isrc -Isrc/json -Isrc/qt -Isrc/leveldb/include -Isrc/leveldb/helpers -Ibuild -Ibuild -o build/version.o src/version.cpp make[1]: Entering directory '/tmp/B.28JnVz/BUILD/primecoin-0.1.2-hp14/src/leveldb' x86_64-pld-linux-g++ -I. -I./include -pthread -DOS_LINUX -DLEVELDB_PLATFORM_POSIX -pipe -fstack-protector-all -D_FORTIFY_SOURCE=2 -O2 -O2 -fwrapv -pipe -Wformat -Werror=format-security -gdwarf-4 -fno-debug-types-section -fvar-tracking-assignments -g2 -Wp,-D_FORTIFY_SOURCE=2 -fno-strict-aliasing -std=gnu++98 -fstack-protector-strong --param=ssp-buffer-size=4 -fPIC -march=x86-64 -gdwarf-4 -fno-debug-types-section -fvar-tracking-assignments -g2 -c table/table.cc -o table/table.o make[1]: Leaving directory '/tmp/B.28JnVz/BUILD/primecoin-0.1.2-hp14/src/leveldb' make[1]: Entering directory '/tmp/B.28JnVz/BUILD/primecoin-0.1.2-hp14/src/leveldb' x86_64-pld-linux-g++ -I. -I./include -pthread -DOS_LINUX -DLEVELDB_PLATFORM_POSIX -pipe -fstack-protector-all -D_FORTIFY_SOURCE=2 -O2 -O2 -fwrapv -pipe -Wformat -Werror=format-security -gdwarf-4 -fno-debug-types-section -fvar-tracking-assignments -g2 -Wp,-D_FORTIFY_SOURCE=2 -fno-strict-aliasing -std=gnu++98 -fstack-protector-strong --param=ssp-buffer-size=4 -fPIC -march=x86-64 -gdwarf-4 -fno-debug-types-section -fvar-tracking-assignments -g2 -c table/table_builder.cc -o table/table_builder.o make[1]: Leaving directory '/tmp/B.28JnVz/BUILD/primecoin-0.1.2-hp14/src/leveldb' make[1]: Entering directory '/tmp/B.28JnVz/BUILD/primecoin-0.1.2-hp14/src/leveldb' x86_64-pld-linux-g++ -I. -I./include -pthread -DOS_LINUX -DLEVELDB_PLATFORM_POSIX -pipe -fstack-protector-all -D_FORTIFY_SOURCE=2 -O2 -O2 -fwrapv -pipe -Wformat -Werror=format-security -gdwarf-4 -fno-debug-types-section -fvar-tracking-assignments -g2 -Wp,-D_FORTIFY_SOURCE=2 -fno-strict-aliasing -std=gnu++98 -fstack-protector-strong --param=ssp-buffer-size=4 -fPIC -march=x86-64 -gdwarf-4 -fno-debug-types-section -fvar-tracking-assignments -g2 -c table/two_level_iterator.cc -o table/two_level_iterator.o make[1]: Leaving directory '/tmp/B.28JnVz/BUILD/primecoin-0.1.2-hp14/src/leveldb' make[1]: Entering directory '/tmp/B.28JnVz/BUILD/primecoin-0.1.2-hp14/src/leveldb' x86_64-pld-linux-g++ -I. -I./include -pthread -DOS_LINUX -DLEVELDB_PLATFORM_POSIX -pipe -fstack-protector-all -D_FORTIFY_SOURCE=2 -O2 -O2 -fwrapv -pipe -Wformat -Werror=format-security -gdwarf-4 -fno-debug-types-section -fvar-tracking-assignments -g2 -Wp,-D_FORTIFY_SOURCE=2 -fno-strict-aliasing -std=gnu++98 -fstack-protector-strong --param=ssp-buffer-size=4 -fPIC -march=x86-64 -gdwarf-4 -fno-debug-types-section -fvar-tracking-assignments -g2 -c util/arena.cc -o util/arena.o make[1]: Leaving directory '/tmp/B.28JnVz/BUILD/primecoin-0.1.2-hp14/src/leveldb' make[1]: Entering directory '/tmp/B.28JnVz/BUILD/primecoin-0.1.2-hp14/src/leveldb' x86_64-pld-linux-g++ -I. -I./include -pthread -DOS_LINUX -DLEVELDB_PLATFORM_POSIX -pipe -fstack-protector-all -D_FORTIFY_SOURCE=2 -O2 -O2 -fwrapv -pipe -Wformat -Werror=format-security -gdwarf-4 -fno-debug-types-section -fvar-tracking-assignments -g2 -Wp,-D_FORTIFY_SOURCE=2 -fno-strict-aliasing -std=gnu++98 -fstack-protector-strong --param=ssp-buffer-size=4 -fPIC -march=x86-64 -gdwarf-4 -fno-debug-types-section -fvar-tracking-assignments -g2 -c util/bloom.cc -o util/bloom.o make[1]: Leaving directory '/tmp/B.28JnVz/BUILD/primecoin-0.1.2-hp14/src/leveldb' make[1]: Entering directory '/tmp/B.28JnVz/BUILD/primecoin-0.1.2-hp14/src/leveldb' x86_64-pld-linux-g++ -I. -I./include -pthread -DOS_LINUX -DLEVELDB_PLATFORM_POSIX -pipe -fstack-protector-all -D_FORTIFY_SOURCE=2 -O2 -O2 -fwrapv -pipe -Wformat -Werror=format-security -gdwarf-4 -fno-debug-types-section -fvar-tracking-assignments -g2 -Wp,-D_FORTIFY_SOURCE=2 -fno-strict-aliasing -std=gnu++98 -fstack-protector-strong --param=ssp-buffer-size=4 -fPIC -march=x86-64 -gdwarf-4 -fno-debug-types-section -fvar-tracking-assignments -g2 -c util/cache.cc -o util/cache.o make[1]: Leaving directory '/tmp/B.28JnVz/BUILD/primecoin-0.1.2-hp14/src/leveldb' x86_64-pld-linux-g++ -c -pipe -fstack-protector-all -D_FORTIFY_SOURCE=2 -O2 -O2 -fwrapv -pipe -Wformat -Werror=format-security -gdwarf-4 -fno-debug-types-section -fvar-tracking-assignments -g2 -Wp,-D_FORTIFY_SOURCE=2 -fno-strict-aliasing -std=gnu++98 -fstack-protector-strong --param=ssp-buffer-size=4 -fPIC -march=x86-64 -gdwarf-4 -fno-debug-types-section -fvar-tracking-assignments -g2 -D_REENTRANT -fdiagnostics-show-option -Wall -Wextra -Wformat -Wformat-security -Wno-unused-parameter -Wstack-protector -DQT_GUI -DBOOST_THREAD_USE_LIB -DBOOST_SPIRIT_THREADSAFE -DUSE_QRCODE -DUSE_UPNP=1 -DSTATICLIB -DUSE_DBUS -DUSE_IPV6=1 -DHAVE_BUILD_INFO -DLINUX -D_FILE_OFFSET_BITS=64 -DQT_NO_DEBUG -DQT_DBUS_LIB -DQT_GUI_LIB -DQT_NETWORK_LIB -DQT_CORE_LIB -I/usr/share/qt4/mkspecs/linux-g++ -I/usr/include/qt4/QtCore -I/usr/include/qt4/QtNetwork -I/usr/include/qt4/QtGui -I/usr/include/qt4/QtDBus -I/usr/include/qt4 -Isrc -Isrc/json -Isrc/qt -Isrc/leveldb/include -Isrc/leveldb/helpers -Ibuild -Ibuild -o build/sendcoinsdialog.o src/qt/sendcoinsdialog.cpp In file included from src/bignum.h:12:0, from src/base58.h:21, from src/qt/sendcoinsdialog.cpp:11: src/util.h:251:22: warning: C++11 requires a space between string literal and macro [-Wc++11-compat] return strprintf("%"PRI64d, n); ^ make[1]: Entering directory '/tmp/B.28JnVz/BUILD/primecoin-0.1.2-hp14/src/leveldb' x86_64-pld-linux-g++ -I. -I./include -pthread -DOS_LINUX -DLEVELDB_PLATFORM_POSIX -pipe -fstack-protector-all -D_FORTIFY_SOURCE=2 -O2 -O2 -fwrapv -pipe -Wformat -Werror=format-security -gdwarf-4 -fno-debug-types-section -fvar-tracking-assignments -g2 -Wp,-D_FORTIFY_SOURCE=2 -fno-strict-aliasing -std=gnu++98 -fstack-protector-strong --param=ssp-buffer-size=4 -fPIC -march=x86-64 -gdwarf-4 -fno-debug-types-section -fvar-tracking-assignments -g2 -c util/coding.cc -o util/coding.o make[1]: Leaving directory '/tmp/B.28JnVz/BUILD/primecoin-0.1.2-hp14/src/leveldb' make[1]: Entering directory '/tmp/B.28JnVz/BUILD/primecoin-0.1.2-hp14/src/leveldb' x86_64-pld-linux-g++ -I. -I./include -pthread -DOS_LINUX -DLEVELDB_PLATFORM_POSIX -pipe -fstack-protector-all -D_FORTIFY_SOURCE=2 -O2 -O2 -fwrapv -pipe -Wformat -Werror=format-security -gdwarf-4 -fno-debug-types-section -fvar-tracking-assignments -g2 -Wp,-D_FORTIFY_SOURCE=2 -fno-strict-aliasing -std=gnu++98 -fstack-protector-strong --param=ssp-buffer-size=4 -fPIC -march=x86-64 -gdwarf-4 -fno-debug-types-section -fvar-tracking-assignments -g2 -c util/comparator.cc -o util/comparator.o make[1]: Leaving directory '/tmp/B.28JnVz/BUILD/primecoin-0.1.2-hp14/src/leveldb' make[1]: Entering directory '/tmp/B.28JnVz/BUILD/primecoin-0.1.2-hp14/src/leveldb' x86_64-pld-linux-g++ -I. -I./include -pthread -DOS_LINUX -DLEVELDB_PLATFORM_POSIX -pipe -fstack-protector-all -D_FORTIFY_SOURCE=2 -O2 -O2 -fwrapv -pipe -Wformat -Werror=format-security -gdwarf-4 -fno-debug-types-section -fvar-tracking-assignments -g2 -Wp,-D_FORTIFY_SOURCE=2 -fno-strict-aliasing -std=gnu++98 -fstack-protector-strong --param=ssp-buffer-size=4 -fPIC -march=x86-64 -gdwarf-4 -fno-debug-types-section -fvar-tracking-assignments -g2 -c util/crc32c.cc -o util/crc32c.o make[1]: Leaving directory '/tmp/B.28JnVz/BUILD/primecoin-0.1.2-hp14/src/leveldb' make[1]: Entering directory '/tmp/B.28JnVz/BUILD/primecoin-0.1.2-hp14/src/leveldb' x86_64-pld-linux-g++ -I. -I./include -pthread -DOS_LINUX -DLEVELDB_PLATFORM_POSIX -pipe -fstack-protector-all -D_FORTIFY_SOURCE=2 -O2 -O2 -fwrapv -pipe -Wformat -Werror=format-security -gdwarf-4 -fno-debug-types-section -fvar-tracking-assignments -g2 -Wp,-D_FORTIFY_SOURCE=2 -fno-strict-aliasing -std=gnu++98 -fstack-protector-strong --param=ssp-buffer-size=4 -fPIC -march=x86-64 -gdwarf-4 -fno-debug-types-section -fvar-tracking-assignments -g2 -c util/env.cc -o util/env.o make[1]: Leaving directory '/tmp/B.28JnVz/BUILD/primecoin-0.1.2-hp14/src/leveldb' x86_64-pld-linux-g++ -c -pipe -fstack-protector-all -D_FORTIFY_SOURCE=2 -O2 -O2 -fwrapv -pipe -Wformat -Werror=format-security -gdwarf-4 -fno-debug-types-section -fvar-tracking-assignments -g2 -Wp,-D_FORTIFY_SOURCE=2 -fno-strict-aliasing -std=gnu++98 -fstack-protector-strong --param=ssp-buffer-size=4 -fPIC -march=x86-64 -gdwarf-4 -fno-debug-types-section -fvar-tracking-assignments -g2 -D_REENTRANT -fdiagnostics-show-option -Wall -Wextra -Wformat -Wformat-security -Wno-unused-parameter -Wstack-protector -DQT_GUI -DBOOST_THREAD_USE_LIB -DBOOST_SPIRIT_THREADSAFE -DUSE_QRCODE -DUSE_UPNP=1 -DSTATICLIB -DUSE_DBUS -DUSE_IPV6=1 -DHAVE_BUILD_INFO -DLINUX -D_FILE_OFFSET_BITS=64 -DQT_NO_DEBUG -DQT_DBUS_LIB -DQT_GUI_LIB -DQT_NETWORK_LIB -DQT_CORE_LIB -I/usr/share/qt4/mkspecs/linux-g++ -I/usr/include/qt4/QtCore -I/usr/include/qt4/QtNetwork -I/usr/include/qt4/QtGui -I/usr/include/qt4/QtDBus -I/usr/include/qt4 -Isrc -Isrc/json -Isrc/qt -Isrc/leveldb/include -Isrc/leveldb/helpers -Ibuild -Ibuild -o build/sync.o src/sync.cpp In file included from src/sync.cpp:6:0: src/util.h:251:22: warning: C++11 requires a space between string literal and macro [-Wc++11-compat] return strprintf("%"PRI64d, n); ^ make[1]: Entering directory '/tmp/B.28JnVz/BUILD/primecoin-0.1.2-hp14/src/leveldb' x86_64-pld-linux-g++ -I. -I./include -pthread -DOS_LINUX -DLEVELDB_PLATFORM_POSIX -pipe -fstack-protector-all -D_FORTIFY_SOURCE=2 -O2 -O2 -fwrapv -pipe -Wformat -Werror=format-security -gdwarf-4 -fno-debug-types-section -fvar-tracking-assignments -g2 -Wp,-D_FORTIFY_SOURCE=2 -fno-strict-aliasing -std=gnu++98 -fstack-protector-strong --param=ssp-buffer-size=4 -fPIC -march=x86-64 -gdwarf-4 -fno-debug-types-section -fvar-tracking-assignments -g2 -c util/env_posix.cc -o util/env_posix.o make[1]: Leaving directory '/tmp/B.28JnVz/BUILD/primecoin-0.1.2-hp14/src/leveldb' make[1]: Entering directory '/tmp/B.28JnVz/BUILD/primecoin-0.1.2-hp14/src/leveldb' x86_64-pld-linux-g++ -I. -I./include -pthread -DOS_LINUX -DLEVELDB_PLATFORM_POSIX -pipe -fstack-protector-all -D_FORTIFY_SOURCE=2 -O2 -O2 -fwrapv -pipe -Wformat -Werror=format-security -gdwarf-4 -fno-debug-types-section -fvar-tracking-assignments -g2 -Wp,-D_FORTIFY_SOURCE=2 -fno-strict-aliasing -std=gnu++98 -fstack-protector-strong --param=ssp-buffer-size=4 -fPIC -march=x86-64 -gdwarf-4 -fno-debug-types-section -fvar-tracking-assignments -g2 -c util/env_win.cc -o util/env_win.o make[1]: Leaving directory '/tmp/B.28JnVz/BUILD/primecoin-0.1.2-hp14/src/leveldb' make[1]: Entering directory '/tmp/B.28JnVz/BUILD/primecoin-0.1.2-hp14/src/leveldb' x86_64-pld-linux-g++ -I. -I./include -pthread -DOS_LINUX -DLEVELDB_PLATFORM_POSIX -pipe -fstack-protector-all -D_FORTIFY_SOURCE=2 -O2 -O2 -fwrapv -pipe -Wformat -Werror=format-security -gdwarf-4 -fno-debug-types-section -fvar-tracking-assignments -g2 -Wp,-D_FORTIFY_SOURCE=2 -fno-strict-aliasing -std=gnu++98 -fstack-protector-strong --param=ssp-buffer-size=4 -fPIC -march=x86-64 -gdwarf-4 -fno-debug-types-section -fvar-tracking-assignments -g2 -c util/filter_policy.cc -o util/filter_policy.o make[1]: Leaving directory '/tmp/B.28JnVz/BUILD/primecoin-0.1.2-hp14/src/leveldb' make[1]: Entering directory '/tmp/B.28JnVz/BUILD/primecoin-0.1.2-hp14/src/leveldb' x86_64-pld-linux-g++ -I. -I./include -pthread -DOS_LINUX -DLEVELDB_PLATFORM_POSIX -pipe -fstack-protector-all -D_FORTIFY_SOURCE=2 -O2 -O2 -fwrapv -pipe -Wformat -Werror=format-security -gdwarf-4 -fno-debug-types-section -fvar-tracking-assignments -g2 -Wp,-D_FORTIFY_SOURCE=2 -fno-strict-aliasing -std=gnu++98 -fstack-protector-strong --param=ssp-buffer-size=4 -fPIC -march=x86-64 -gdwarf-4 -fno-debug-types-section -fvar-tracking-assignments -g2 -c util/hash.cc -o util/hash.o make[1]: Leaving directory '/tmp/B.28JnVz/BUILD/primecoin-0.1.2-hp14/src/leveldb' make[1]: Entering directory '/tmp/B.28JnVz/BUILD/primecoin-0.1.2-hp14/src/leveldb' x86_64-pld-linux-g++ -I. -I./include -pthread -DOS_LINUX -DLEVELDB_PLATFORM_POSIX -pipe -fstack-protector-all -D_FORTIFY_SOURCE=2 -O2 -O2 -fwrapv -pipe -Wformat -Werror=format-security -gdwarf-4 -fno-debug-types-section -fvar-tracking-assignments -g2 -Wp,-D_FORTIFY_SOURCE=2 -fno-strict-aliasing -std=gnu++98 -fstack-protector-strong --param=ssp-buffer-size=4 -fPIC -march=x86-64 -gdwarf-4 -fno-debug-types-section -fvar-tracking-assignments -g2 -c util/histogram.cc -o util/histogram.o make[1]: Leaving directory '/tmp/B.28JnVz/BUILD/primecoin-0.1.2-hp14/src/leveldb' make[1]: Entering directory '/tmp/B.28JnVz/BUILD/primecoin-0.1.2-hp14/src/leveldb' x86_64-pld-linux-g++ -I. -I./include -pthread -DOS_LINUX -DLEVELDB_PLATFORM_POSIX -pipe -fstack-protector-all -D_FORTIFY_SOURCE=2 -O2 -O2 -fwrapv -pipe -Wformat -Werror=format-security -gdwarf-4 -fno-debug-types-section -fvar-tracking-assignments -g2 -Wp,-D_FORTIFY_SOURCE=2 -fno-strict-aliasing -std=gnu++98 -fstack-protector-strong --param=ssp-buffer-size=4 -fPIC -march=x86-64 -gdwarf-4 -fno-debug-types-section -fvar-tracking-assignments -g2 -c util/logging.cc -o util/logging.o make[1]: Leaving directory '/tmp/B.28JnVz/BUILD/primecoin-0.1.2-hp14/src/leveldb' make[1]: Entering directory '/tmp/B.28JnVz/BUILD/primecoin-0.1.2-hp14/src/leveldb' x86_64-pld-linux-g++ -I. -I./include -pthread -DOS_LINUX -DLEVELDB_PLATFORM_POSIX -pipe -fstack-protector-all -D_FORTIFY_SOURCE=2 -O2 -O2 -fwrapv -pipe -Wformat -Werror=format-security -gdwarf-4 -fno-debug-types-section -fvar-tracking-assignments -g2 -Wp,-D_FORTIFY_SOURCE=2 -fno-strict-aliasing -std=gnu++98 -fstack-protector-strong --param=ssp-buffer-size=4 -fPIC -march=x86-64 -gdwarf-4 -fno-debug-types-section -fvar-tracking-assignments -g2 -c util/options.cc -o util/options.o make[1]: Leaving directory '/tmp/B.28JnVz/BUILD/primecoin-0.1.2-hp14/src/leveldb' make[1]: Entering directory '/tmp/B.28JnVz/BUILD/primecoin-0.1.2-hp14/src/leveldb' x86_64-pld-linux-g++ -I. -I./include -pthread -DOS_LINUX -DLEVELDB_PLATFORM_POSIX -pipe -fstack-protector-all -D_FORTIFY_SOURCE=2 -O2 -O2 -fwrapv -pipe -Wformat -Werror=format-security -gdwarf-4 -fno-debug-types-section -fvar-tracking-assignments -g2 -Wp,-D_FORTIFY_SOURCE=2 -fno-strict-aliasing -std=gnu++98 -fstack-protector-strong --param=ssp-buffer-size=4 -fPIC -march=x86-64 -gdwarf-4 -fno-debug-types-section -fvar-tracking-assignments -g2 -c util/status.cc -o util/status.o make[1]: Leaving directory '/tmp/B.28JnVz/BUILD/primecoin-0.1.2-hp14/src/leveldb' make[1]: Entering directory '/tmp/B.28JnVz/BUILD/primecoin-0.1.2-hp14/src/leveldb' x86_64-pld-linux-g++ -I. -I./include -pthread -DOS_LINUX -DLEVELDB_PLATFORM_POSIX -pipe -fstack-protector-all -D_FORTIFY_SOURCE=2 -O2 -O2 -fwrapv -pipe -Wformat -Werror=format-security -gdwarf-4 -fno-debug-types-section -fvar-tracking-assignments -g2 -Wp,-D_FORTIFY_SOURCE=2 -fno-strict-aliasing -std=gnu++98 -fstack-protector-strong --param=ssp-buffer-size=4 -fPIC -march=x86-64 -gdwarf-4 -fno-debug-types-section -fvar-tracking-assignments -g2 -c port/port_posix.cc -o port/port_posix.o make[1]: Leaving directory '/tmp/B.28JnVz/BUILD/primecoin-0.1.2-hp14/src/leveldb' x86_64-pld-linux-g++ -c -pipe -fstack-protector-all -D_FORTIFY_SOURCE=2 -O2 -O2 -fwrapv -pipe -Wformat -Werror=format-security -gdwarf-4 -fno-debug-types-section -fvar-tracking-assignments -g2 -Wp,-D_FORTIFY_SOURCE=2 -fno-strict-aliasing -std=gnu++98 -fstack-protector-strong --param=ssp-buffer-size=4 -fPIC -march=x86-64 -gdwarf-4 -fno-debug-types-section -fvar-tracking-assignments -g2 -D_REENTRANT -fdiagnostics-show-option -Wall -Wextra -Wformat -Wformat-security -Wno-unused-parameter -Wstack-protector -DQT_GUI -DBOOST_THREAD_USE_LIB -DBOOST_SPIRIT_THREADSAFE -DUSE_QRCODE -DUSE_UPNP=1 -DSTATICLIB -DUSE_DBUS -DUSE_IPV6=1 -DHAVE_BUILD_INFO -DLINUX -D_FILE_OFFSET_BITS=64 -DQT_NO_DEBUG -DQT_DBUS_LIB -DQT_GUI_LIB -DQT_NETWORK_LIB -DQT_CORE_LIB -I/usr/share/qt4/mkspecs/linux-g++ -I/usr/include/qt4/QtCore -I/usr/include/qt4/QtNetwork -I/usr/include/qt4/QtGui -I/usr/include/qt4/QtDBus -I/usr/include/qt4 -Isrc -Isrc/json -Isrc/qt -Isrc/leveldb/include -Isrc/leveldb/helpers -Ibuild -Ibuild -o build/hash.o src/hash.cpp x86_64-pld-linux-g++ -c -pipe -fstack-protector-all -D_FORTIFY_SOURCE=2 -O2 -O2 -fwrapv -pipe -Wformat -Werror=format-security -gdwarf-4 -fno-debug-types-section -fvar-tracking-assignments -g2 -Wp,-D_FORTIFY_SOURCE=2 -fno-strict-aliasing -std=gnu++98 -fstack-protector-strong --param=ssp-buffer-size=4 -fPIC -march=x86-64 -gdwarf-4 -fno-debug-types-section -fvar-tracking-assignments -g2 -D_REENTRANT -fdiagnostics-show-option -Wall -Wextra -Wformat -Wformat-security -Wno-unused-parameter -Wstack-protector -DQT_GUI -DBOOST_THREAD_USE_LIB -DBOOST_SPIRIT_THREADSAFE -DUSE_QRCODE -DUSE_UPNP=1 -DSTATICLIB -DUSE_DBUS -DUSE_IPV6=1 -DHAVE_BUILD_INFO -DLINUX -D_FILE_OFFSET_BITS=64 -DQT_NO_DEBUG -DQT_DBUS_LIB -DQT_GUI_LIB -DQT_NETWORK_LIB -DQT_CORE_LIB -I/usr/share/qt4/mkspecs/linux-g++ -I/usr/include/qt4/QtCore -I/usr/include/qt4/QtNetwork -I/usr/include/qt4/QtGui -I/usr/include/qt4/QtDBus -I/usr/include/qt4 -Isrc -Isrc/json -Isrc/qt -Isrc/leveldb/include -Isrc/leveldb/helpers -Ibuild -Ibuild -o build/signverifymessagedialog.o src/qt/signverifymessagedialog.cpp In file included from src/bignum.h:12:0, from src/base58.h:21, from src/qt/signverifymessagedialog.cpp:5: src/util.h:251:22: warning: C++11 requires a space between string literal and macro [-Wc++11-compat] return strprintf("%"PRI64d, n); ^ In file included from src/main.h:12:0, from src/wallet.h:13, from src/init.h:8, from src/qt/signverifymessagedialog.cpp:7: src/net.h:368:20: warning: C++11 requires a space between string literal and macro [-Wc++11-compat] printf("askfor %s %"PRI64d" (%s)\n", inv.ToString().c_str(), nRequestTime, DateTimeStrFormat("%H:%M:%S", nRequestTime/1000000).c_str()); ^ In file included from src/wallet.h:13:0, from src/init.h:8, from src/qt/signverifymessagedialog.cpp:7: src/main.h:458:26: warning: C++11 requires a space between string literal and macro [-Wc++11-compat] return strprintf("CTxOut(nValue=%"PRI64d".%08"PRI64d", scriptPubKey=%s)", nValue / COIN, nValue % COIN, scriptPubKey.ToString().substr(0,30).c_str()); ^ src/main.h:458:49: warning: C++11 requires a space between string literal and macro [-Wc++11-compat] return strprintf("CTxOut(nValue=%"PRI64d".%08"PRI64d", scriptPubKey=%s)", nValue / COIN, nValue % COIN, scriptPubKey.ToString().substr(0,30).c_str()); ^ src/main.h:651:26: warning: C++11 requires a space between string literal and macro [-Wc++11-compat] str += strprintf("CTransaction(hash=%s, ver=%d, vin.size=%"PRIszu", vout.size=%"PRIszu", nLockTime=%u)\n", ^ src/main.h:651:74: warning: C++11 requires a space between string literal and macro [-Wc++11-compat] str += strprintf("CTransaction(hash=%s, ver=%d, vin.size=%"PRIszu", vout.size=%"PRIszu", nLockTime=%u)\n", ^ src/main.h:1508:16: warning: C++11 requires a space between string literal and macro [-Wc++11-compat] printf("CBlock(hash=%s, hashBlockHeader=%s, ver=%d, hashPrevBlock=%s, hashMerkleRoot=%s, nTime=%u, nBits=%08x, nNonce=%u, vtx=%"PRIszu")\n", ^ make[1]: Entering directory '/tmp/B.28JnVz/BUILD/primecoin-0.1.2-hp14/src/leveldb' x86_64-pld-linux-g++ -I. -I./include -pthread -DOS_LINUX -DLEVELDB_PLATFORM_POSIX -pipe -fstack-protector-all -D_FORTIFY_SOURCE=2 -O2 -O2 -fwrapv -pipe -Wformat -Werror=format-security -gdwarf-4 -fno-debug-types-section -fvar-tracking-assignments -g2 -Wp,-D_FORTIFY_SOURCE=2 -fno-strict-aliasing -std=gnu++98 -fstack-protector-strong --param=ssp-buffer-size=4 -fPIC -march=x86-64 -gdwarf-4 -fno-debug-types-section -fvar-tracking-assignments -g2 -c helpers/memenv/memenv.cc -o helpers/memenv/memenv.o make[1]: Leaving directory '/tmp/B.28JnVz/BUILD/primecoin-0.1.2-hp14/src/leveldb' make[1]: Entering directory '/tmp/B.28JnVz/BUILD/primecoin-0.1.2-hp14/src/leveldb' rm -f libleveldb.a ar -rs libleveldb.a db/builder.o db/c.o db/db_impl.o db/db_iter.o db/dbformat.o db/filename.o db/log_reader.o db/log_writer.o db/memtable.o db/repair.o db/table_cache.o db/version_edit.o db/version_set.o db/write_batch.o table/block.o table/block_builder.o table/filter_block.o table/format.o table/iterator.o table/merger.o table/table.o table/table_builder.o table/two_level_iterator.o util/arena.o util/bloom.o util/cache.o util/coding.o util/comparator.o util/crc32c.o util/env.o util/env_posix.o util/env_win.o util/filter_policy.o util/hash.o util/histogram.o util/logging.o util/options.o util/status.o port/port_posix.o ar: creating libleveldb.a make[1]: Leaving directory '/tmp/B.28JnVz/BUILD/primecoin-0.1.2-hp14/src/leveldb' make[1]: Entering directory '/tmp/B.28JnVz/BUILD/primecoin-0.1.2-hp14/src/leveldb' rm -f libmemenv.a ar -rs libmemenv.a helpers/memenv/memenv.o ar: creating libmemenv.a make[1]: Leaving directory '/tmp/B.28JnVz/BUILD/primecoin-0.1.2-hp14/src/leveldb' x86_64-pld-linux-g++ -c -pipe -fstack-protector-all -D_FORTIFY_SOURCE=2 -O2 -O2 -fwrapv -pipe -Wformat -Werror=format-security -gdwarf-4 -fno-debug-types-section -fvar-tracking-assignments -g2 -Wp,-D_FORTIFY_SOURCE=2 -fno-strict-aliasing -std=gnu++98 -fstack-protector-strong --param=ssp-buffer-size=4 -fPIC -march=x86-64 -gdwarf-4 -fno-debug-types-section -fvar-tracking-assignments -g2 -D_REENTRANT -fdiagnostics-show-option -Wall -Wextra -Wformat -Wformat-security -Wno-unused-parameter -Wstack-protector -DQT_GUI -DBOOST_THREAD_USE_LIB -DBOOST_SPIRIT_THREADSAFE -DUSE_QRCODE -DUSE_UPNP=1 -DSTATICLIB -DUSE_DBUS -DUSE_IPV6=1 -DHAVE_BUILD_INFO -DLINUX -D_FILE_OFFSET_BITS=64 -DQT_NO_DEBUG -DQT_DBUS_LIB -DQT_GUI_LIB -DQT_NETWORK_LIB -DQT_CORE_LIB -I/usr/share/qt4/mkspecs/linux-g++ -I/usr/include/qt4/QtCore -I/usr/include/qt4/QtNetwork -I/usr/include/qt4/QtGui -I/usr/include/qt4/QtDBus -I/usr/include/qt4 -Isrc -Isrc/json -Isrc/qt -Isrc/leveldb/include -Isrc/leveldb/helpers -Ibuild -Ibuild -o build/alert.o src/alert.cpp In file included from src/alert.h:13:0, from src/alert.cpp:11: src/util.h:251:22: warning: C++11 requires a space between string literal and macro [-Wc++11-compat] return strprintf("%"PRI64d, n); ^ In file included from src/alert.cpp:13:0: src/net.h:368:20: warning: C++11 requires a space between string literal and macro [-Wc++11-compat] printf("askfor %s %"PRI64d" (%s)\n", inv.ToString().c_str(), nRequestTime, DateTimeStrFormat("%H:%M:%S", nRequestTime/1000000).c_str()); ^ src/alert.cpp:54:9: warning: C++11 requires a space between string literal and macro [-Wc++11-compat] " nRelayUntil = %"PRI64d"\n" ^ src/alert.cpp:55:9: warning: C++11 requires a space between string literal and macro [-Wc++11-compat] " nExpiration = %"PRI64d"\n" ^ x86_64-pld-linux-g++ -c -pipe -fstack-protector-all -D_FORTIFY_SOURCE=2 -O2 -O2 -fwrapv -pipe -Wformat -Werror=format-security -gdwarf-4 -fno-debug-types-section -fvar-tracking-assignments -g2 -Wp,-D_FORTIFY_SOURCE=2 -fno-strict-aliasing -std=gnu++98 -fstack-protector-strong --param=ssp-buffer-size=4 -fPIC -march=x86-64 -gdwarf-4 -fno-debug-types-section -fvar-tracking-assignments -g2 -D_REENTRANT -fdiagnostics-show-option -Wall -Wextra -Wformat -Wformat-security -Wno-unused-parameter -Wstack-protector -DQT_GUI -DBOOST_THREAD_USE_LIB -DBOOST_SPIRIT_THREADSAFE -DUSE_QRCODE -DUSE_UPNP=1 -DSTATICLIB -DUSE_DBUS -DUSE_IPV6=1 -DHAVE_BUILD_INFO -DLINUX -D_FILE_OFFSET_BITS=64 -DQT_NO_DEBUG -DQT_DBUS_LIB -DQT_GUI_LIB -DQT_NETWORK_LIB -DQT_CORE_LIB -I/usr/share/qt4/mkspecs/linux-g++ -I/usr/include/qt4/QtCore -I/usr/include/qt4/QtNetwork -I/usr/include/qt4/QtGui -I/usr/include/qt4/QtDBus -I/usr/include/qt4 -Isrc -Isrc/json -Isrc/qt -Isrc/leveldb/include -Isrc/leveldb/helpers -Ibuild -Ibuild -o build/key.o src/key.cpp x86_64-pld-linux-g++ -c -pipe -fstack-protector-all -D_FORTIFY_SOURCE=2 -O2 -O2 -fwrapv -pipe -Wformat -Werror=format-security -gdwarf-4 -fno-debug-types-section -fvar-tracking-assignments -g2 -Wp,-D_FORTIFY_SOURCE=2 -fno-strict-aliasing -std=gnu++98 -fstack-protector-strong --param=ssp-buffer-size=4 -fPIC -march=x86-64 -gdwarf-4 -fno-debug-types-section -fvar-tracking-assignments -g2 -D_REENTRANT -fdiagnostics-show-option -Wall -Wextra -Wformat -Wformat-security -Wno-unused-parameter -Wstack-protector -DQT_GUI -DBOOST_THREAD_USE_LIB -DBOOST_SPIRIT_THREADSAFE -DUSE_QRCODE -DUSE_UPNP=1 -DSTATICLIB -DUSE_DBUS -DUSE_IPV6=1 -DHAVE_BUILD_INFO -DLINUX -D_FILE_OFFSET_BITS=64 -DQT_NO_DEBUG -DQT_DBUS_LIB -DQT_GUI_LIB -DQT_NETWORK_LIB -DQT_CORE_LIB -I/usr/share/qt4/mkspecs/linux-g++ -I/usr/include/qt4/QtCore -I/usr/include/qt4/QtNetwork -I/usr/include/qt4/QtGui -I/usr/include/qt4/QtDBus -I/usr/include/qt4 -Isrc -Isrc/json -Isrc/qt -Isrc/leveldb/include -Isrc/leveldb/helpers -Ibuild -Ibuild -o build/netbase.o src/netbase.cpp In file included from src/netbase.cpp:7:0: src/util.h:251:22: warning: C++11 requires a space between string literal and macro [-Wc++11-compat] return strprintf("%"PRI64d, n); ^ x86_64-pld-linux-g++ -c -pipe -fstack-protector-all -D_FORTIFY_SOURCE=2 -O2 -O2 -fwrapv -pipe -Wformat -Werror=format-security -gdwarf-4 -fno-debug-types-section -fvar-tracking-assignments -g2 -Wp,-D_FORTIFY_SOURCE=2 -fno-strict-aliasing -std=gnu++98 -fstack-protector-strong --param=ssp-buffer-size=4 -fPIC -march=x86-64 -gdwarf-4 -fno-debug-types-section -fvar-tracking-assignments -g2 -D_REENTRANT -fdiagnostics-show-option -Wall -Wextra -Wformat -Wformat-security -Wno-unused-parameter -Wstack-protector -DQT_GUI -DBOOST_THREAD_USE_LIB -DBOOST_SPIRIT_THREADSAFE -DUSE_QRCODE -DUSE_UPNP=1 -DSTATICLIB -DUSE_DBUS -DUSE_IPV6=1 -DHAVE_BUILD_INFO -DLINUX -D_FILE_OFFSET_BITS=64 -DQT_NO_DEBUG -DQT_DBUS_LIB -DQT_GUI_LIB -DQT_NETWORK_LIB -DQT_CORE_LIB -I/usr/share/qt4/mkspecs/linux-g++ -I/usr/include/qt4/QtCore -I/usr/include/qt4/QtNetwork -I/usr/include/qt4/QtGui -I/usr/include/qt4/QtDBus -I/usr/include/qt4 -Isrc -Isrc/json -Isrc/qt -Isrc/leveldb/include -Isrc/leveldb/helpers -Ibuild -Ibuild -o build/util.o src/util.cpp In file included from src/util.cpp:17:0: src/util.h:251:22: warning: C++11 requires a space between string literal and macro [-Wc++11-compat] return strprintf("%"PRI64d, n); ^ src/util.cpp:396:28: warning: C++11 requires a space between string literal and macro [-Wc++11-compat] string str = strprintf("%"PRI64d".%08"PRI64d, quotient, remainder); ^ src/util.cpp:396:37: warning: C++11 requires a space between string literal and macro [-Wc++11-compat] string str = strprintf("%"PRI64d".%08"PRI64d, quotient, remainder); ^ src/util.cpp:1333:12: warning: C++11 requires a space between string literal and macro [-Wc++11-compat] printf("Added time data, samples %d, offset %+"PRI64d" (%+"PRI64d" minutes)\n", vTimeOffsets.size(), nOffsetSample, nOffsetSample/60); ^ src/util.cpp:1333:58: warning: C++11 requires a space between string literal and macro [-Wc++11-compat] printf("Added time data, samples %d, offset %+"PRI64d" (%+"PRI64d" minutes)\n", vTimeOffsets.size(), nOffsetSample, nOffsetSample/60); ^ src/util.cpp:1368:24: warning: C++11 requires a space between string literal and macro [-Wc++11-compat] printf("%+"PRI64d" ", n); ^ src/util.cpp:1371:16: warning: C++11 requires a space between string literal and macro [-Wc++11-compat] printf("nTimeOffset = %+"PRI64d" (%+"PRI64d" minutes)\n", nTimeOffset, nTimeOffset/60); ^ src/util.cpp:1371:40: warning: C++11 requires a space between string literal and macro [-Wc++11-compat] printf("nTimeOffset = %+"PRI64d" (%+"PRI64d" minutes)\n", nTimeOffset, nTimeOffset/60); ^ x86_64-pld-linux-g++ -c -pipe -fstack-protector-all -D_FORTIFY_SOURCE=2 -O2 -O2 -fwrapv -pipe -Wformat -Werror=format-security -gdwarf-4 -fno-debug-types-section -fvar-tracking-assignments -g2 -Wp,-D_FORTIFY_SOURCE=2 -fno-strict-aliasing -std=gnu++98 -fstack-protector-strong --param=ssp-buffer-size=4 -fPIC -march=x86-64 -gdwarf-4 -fno-debug-types-section -fvar-tracking-assignments -g2 -D_REENTRANT -fdiagnostics-show-option -Wall -Wextra -Wformat -Wformat-security -Wno-unused-parameter -Wstack-protector -DQT_GUI -DBOOST_THREAD_USE_LIB -DBOOST_SPIRIT_THREADSAFE -DUSE_QRCODE -DUSE_UPNP=1 -DSTATICLIB -DUSE_DBUS -DUSE_IPV6=1 -DHAVE_BUILD_INFO -DLINUX -D_FILE_OFFSET_BITS=64 -DQT_NO_DEBUG -DQT_DBUS_LIB -DQT_GUI_LIB -DQT_NETWORK_LIB -DQT_CORE_LIB -I/usr/share/qt4/mkspecs/linux-g++ -I/usr/include/qt4/QtCore -I/usr/include/qt4/QtNetwork -I/usr/include/qt4/QtGui -I/usr/include/qt4/QtDBus -I/usr/include/qt4 -Isrc -Isrc/json -Isrc/qt -Isrc/leveldb/include -Isrc/leveldb/helpers -Ibuild -Ibuild -o build/script.o src/script.cpp In file included from src/bignum.h:12:0, from src/script.h:15, from src/script.cpp:8: src/util.h:251:22: warning: C++11 requires a space between string literal and macro [-Wc++11-compat] return strprintf("%"PRI64d, n); ^ In file included from src/main.h:12:0, from src/script.cpp:12: src/net.h:368:20: warning: C++11 requires a space between string literal and macro [-Wc++11-compat] printf("askfor %s %"PRI64d" (%s)\n", inv.ToString().c_str(), nRequestTime, DateTimeStrFormat("%H:%M:%S", nRequestTime/1000000).c_str()); ^ In file included from src/script.cpp:12:0: src/main.h:458:26: warning: C++11 requires a space between string literal and macro [-Wc++11-compat] return strprintf("CTxOut(nValue=%"PRI64d".%08"PRI64d", scriptPubKey=%s)", nValue / COIN, nValue % COIN, scriptPubKey.ToString().substr(0,30).c_str()); ^ src/main.h:458:49: warning: C++11 requires a space between string literal and macro [-Wc++11-compat] return strprintf("CTxOut(nValue=%"PRI64d".%08"PRI64d", scriptPubKey=%s)", nValue / COIN, nValue % COIN, scriptPubKey.ToString().substr(0,30).c_str()); ^ src/main.h:651:26: warning: C++11 requires a space between string literal and macro [-Wc++11-compat] str += strprintf("CTransaction(hash=%s, ver=%d, vin.size=%"PRIszu", vout.size=%"PRIszu", nLockTime=%u)\n", ^ src/main.h:651:74: warning: C++11 requires a space between string literal and macro [-Wc++11-compat] str += strprintf("CTransaction(hash=%s, ver=%d, vin.size=%"PRIszu", vout.size=%"PRIszu", nLockTime=%u)\n", ^ src/main.h:1508:16: warning: C++11 requires a space between string literal and macro [-Wc++11-compat] printf("CBlock(hash=%s, hashBlockHeader=%s, ver=%d, hashPrevBlock=%s, hashMerkleRoot=%s, nTime=%u, nBits=%08x, nNonce=%u, vtx=%"PRIszu")\n", ^ x86_64-pld-linux-g++ -c -pipe -fstack-protector-all -D_FORTIFY_SOURCE=2 -O2 -O2 -fwrapv -pipe -Wformat -Werror=format-security -gdwarf-4 -fno-debug-types-section -fvar-tracking-assignments -g2 -Wp,-D_FORTIFY_SOURCE=2 -fno-strict-aliasing -std=gnu++98 -fstack-protector-strong --param=ssp-buffer-size=4 -fPIC -march=x86-64 -gdwarf-4 -fno-debug-types-section -fvar-tracking-assignments -g2 -D_REENTRANT -fdiagnostics-show-option -Wall -Wextra -Wformat -Wformat-security -Wno-unused-parameter -Wstack-protector -DQT_GUI -DBOOST_THREAD_USE_LIB -DBOOST_SPIRIT_THREADSAFE -DUSE_QRCODE -DUSE_UPNP=1 -DSTATICLIB -DUSE_DBUS -DUSE_IPV6=1 -DHAVE_BUILD_INFO -DLINUX -D_FILE_OFFSET_BITS=64 -DQT_NO_DEBUG -DQT_DBUS_LIB -DQT_GUI_LIB -DQT_NETWORK_LIB -DQT_CORE_LIB -I/usr/share/qt4/mkspecs/linux-g++ -I/usr/include/qt4/QtCore -I/usr/include/qt4/QtNetwork -I/usr/include/qt4/QtGui -I/usr/include/qt4/QtDBus -I/usr/include/qt4 -Isrc -Isrc/json -Isrc/qt -Isrc/leveldb/include -Isrc/leveldb/helpers -Ibuild -Ibuild -o build/bloom.o src/bloom.cpp In file included from src/bignum.h:12:0, from src/main.h:10, from src/bloom.cpp:8: src/util.h:251:22: warning: C++11 requires a space between string literal and macro [-Wc++11-compat] return strprintf("%"PRI64d, n); ^ In file included from src/main.h:12:0, from src/bloom.cpp:8: src/net.h:368:20: warning: C++11 requires a space between string literal and macro [-Wc++11-compat] printf("askfor %s %"PRI64d" (%s)\n", inv.ToString().c_str(), nRequestTime, DateTimeStrFormat("%H:%M:%S", nRequestTime/1000000).c_str()); ^ In file included from src/bloom.cpp:8:0: src/main.h:458:26: warning: C++11 requires a space between string literal and macro [-Wc++11-compat] return strprintf("CTxOut(nValue=%"PRI64d".%08"PRI64d", scriptPubKey=%s)", nValue / COIN, nValue % COIN, scriptPubKey.ToString().substr(0,30).c_str()); ^ src/main.h:458:49: warning: C++11 requires a space between string literal and macro [-Wc++11-compat] return strprintf("CTxOut(nValue=%"PRI64d".%08"PRI64d", scriptPubKey=%s)", nValue / COIN, nValue % COIN, scriptPubKey.ToString().substr(0,30).c_str()); ^ src/main.h:651:26: warning: C++11 requires a space between string literal and macro [-Wc++11-compat] str += strprintf("CTransaction(hash=%s, ver=%d, vin.size=%"PRIszu", vout.size=%"PRIszu", nLockTime=%u)\n", ^ src/main.h:651:74: warning: C++11 requires a space between string literal and macro [-Wc++11-compat] str += strprintf("CTransaction(hash=%s, ver=%d, vin.size=%"PRIszu", vout.size=%"PRIszu", nLockTime=%u)\n", ^ src/main.h:1508:16: warning: C++11 requires a space between string literal and macro [-Wc++11-compat] printf("CBlock(hash=%s, hashBlockHeader=%s, ver=%d, hashPrevBlock=%s, hashMerkleRoot=%s, nTime=%u, nBits=%08x, nNonce=%u, vtx=%"PRIszu")\n", ^ x86_64-pld-linux-g++ -c -pipe -fstack-protector-all -D_FORTIFY_SOURCE=2 -O2 -O2 -fwrapv -pipe -Wformat -Werror=format-security -gdwarf-4 -fno-debug-types-section -fvar-tracking-assignments -g2 -Wp,-D_FORTIFY_SOURCE=2 -fno-strict-aliasing -std=gnu++98 -fstack-protector-strong --param=ssp-buffer-size=4 -fPIC -march=x86-64 -gdwarf-4 -fno-debug-types-section -fvar-tracking-assignments -g2 -D_REENTRANT -fdiagnostics-show-option -Wall -Wextra -Wformat -Wformat-security -Wno-unused-parameter -Wstack-protector -DQT_GUI -DBOOST_THREAD_USE_LIB -DBOOST_SPIRIT_THREADSAFE -DUSE_QRCODE -DUSE_UPNP=1 -DSTATICLIB -DUSE_DBUS -DUSE_IPV6=1 -DHAVE_BUILD_INFO -DLINUX -D_FILE_OFFSET_BITS=64 -DQT_NO_DEBUG -DQT_DBUS_LIB -DQT_GUI_LIB -DQT_NETWORK_LIB -DQT_CORE_LIB -I/usr/share/qt4/mkspecs/linux-g++ -I/usr/include/qt4/QtCore -I/usr/include/qt4/QtNetwork -I/usr/include/qt4/QtGui -I/usr/include/qt4/QtDBus -I/usr/include/qt4 -Isrc -Isrc/json -Isrc/qt -Isrc/leveldb/include -Isrc/leveldb/helpers -Ibuild -Ibuild -o build/net.o src/net.cpp In file included from src/bignum.h:12:0, from src/main.h:10, from src/db.h:8, from src/net.cpp:7: src/util.h:251:22: warning: C++11 requires a space between string literal and macro [-Wc++11-compat] return strprintf("%"PRI64d, n); ^ In file included from src/main.h:12:0, from src/db.h:8, from src/net.cpp:7: src/net.h:368:20: warning: C++11 requires a space between string literal and macro [-Wc++11-compat] printf("askfor %s %"PRI64d" (%s)\n", inv.ToString().c_str(), nRequestTime, DateTimeStrFormat("%H:%M:%S", nRequestTime/1000000).c_str()); ^ In file included from src/db.h:8:0, from src/net.cpp:7: src/main.h:458:26: warning: C++11 requires a space between string literal and macro [-Wc++11-compat] return strprintf("CTxOut(nValue=%"PRI64d".%08"PRI64d", scriptPubKey=%s)", nValue / COIN, nValue % COIN, scriptPubKey.ToString().substr(0,30).c_str()); ^ src/main.h:458:49: warning: C++11 requires a space between string literal and macro [-Wc++11-compat] return strprintf("CTxOut(nValue=%"PRI64d".%08"PRI64d", scriptPubKey=%s)", nValue / COIN, nValue % COIN, scriptPubKey.ToString().substr(0,30).c_str()); ^ src/main.h:651:26: warning: C++11 requires a space between string literal and macro [-Wc++11-compat] str += strprintf("CTransaction(hash=%s, ver=%d, vin.size=%"PRIszu", vout.size=%"PRIszu", nLockTime=%u)\n", ^ src/main.h:651:74: warning: C++11 requires a space between string literal and macro [-Wc++11-compat] str += strprintf("CTransaction(hash=%s, ver=%d, vin.size=%"PRIszu", vout.size=%"PRIszu", nLockTime=%u)\n", ^ src/main.h:1508:16: warning: C++11 requires a space between string literal and macro [-Wc++11-compat] printf("CBlock(hash=%s, hashBlockHeader=%s, ver=%d, hashPrevBlock=%s, hashMerkleRoot=%s, nTime=%u, nBits=%08x, nNonce=%u, vtx=%"PRIszu")\n", ^ src/net.cpp:1271:12: warning: C++11 requires a space between string literal and macro [-Wc++11-compat] printf("Flushed %d addresses to peers.dat %"PRI64d"ms\n", ^ src/net.cpp: In function 'void ThreadMapPort()': src/net.cpp:1089:68: error: invalid conversion from 'int*' to 'unsigned char' [-fpermissive] devlist = upnpDiscover(2000, multicastif, minissdpdpath, 0, 0, &error); ^~~~~~ src/net.cpp:1089:74: error: too few arguments to function 'UPNPDev* upnpDiscover(int, const char*, const char*, int, int, unsigned char, int*)' devlist = upnpDiscover(2000, multicastif, minissdpdpath, 0, 0, &error); ^ In file included from src/net.cpp:20:0: /usr/include/miniupnpc/miniupnpc.h:62:1: note: declared here upnpDiscover(int delay, const char * multicastif, ^~~~~~~~~~~~ make: *** [Makefile:1342: build/net.o] Error 1 make: *** Waiting for unfinished jobs.... x86_64-pld-linux-g++ -c -pipe -fstack-protector-all -D_FORTIFY_SOURCE=2 -O2 -O2 -fwrapv -pipe -Wformat -Werror=format-security -gdwarf-4 -fno-debug-types-section -fvar-tracking-assignments -g2 -Wp,-D_FORTIFY_SOURCE=2 -fno-strict-aliasing -std=gnu++98 -fstack-protector-strong --param=ssp-buffer-size=4 -fPIC -march=x86-64 -gdwarf-4 -fno-debug-types-section -fvar-tracking-assignments -g2 -D_REENTRANT -fdiagnostics-show-option -Wall -Wextra -Wformat -Wformat-security -Wno-unused-parameter -Wstack-protector -DQT_GUI -DBOOST_THREAD_USE_LIB -DBOOST_SPIRIT_THREADSAFE -DUSE_QRCODE -DUSE_UPNP=1 -DSTATICLIB -DUSE_DBUS -DUSE_IPV6=1 -DHAVE_BUILD_INFO -DLINUX -D_FILE_OFFSET_BITS=64 -DQT_NO_DEBUG -DQT_DBUS_LIB -DQT_GUI_LIB -DQT_NETWORK_LIB -DQT_CORE_LIB -I/usr/share/qt4/mkspecs/linux-g++ -I/usr/include/qt4/QtCore -I/usr/include/qt4/QtNetwork -I/usr/include/qt4/QtGui -I/usr/include/qt4/QtDBus -I/usr/include/qt4 -Isrc -Isrc/json -Isrc/qt -Isrc/leveldb/include -Isrc/leveldb/helpers -Ibuild -Ibuild -o build/addrman.o src/addrman.cpp In file included from src/addrman.h:9:0, from src/addrman.cpp:5: src/util.h:251:22: warning: C++11 requires a space between string literal and macro [-Wc++11-compat] return strprintf("%"PRI64d, n); ^ x86_64-pld-linux-g++ -c -pipe -fstack-protector-all -D_FORTIFY_SOURCE=2 -O2 -O2 -fwrapv -pipe -Wformat -Werror=format-security -gdwarf-4 -fno-debug-types-section -fvar-tracking-assignments -g2 -Wp,-D_FORTIFY_SOURCE=2 -fno-strict-aliasing -std=gnu++98 -fstack-protector-strong --param=ssp-buffer-size=4 -fPIC -march=x86-64 -gdwarf-4 -fno-debug-types-section -fvar-tracking-assignments -g2 -D_REENTRANT -fdiagnostics-show-option -Wall -Wextra -Wformat -Wformat-security -Wno-unused-parameter -Wstack-protector -DQT_GUI -DBOOST_THREAD_USE_LIB -DBOOST_SPIRIT_THREADSAFE -DUSE_QRCODE -DUSE_UPNP=1 -DSTATICLIB -DUSE_DBUS -DUSE_IPV6=1 -DHAVE_BUILD_INFO -DLINUX -D_FILE_OFFSET_BITS=64 -DQT_NO_DEBUG -DQT_DBUS_LIB -DQT_GUI_LIB -DQT_NETWORK_LIB -DQT_CORE_LIB -I/usr/share/qt4/mkspecs/linux-g++ -I/usr/include/qt4/QtCore -I/usr/include/qt4/QtNetwork -I/usr/include/qt4/QtGui -I/usr/include/qt4/QtDBus -I/usr/include/qt4 -Isrc -Isrc/json -Isrc/qt -Isrc/leveldb/include -Isrc/leveldb/helpers -Ibuild -Ibuild -o build/checkpoints.o src/checkpoints.cpp In file included from src/bignum.h:12:0, from src/main.h:10, from src/checkpoints.cpp:11: src/util.h:251:22: warning: C++11 requires a space between string literal and macro [-Wc++11-compat] return strprintf("%"PRI64d, n); ^ In file included from src/main.h:12:0, from src/checkpoints.cpp:11: src/net.h:368:20: warning: C++11 requires a space between string literal and macro [-Wc++11-compat] printf("askfor %s %"PRI64d" (%s)\n", inv.ToString().c_str(), nRequestTime, DateTimeStrFormat("%H:%M:%S", nRequestTime/1000000).c_str()); ^ In file included from src/checkpoints.cpp:11:0: src/main.h:458:26: warning: C++11 requires a space between string literal and macro [-Wc++11-compat] return strprintf("CTxOut(nValue=%"PRI64d".%08"PRI64d", scriptPubKey=%s)", nValue / COIN, nValue % COIN, scriptPubKey.ToString().substr(0,30).c_str()); ^ src/main.h:458:49: warning: C++11 requires a space between string literal and macro [-Wc++11-compat] return strprintf("CTxOut(nValue=%"PRI64d".%08"PRI64d", scriptPubKey=%s)", nValue / COIN, nValue % COIN, scriptPubKey.ToString().substr(0,30).c_str()); ^ src/main.h:651:26: warning: C++11 requires a space between string literal and macro [-Wc++11-compat] str += strprintf("CTransaction(hash=%s, ver=%d, vin.size=%"PRIszu", vout.size=%"PRIszu", nLockTime=%u)\n", ^ src/main.h:651:74: warning: C++11 requires a space between string literal and macro [-Wc++11-compat] str += strprintf("CTransaction(hash=%s, ver=%d, vin.size=%"PRIszu", vout.size=%"PRIszu", nLockTime=%u)\n", ^ src/main.h:1508:16: warning: C++11 requires a space between string literal and macro [-Wc++11-compat] printf("CBlock(hash=%s, hashBlockHeader=%s, ver=%d, hashPrevBlock=%s, hashMerkleRoot=%s, nTime=%u, nBits=%08x, nNonce=%u, vtx=%"PRIszu")\n", ^ x86_64-pld-linux-g++ -c -pipe -fstack-protector-all -D_FORTIFY_SOURCE=2 -O2 -O2 -fwrapv -pipe -Wformat -Werror=format-security -gdwarf-4 -fno-debug-types-section -fvar-tracking-assignments -g2 -Wp,-D_FORTIFY_SOURCE=2 -fno-strict-aliasing -std=gnu++98 -fstack-protector-strong --param=ssp-buffer-size=4 -fPIC -march=x86-64 -gdwarf-4 -fno-debug-types-section -fvar-tracking-assignments -g2 -D_REENTRANT -fdiagnostics-show-option -Wall -Wextra -Wformat -Wformat-security -Wno-unused-parameter -Wstack-protector -DQT_GUI -DBOOST_THREAD_USE_LIB -DBOOST_SPIRIT_THREADSAFE -DUSE_QRCODE -DUSE_UPNP=1 -DSTATICLIB -DUSE_DBUS -DUSE_IPV6=1 -DHAVE_BUILD_INFO -DLINUX -D_FILE_OFFSET_BITS=64 -DQT_NO_DEBUG -DQT_DBUS_LIB -DQT_GUI_LIB -DQT_NETWORK_LIB -DQT_CORE_LIB -I/usr/share/qt4/mkspecs/linux-g++ -I/usr/include/qt4/QtCore -I/usr/include/qt4/QtNetwork -I/usr/include/qt4/QtGui -I/usr/include/qt4/QtDBus -I/usr/include/qt4 -Isrc -Isrc/json -Isrc/qt -Isrc/leveldb/include -Isrc/leveldb/helpers -Ibuild -Ibuild -o build/init.o src/init.cpp In file included from src/bignum.h:12:0, from src/main.h:10, from src/txdb.h:10, from src/init.cpp:8: src/util.h:251:22: warning: C++11 requires a space between string literal and macro [-Wc++11-compat] return strprintf("%"PRI64d, n); ^ In file included from src/main.h:12:0, from src/txdb.h:10, from src/init.cpp:8: src/net.h:368:20: warning: C++11 requires a space between string literal and macro [-Wc++11-compat] printf("askfor %s %"PRI64d" (%s)\n", inv.ToString().c_str(), nRequestTime, DateTimeStrFormat("%H:%M:%S", nRequestTime/1000000).c_str()); ^ In file included from src/txdb.h:10:0, from src/init.cpp:8: src/main.h:458:26: warning: C++11 requires a space between string literal and macro [-Wc++11-compat] return strprintf("CTxOut(nValue=%"PRI64d".%08"PRI64d", scriptPubKey=%s)", nValue / COIN, nValue % COIN, scriptPubKey.ToString().substr(0,30).c_str()); ^ src/main.h:458:49: warning: C++11 requires a space between string literal and macro [-Wc++11-compat] return strprintf("CTxOut(nValue=%"PRI64d".%08"PRI64d", scriptPubKey=%s)", nValue / COIN, nValue % COIN, scriptPubKey.ToString().substr(0,30).c_str()); ^ src/main.h:651:26: warning: C++11 requires a space between string literal and macro [-Wc++11-compat] str += strprintf("CTransaction(hash=%s, ver=%d, vin.size=%"PRIszu", vout.size=%"PRIszu", nLockTime=%u)\n", ^ src/main.h:651:74: warning: C++11 requires a space between string literal and macro [-Wc++11-compat] str += strprintf("CTransaction(hash=%s, ver=%d, vin.size=%"PRIszu", vout.size=%"PRIszu", nLockTime=%u)\n", ^ src/main.h:1508:16: warning: C++11 requires a space between string literal and macro [-Wc++11-compat] printf("CBlock(hash=%s, hashBlockHeader=%s, ver=%d, hashPrevBlock=%s, hashMerkleRoot=%s, nTime=%u, nBits=%08x, nNonce=%u, vtx=%"PRIszu")\n", ^ src/init.cpp:658:76: warning: C++11 requires a space between string literal and macro [-Wc++11-compat] boost::filesystem::path pathDatabaseBak = GetDataDir() / strprintf("database.%"PRI64d".bak", GetTime()); ^ src/init.cpp:912:12: warning: C++11 requires a space between string literal and macro [-Wc++11-compat] printf(" block index %15"PRI64d"ms\n", GetTimeMillis() - nStart); ^ src/init.cpp:999:12: warning: C++11 requires a space between string literal and macro [-Wc++11-compat] printf(" wallet %15"PRI64d"ms\n", GetTimeMillis() - nStart); ^ src/init.cpp:1027:16: warning: C++11 requires a space between string literal and macro [-Wc++11-compat] printf(" rescan %15"PRI64d"ms\n", GetTimeMillis() - nStart); ^ src/init.cpp:1059:12: warning: C++11 requires a space between string literal and macro [-Wc++11-compat] printf("Loaded %i addresses from peers.dat %"PRI64d"ms\n", ^ src/init.cpp:1073:12: warning: C++11 requires a space between string literal and macro [-Wc++11-compat] printf("mapBlockIndex.size() = %"PRIszu"\n", mapBlockIndex.size()); ^ src/init.cpp:1075:12: warning: C++11 requires a space between string literal and macro [-Wc++11-compat] printf("setKeyPool.size() = %"PRIszu"\n", pwalletMain->setKeyPool.size()); ^ src/init.cpp:1076:12: warning: C++11 requires a space between string literal and macro [-Wc++11-compat] printf("mapWallet.size() = %"PRIszu"\n", pwalletMain->mapWallet.size()); ^ src/init.cpp:1077:12: warning: C++11 requires a space between string literal and macro [-Wc++11-compat] printf("mapAddressBook.size() = %"PRIszu"\n", pwalletMain->mapAddressBook.size()); ^ x86_64-pld-linux-g++ -c -pipe -fstack-protector-all -D_FORTIFY_SOURCE=2 -O2 -O2 -fwrapv -pipe -Wformat -Werror=format-security -gdwarf-4 -fno-debug-types-section -fvar-tracking-assignments -g2 -Wp,-D_FORTIFY_SOURCE=2 -fno-strict-aliasing -std=gnu++98 -fstack-protector-strong --param=ssp-buffer-size=4 -fPIC -march=x86-64 -gdwarf-4 -fno-debug-types-section -fvar-tracking-assignments -g2 -D_REENTRANT -fdiagnostics-show-option -Wall -Wextra -Wformat -Wformat-security -Wno-unused-parameter -Wstack-protector -DQT_GUI -DBOOST_THREAD_USE_LIB -DBOOST_SPIRIT_THREADSAFE -DUSE_QRCODE -DUSE_UPNP=1 -DSTATICLIB -DUSE_DBUS -DUSE_IPV6=1 -DHAVE_BUILD_INFO -DLINUX -D_FILE_OFFSET_BITS=64 -DQT_NO_DEBUG -DQT_DBUS_LIB -DQT_GUI_LIB -DQT_NETWORK_LIB -DQT_CORE_LIB -I/usr/share/qt4/mkspecs/linux-g++ -I/usr/include/qt4/QtCore -I/usr/include/qt4/QtNetwork -I/usr/include/qt4/QtGui -I/usr/include/qt4/QtDBus -I/usr/include/qt4 -Isrc -Isrc/json -Isrc/qt -Isrc/leveldb/include -Isrc/leveldb/helpers -Ibuild -Ibuild -o build/main.o src/main.cpp In file included from src/alert.h:13:0, from src/main.cpp:8: src/util.h:251:22: warning: C++11 requires a space between string literal and macro [-Wc++11-compat] return strprintf("%"PRI64d, n); ^ In file included from src/main.h:12:0, from src/db.h:8, from src/main.cpp:10: src/net.h:368:20: warning: C++11 requires a space between string literal and macro [-Wc++11-compat] printf("askfor %s %"PRI64d" (%s)\n", inv.ToString().c_str(), nRequestTime, DateTimeStrFormat("%H:%M:%S", nRequestTime/1000000).c_str()); ^ In file included from src/db.h:8:0, from src/main.cpp:10: src/main.h:458:26: warning: C++11 requires a space between string literal and macro [-Wc++11-compat] return strprintf("CTxOut(nValue=%"PRI64d".%08"PRI64d", scriptPubKey=%s)", nValue / COIN, nValue % COIN, scriptPubKey.ToString().substr(0,30).c_str()); ^ src/main.h:458:49: warning: C++11 requires a space between string literal and macro [-Wc++11-compat] return strprintf("CTxOut(nValue=%"PRI64d".%08"PRI64d", scriptPubKey=%s)", nValue / COIN, nValue % COIN, scriptPubKey.ToString().substr(0,30).c_str()); ^ src/main.h:651:26: warning: C++11 requires a space between string literal and macro [-Wc++11-compat] str += strprintf("CTransaction(hash=%s, ver=%d, vin.size=%"PRIszu", vout.size=%"PRIszu", nLockTime=%u)\n", ^ src/main.h:651:74: warning: C++11 requires a space between string literal and macro [-Wc++11-compat] str += strprintf("CTransaction(hash=%s, ver=%d, vin.size=%"PRIszu", vout.size=%"PRIszu", nLockTime=%u)\n", ^ src/main.h:1508:16: warning: C++11 requires a space between string literal and macro [-Wc++11-compat] printf("CBlock(hash=%s, hashBlockHeader=%s, ver=%d, hashPrevBlock=%s, hashMerkleRoot=%s, nTime=%u, nBits=%08x, nNonce=%u, vtx=%"PRIszu")\n", ^ src/main.cpp:315:12: warning: C++11 requires a space between string literal and macro [-Wc++11-compat] printf("stored orphan tx %s (mapsz %"PRIszu")\n", hash.ToString().c_str(), ^ src/main.cpp:771:26: warning: C++11 requires a space between string literal and macro [-Wc++11-compat] return error("CTxMemPool::accept() : not enough fees %s, %"PRI64d" < %"PRI64d, ^ src/main.cpp:771:78: warning: C++11 requires a space between string literal and macro [-Wc++11-compat] return error("CTxMemPool::accept() : not enough fees %s, %"PRI64d" < %"PRI64d, ^ src/main.cpp:1744:16: warning: C++11 requires a space between string literal and macro [-Wc++11-compat] printf("REORGANIZE: Disconnect %"PRIszu" blocks; %s..\n", vDisconnect.size(), pfork->GetBlockHash().ToString().c_str()); ^ src/main.cpp:1745:16: warning: C++11 requires a space between string literal and macro [-Wc++11-compat] printf("REORGANIZE: Connect %"PRIszu" blocks; ..%s\n", vConnect.size(), pindexNew->GetBlockHash().ToString().c_str()); ^ src/main.cpp:2889:16: warning: C++11 requires a space between string literal and macro [-Wc++11-compat] printf("%d (blk%05u.dat:0x%x) %s %s tx %"PRIszu"", ^ src/main.cpp:2982:16: warning: C++11 requires a space between string literal and macro [-Wc++11-compat] printf("Loaded %i blocks from external file in %"PRI64d"ms\n", nLoaded, GetTimeMillis() - nStart); ^ src/main.cpp:3224:16: warning: C++11 requires a space between string literal and macro [-Wc++11-compat] printf("received: %s (%"PRIszu" bytes)\n", strCommand.c_str(), vRecv.size()); ^ src/main.cpp:3375:26: warning: C++11 requires a space between string literal and macro [-Wc++11-compat] return error("message addr size() = %"PRIszu"", vAddr.size()); ^ src/main.cpp:3438:26: warning: C++11 requires a space between string literal and macro [-Wc++11-compat] return error("message inv size() = %"PRIszu"", vInv.size()); ^ src/main.cpp:3487:26: warning: C++11 requires a space between string literal and macro [-Wc++11-compat] return error("message getdata size() = %"PRIszu"", vInv.size()); ^ src/main.cpp:3491:20: warning: C++11 requires a space between string literal and macro [-Wc++11-compat] printf("received getdata (%"PRIszu" invsz)\n", vInv.size()); ^ src/main.cpp:3592:20: warning: C++11 requires a space between string literal and macro [-Wc++11-compat] printf("AcceptToMemoryPool: %s %s : accepted %s (poolsz %"PRIszu")\n", ^ src/main.cpp:4472:20: warning: C++11 requires a space between string literal and macro [-Wc++11-compat] printf("CreateNewBlock(): total size %"PRI64u"\n", nBlockSize); ^ src/main.cpp:4700:20: warning: C++11 requires a space between string literal and macro [-Wc++11-compat] printf("Running PrimecoinMiner with %"PRIszu" transactions in block (%u bytes)\n", pblock->vtx.size(), ^ error: Bad exit status from /tmp/B.28JnVz/BUILD/tmp/rpm-tmp.40531 (%build) RPM build errors: Bad exit status from /tmp/B.28JnVz/BUILD/tmp/rpm-tmp.40531 (%build) ended at: Sun Apr 16 14:28:45 2017, done in 0:01:09.114629 error: No files produced. mesg: ttyname failed: Inappropriate ioctl for device + chmod -R u+rwX /tmp/B.28JnVz/BUILD + rm -rf /tmp/B.28JnVz/tmp /tmp/B.28JnVz/BUILD mesg: ttyname failed: Inappropriate ioctl for device + rm -rf /tmp/B.28JnVz Begin-PLD-Builder-Info Build-Time: user:218.89s sys:11.78s real:73.81s (faults io:19 non-io:3244840) End-PLD-Builder-Info
[Back to list of logs] [View rpm -qa of builder]