FailedOk

th/SRPMS[OK]
th/x32[OK]
th/i686[OK]
th/x86_64[OK]

ac/SRPMS[OK]
ac/i386[OK]
ac/i586[OK]
ac/i686[OK]
ac/alpha[OK]
ac/amd64[OK]
ac/athlon[OK]
ac/ppc[OK]
ac/sparc[OK]
ac/sparc64[OK]

Advanced Search
main()
Powered by PLD Linux
(c) 2002-2018 PLD Team
$Revision: 1.37 $
Powered by x-files.
Your IP: 54.166.130.157

protobuf 25ecc54c-7f10-48e6-829d-be9544972e03

Status:Failed
Source URL:ftp://buildlogs.pld-linux.org/th/x86_64/FAIL/protobuf,25ecc54c-7f10-48e6-829d-be9544972e03.bz2
text/plain URL:View!
full text:View!
rpm -qa of builder:View!
Date:2018/06/06 09:03:55
Runtime:0:06:29.612981

Toc:

  • error 1
  • make[3]: *** No rule to make target 'gmock_main.cc', needed by 'gmock_main.lo'. Stop.
  • error 2
  • make[2]: *** [Makefile:8487: check-am] Error 2
  • error 3
  • make[1]: *** [Makefile:8490: check] Error 2
  • error 4
  • error: Bad exit status from /tmp/B.3GW_Hy/BUILD/tmp/rpm-tmp.56482 (%build)
  • error 5
  • RPM build errors:
  • error 6
  • error: No files produced.

Content:

x86_64-pld-linux-g++ -DHAVE_CONFIG_H -I. -I..  -I/usr/include/gtest -I/usr/src/gmock/src -DGOOGLE_PROTOBUF_NO_RTTI -pthread -DHAVE_PTHREAD=1 -DHAVE_ZLIB=1 -Wall -Wno-sign-compare -O2 -pipe -Wformat -Werror=format-security -gdwarf-4 -fno-debug-types-section -fvar-tracking-assignments -g2 -Wp,-D_FORTIFY_SOURCE=2 -fstack-protector-strong --param=ssp-buffer-size=4 -fPIC -march=x86-64 -gdwarf-4 -fno-debug-types-section -fvar-tracking-assignments -g2  -MT google/protobuf/protobuf_test-unittest_drop_unknown_fields.pb.o -MD -MP -MF google/protobuf/.deps/protobuf_test-unittest_drop_unknown_fields.pb.Tpo -c -o google/protobuf/protobuf_test-unittest_drop_unknown_fields.pb.o `test -f 'google/protobuf/unittest_drop_unknown_fields.pb.cc' || echo './'`google/protobuf/unittest_drop_unknown_fields.pb.cc
mv -f google/protobuf/.deps/protobuf_test-unittest_drop_unknown_fields.pb.Tpo google/protobuf/.deps/protobuf_test-unittest_drop_unknown_fields.pb.Po
make[3]: Leaving directory '/tmp/B.3GW_Hy/BUILD/protobuf-3.5.1.1/src'
make[3]: Entering directory '/tmp/B.3GW_Hy/BUILD/protobuf-3.5.1.1/src'
x86_64-pld-linux-g++ -DHAVE_CONFIG_H -I. -I..  -I/usr/include/gtest -I/usr/src/gmock/src -DGOOGLE_PROTOBUF_NO_RTTI -pthread -DHAVE_PTHREAD=1 -DHAVE_ZLIB=1 -Wall -Wno-sign-compare -O2 -pipe -Wformat -Werror=format-security -gdwarf-4 -fno-debug-types-section -fvar-tracking-assignments -g2 -Wp,-D_FORTIFY_SOURCE=2 -fstack-protector-strong --param=ssp-buffer-size=4 -fPIC -march=x86-64 -gdwarf-4 -fno-debug-types-section -fvar-tracking-assignments -g2  -MT google/protobuf/protobuf_test-unittest_lite.pb.o -MD -MP -MF google/protobuf/.deps/protobuf_test-unittest_lite.pb.Tpo -c -o google/protobuf/protobuf_test-unittest_lite.pb.o `test -f 'google/protobuf/unittest_lite.pb.cc' || echo './'`google/protobuf/unittest_lite.pb.cc
mv -f google/protobuf/.deps/protobuf_test-unittest_lite.pb.Tpo google/protobuf/.deps/protobuf_test-unittest_lite.pb.Po
make[3]: Leaving directory '/tmp/B.3GW_Hy/BUILD/protobuf-3.5.1.1/src'
make[3]: Entering directory '/tmp/B.3GW_Hy/BUILD/protobuf-3.5.1.1/src'
x86_64-pld-linux-g++ -DHAVE_CONFIG_H -I. -I..  -I/usr/include/gtest -I/usr/src/gmock/src -DGOOGLE_PROTOBUF_NO_RTTI -pthread -DHAVE_PTHREAD=1 -DHAVE_ZLIB=1 -Wall -Wno-sign-compare -O2 -pipe -Wformat -Werror=format-security -gdwarf-4 -fno-debug-types-section -fvar-tracking-assignments -g2 -Wp,-D_FORTIFY_SOURCE=2 -fstack-protector-strong --param=ssp-buffer-size=4 -fPIC -march=x86-64 -gdwarf-4 -fno-debug-types-section -fvar-tracking-assignments -g2  -MT google/protobuf/protobuf_test-unittest_empty.pb.o -MD -MP -MF google/protobuf/.deps/protobuf_test-unittest_empty.pb.Tpo -c -o google/protobuf/protobuf_test-unittest_empty.pb.o `test -f 'google/protobuf/unittest_empty.pb.cc' || echo './'`google/protobuf/unittest_empty.pb.cc
mv -f google/protobuf/.deps/protobuf_test-unittest_empty.pb.Tpo google/protobuf/.deps/protobuf_test-unittest_empty.pb.Po
make[3]: Leaving directory '/tmp/B.3GW_Hy/BUILD/protobuf-3.5.1.1/src'
make[3]: Entering directory '/tmp/B.3GW_Hy/BUILD/protobuf-3.5.1.1/src'
x86_64-pld-linux-g++ -DHAVE_CONFIG_H -I. -I..  -I/usr/include/gtest -I/usr/src/gmock/src -DGOOGLE_PROTOBUF_NO_RTTI -pthread -DHAVE_PTHREAD=1 -DHAVE_ZLIB=1 -Wall -Wno-sign-compare -O2 -pipe -Wformat -Werror=format-security -gdwarf-4 -fno-debug-types-section -fvar-tracking-assignments -g2 -Wp,-D_FORTIFY_SOURCE=2 -fstack-protector-strong --param=ssp-buffer-size=4 -fPIC -march=x86-64 -gdwarf-4 -fno-debug-types-section -fvar-tracking-assignments -g2  -MT google/protobuf/protobuf_test-unittest_embed_optimize_for.pb.o -MD -MP -MF google/protobuf/.deps/protobuf_test-unittest_embed_optimize_for.pb.Tpo -c -o google/protobuf/protobuf_test-unittest_embed_optimize_for.pb.o `test -f 'google/protobuf/unittest_embed_optimize_for.pb.cc' || echo './'`google/protobuf/unittest_embed_optimize_for.pb.cc
mv -f google/protobuf/.deps/protobuf_test-unittest_embed_optimize_for.pb.Tpo google/protobuf/.deps/protobuf_test-unittest_embed_optimize_for.pb.Po
make[3]: Leaving directory '/tmp/B.3GW_Hy/BUILD/protobuf-3.5.1.1/src'
make[3]: Entering directory '/tmp/B.3GW_Hy/BUILD/protobuf-3.5.1.1/src'
x86_64-pld-linux-g++ -DHAVE_CONFIG_H -I. -I..  -I/usr/include/gtest -I/usr/src/gmock/src -DGOOGLE_PROTOBUF_NO_RTTI -pthread -DHAVE_PTHREAD=1 -DHAVE_ZLIB=1 -Wall -Wno-sign-compare -O2 -pipe -Wformat -Werror=format-security -gdwarf-4 -fno-debug-types-section -fvar-tracking-assignments -g2 -Wp,-D_FORTIFY_SOURCE=2 -fstack-protector-strong --param=ssp-buffer-size=4 -fPIC -march=x86-64 -gdwarf-4 -fno-debug-types-section -fvar-tracking-assignments -g2  -MT google/protobuf/util/protobuf_test-message_differencer_unittest.o -MD -MP -MF google/protobuf/util/.deps/protobuf_test-message_differencer_unittest.Tpo -c -o google/protobuf/util/protobuf_test-message_differencer_unittest.o `test -f 'google/protobuf/util/message_differencer_unittest.cc' || echo './'`google/protobuf/util/message_differencer_unittest.cc
mv -f google/protobuf/util/.deps/protobuf_test-message_differencer_unittest.Tpo google/protobuf/util/.deps/protobuf_test-message_differencer_unittest.Po
make[3]: Leaving directory '/tmp/B.3GW_Hy/BUILD/protobuf-3.5.1.1/src'
make[3]: Entering directory '/tmp/B.3GW_Hy/BUILD/protobuf-3.5.1.1/src'
x86_64-pld-linux-g++ -DHAVE_CONFIG_H -I. -I..  -I/usr/include/gtest -I/usr/src/gmock/src -DGOOGLE_PROTOBUF_NO_RTTI -pthread -DHAVE_PTHREAD=1 -DHAVE_ZLIB=1 -Wall -Wno-sign-compare -O2 -pipe -Wformat -Werror=format-security -gdwarf-4 -fno-debug-types-section -fvar-tracking-assignments -g2 -Wp,-D_FORTIFY_SOURCE=2 -fstack-protector-strong --param=ssp-buffer-size=4 -fPIC -march=x86-64 -gdwarf-4 -fno-debug-types-section -fvar-tracking-assignments -g2  -MT google/protobuf/protobuf_test-unittest_import.pb.o -MD -MP -MF google/protobuf/.deps/protobuf_test-unittest_import.pb.Tpo -c -o google/protobuf/protobuf_test-unittest_import.pb.o `test -f 'google/protobuf/unittest_import.pb.cc' || echo './'`google/protobuf/unittest_import.pb.cc
mv -f google/protobuf/.deps/protobuf_test-unittest_import.pb.Tpo google/protobuf/.deps/protobuf_test-unittest_import.pb.Po
make[3]: Leaving directory '/tmp/B.3GW_Hy/BUILD/protobuf-3.5.1.1/src'
make[3]: Entering directory '/tmp/B.3GW_Hy/BUILD/protobuf-3.5.1.1/src'
x86_64-pld-linux-g++ -DHAVE_CONFIG_H -I. -I..  -I/usr/include/gtest -I/usr/src/gmock/src -DGOOGLE_PROTOBUF_NO_RTTI -pthread -DHAVE_PTHREAD=1 -DHAVE_ZLIB=1 -Wall -Wno-sign-compare -O2 -pipe -Wformat -Werror=format-security -gdwarf-4 -fno-debug-types-section -fvar-tracking-assignments -g2 -Wp,-D_FORTIFY_SOURCE=2 -fstack-protector-strong --param=ssp-buffer-size=4 -fPIC -march=x86-64 -gdwarf-4 -fno-debug-types-section -fvar-tracking-assignments -g2  -MT google/protobuf/protobuf_test-unittest_import_public.pb.o -MD -MP -MF google/protobuf/.deps/protobuf_test-unittest_import_public.pb.Tpo -c -o google/protobuf/protobuf_test-unittest_import_public.pb.o `test -f 'google/protobuf/unittest_import_public.pb.cc' || echo './'`google/protobuf/unittest_import_public.pb.cc
mv -f google/protobuf/.deps/protobuf_test-unittest_import_public.pb.Tpo google/protobuf/.deps/protobuf_test-unittest_import_public.pb.Po
make[3]: Leaving directory '/tmp/B.3GW_Hy/BUILD/protobuf-3.5.1.1/src'
make[3]: Entering directory '/tmp/B.3GW_Hy/BUILD/protobuf-3.5.1.1/src'
x86_64-pld-linux-g++ -DHAVE_CONFIG_H -I. -I..  -I/usr/include/gtest -I/usr/src/gmock/src -DGOOGLE_PROTOBUF_NO_RTTI -pthread -DHAVE_PTHREAD=1 -DHAVE_ZLIB=1 -Wall -Wno-sign-compare -O2 -pipe -Wformat -Werror=format-security -gdwarf-4 -fno-debug-types-section -fvar-tracking-assignments -g2 -Wp,-D_FORTIFY_SOURCE=2 -fstack-protector-strong --param=ssp-buffer-size=4 -fPIC -march=x86-64 -gdwarf-4 -fno-debug-types-section -fvar-tracking-assignments -g2  -MT google/protobuf/protobuf_test-unittest_custom_options.pb.o -MD -MP -MF google/protobuf/.deps/protobuf_test-unittest_custom_options.pb.Tpo -c -o google/protobuf/protobuf_test-unittest_custom_options.pb.o `test -f 'google/protobuf/unittest_custom_options.pb.cc' || echo './'`google/protobuf/unittest_custom_options.pb.cc
mv -f google/protobuf/.deps/protobuf_test-unittest_custom_options.pb.Tpo google/protobuf/.deps/protobuf_test-unittest_custom_options.pb.Po
make[3]: Leaving directory '/tmp/B.3GW_Hy/BUILD/protobuf-3.5.1.1/src'
make[3]: Entering directory '/tmp/B.3GW_Hy/BUILD/protobuf-3.5.1.1/src'
x86_64-pld-linux-g++ -DHAVE_CONFIG_H -I. -I..  -I/usr/include/gtest -I/usr/src/gmock/src -DGOOGLE_PROTOBUF_NO_RTTI -pthread -DHAVE_PTHREAD=1 -DHAVE_ZLIB=1 -Wall -Wno-sign-compare -O2 -pipe -Wformat -Werror=format-security -gdwarf-4 -fno-debug-types-section -fvar-tracking-assignments -g2 -Wp,-D_FORTIFY_SOURCE=2 -fstack-protector-strong --param=ssp-buffer-size=4 -fPIC -march=x86-64 -gdwarf-4 -fno-debug-types-section -fvar-tracking-assignments -g2  -MT google/protobuf/protobuf_test-unittest_lazy_dependencies_enum.pb.o -MD -MP -MF google/protobuf/.deps/protobuf_test-unittest_lazy_dependencies_enum.pb.Tpo -c -o google/protobuf/protobuf_test-unittest_lazy_dependencies_enum.pb.o `test -f 'google/protobuf/unittest_lazy_dependencies_enum.pb.cc' || echo './'`google/protobuf/unittest_lazy_dependencies_enum.pb.cc
mv -f google/protobuf/.deps/protobuf_test-unittest_lazy_dependencies_enum.pb.Tpo google/protobuf/.deps/protobuf_test-unittest_lazy_dependencies_enum.pb.Po
make[3]: Leaving directory '/tmp/B.3GW_Hy/BUILD/protobuf-3.5.1.1/src'
make[3]: Entering directory '/tmp/B.3GW_Hy/BUILD/protobuf-3.5.1.1/src'
x86_64-pld-linux-g++ -DHAVE_CONFIG_H -I. -I..  -I/usr/include/gtest -I/usr/src/gmock/src -DGOOGLE_PROTOBUF_NO_RTTI -pthread -DHAVE_PTHREAD=1 -DHAVE_ZLIB=1 -Wall -Wno-sign-compare -O2 -pipe -Wformat -Werror=format-security -gdwarf-4 -fno-debug-types-section -fvar-tracking-assignments -g2 -Wp,-D_FORTIFY_SOURCE=2 -fstack-protector-strong --param=ssp-buffer-size=4 -fPIC -march=x86-64 -gdwarf-4 -fno-debug-types-section -fvar-tracking-assignments -g2  -MT google/protobuf/protobuf_test-unittest_lazy_dependencies.pb.o -MD -MP -MF google/protobuf/.deps/protobuf_test-unittest_lazy_dependencies.pb.Tpo -c -o google/protobuf/protobuf_test-unittest_lazy_dependencies.pb.o `test -f 'google/protobuf/unittest_lazy_dependencies.pb.cc' || echo './'`google/protobuf/unittest_lazy_dependencies.pb.cc
mv -f google/protobuf/.deps/protobuf_test-unittest_lazy_dependencies.pb.Tpo google/protobuf/.deps/protobuf_test-unittest_lazy_dependencies.pb.Po
make[3]: Leaving directory '/tmp/B.3GW_Hy/BUILD/protobuf-3.5.1.1/src'
make[3]: Entering directory '/tmp/B.3GW_Hy/BUILD/protobuf-3.5.1.1/src'
x86_64-pld-linux-g++ -DHAVE_CONFIG_H -I. -I..  -I/usr/include/gtest -I/usr/src/gmock/src -DGOOGLE_PROTOBUF_NO_RTTI -pthread -DHAVE_PTHREAD=1 -DHAVE_ZLIB=1 -Wall -Wno-sign-compare -O2 -pipe -Wformat -Werror=format-security -gdwarf-4 -fno-debug-types-section -fvar-tracking-assignments -g2 -Wp,-D_FORTIFY_SOURCE=2 -fstack-protector-strong --param=ssp-buffer-size=4 -fPIC -march=x86-64 -gdwarf-4 -fno-debug-types-section -fvar-tracking-assignments -g2  -MT google/protobuf/protobuf_test-unittest_lazy_dependencies_custom_option.pb.o -MD -MP -MF google/protobuf/.deps/protobuf_test-unittest_lazy_dependencies_custom_option.pb.Tpo -c -o google/protobuf/protobuf_test-unittest_lazy_dependencies_custom_option.pb.o `test -f 'google/protobuf/unittest_lazy_dependencies_custom_option.pb.cc' || echo './'`google/protobuf/unittest_lazy_dependencies_custom_option.pb.cc
mv -f google/protobuf/.deps/protobuf_test-unittest_lazy_dependencies_custom_option.pb.Tpo google/protobuf/.deps/protobuf_test-unittest_lazy_dependencies_custom_option.pb.Po
make[3]: Leaving directory '/tmp/B.3GW_Hy/BUILD/protobuf-3.5.1.1/src'
make[3]: Entering directory '/tmp/B.3GW_Hy/BUILD/protobuf-3.5.1.1/src'
x86_64-pld-linux-g++ -DHAVE_CONFIG_H -I. -I..  -I/usr/include/gtest -I/usr/src/gmock/src -DGOOGLE_PROTOBUF_NO_RTTI -pthread -DHAVE_PTHREAD=1 -DHAVE_ZLIB=1 -Wall -Wno-sign-compare -O2 -pipe -Wformat -Werror=format-security -gdwarf-4 -fno-debug-types-section -fvar-tracking-assignments -g2 -Wp,-D_FORTIFY_SOURCE=2 -fstack-protector-strong --param=ssp-buffer-size=4 -fPIC -march=x86-64 -gdwarf-4 -fno-debug-types-section -fvar-tracking-assignments -g2  -MT google/protobuf/protobuf_test-unittest_mset_wire_format.pb.o -MD -MP -MF google/protobuf/.deps/protobuf_test-unittest_mset_wire_format.pb.Tpo -c -o google/protobuf/protobuf_test-unittest_mset_wire_format.pb.o `test -f 'google/protobuf/unittest_mset_wire_format.pb.cc' || echo './'`google/protobuf/unittest_mset_wire_format.pb.cc
mv -f google/protobuf/.deps/protobuf_test-unittest_mset_wire_format.pb.Tpo google/protobuf/.deps/protobuf_test-unittest_mset_wire_format.pb.Po
make[3]: Leaving directory '/tmp/B.3GW_Hy/BUILD/protobuf-3.5.1.1/src'
make[3]: Entering directory '/tmp/B.3GW_Hy/BUILD/protobuf-3.5.1.1/src'
x86_64-pld-linux-g++ -DHAVE_CONFIG_H -I. -I..  -I/usr/include/gtest -I/usr/src/gmock/src -DGOOGLE_PROTOBUF_NO_RTTI -pthread -DHAVE_PTHREAD=1 -DHAVE_ZLIB=1 -Wall -Wno-sign-compare -O2 -pipe -Wformat -Werror=format-security -gdwarf-4 -fno-debug-types-section -fvar-tracking-assignments -g2 -Wp,-D_FORTIFY_SOURCE=2 -fstack-protector-strong --param=ssp-buffer-size=4 -fPIC -march=x86-64 -gdwarf-4 -fno-debug-types-section -fvar-tracking-assignments -g2  -MT google/protobuf/protobuf_test-unittest_lite_imports_nonlite.pb.o -MD -MP -MF google/protobuf/.deps/protobuf_test-unittest_lite_imports_nonlite.pb.Tpo -c -o google/protobuf/protobuf_test-unittest_lite_imports_nonlite.pb.o `test -f 'google/protobuf/unittest_lite_imports_nonlite.pb.cc' || echo './'`google/protobuf/unittest_lite_imports_nonlite.pb.cc
mv -f google/protobuf/.deps/protobuf_test-unittest_lite_imports_nonlite.pb.Tpo google/protobuf/.deps/protobuf_test-unittest_lite_imports_nonlite.pb.Po
make[3]: Leaving directory '/tmp/B.3GW_Hy/BUILD/protobuf-3.5.1.1/src'
make[3]: Entering directory '/tmp/B.3GW_Hy/BUILD/protobuf-3.5.1.1/src'
x86_64-pld-linux-g++ -DHAVE_CONFIG_H -I. -I..  -I/usr/include/gtest -I/usr/src/gmock/src -DGOOGLE_PROTOBUF_NO_RTTI -pthread -DHAVE_PTHREAD=1 -DHAVE_ZLIB=1 -Wall -Wno-sign-compare -O2 -pipe -Wformat -Werror=format-security -gdwarf-4 -fno-debug-types-section -fvar-tracking-assignments -g2 -Wp,-D_FORTIFY_SOURCE=2 -fstack-protector-strong --param=ssp-buffer-size=4 -fPIC -march=x86-64 -gdwarf-4 -fno-debug-types-section -fvar-tracking-assignments -g2  -MT google/protobuf/protobuf_test-unittest_mset.pb.o -MD -MP -MF google/protobuf/.deps/protobuf_test-unittest_mset.pb.Tpo -c -o google/protobuf/protobuf_test-unittest_mset.pb.o `test -f 'google/protobuf/unittest_mset.pb.cc' || echo './'`google/protobuf/unittest_mset.pb.cc
mv -f google/protobuf/.deps/protobuf_test-unittest_mset.pb.Tpo google/protobuf/.deps/protobuf_test-unittest_mset.pb.Po
make[3]: Leaving directory '/tmp/B.3GW_Hy/BUILD/protobuf-3.5.1.1/src'
make[3]: Entering directory '/tmp/B.3GW_Hy/BUILD/protobuf-3.5.1.1/src'
x86_64-pld-linux-g++ -DHAVE_CONFIG_H -I. -I..  -I/usr/include/gtest -I/usr/src/gmock/src -DGOOGLE_PROTOBUF_NO_RTTI -pthread -DHAVE_PTHREAD=1 -DHAVE_ZLIB=1 -Wall -Wno-sign-compare -O2 -pipe -Wformat -Werror=format-security -gdwarf-4 -fno-debug-types-section -fvar-tracking-assignments -g2 -Wp,-D_FORTIFY_SOURCE=2 -fstack-protector-strong --param=ssp-buffer-size=4 -fPIC -march=x86-64 -gdwarf-4 -fno-debug-types-section -fvar-tracking-assignments -g2  -MT google/protobuf/protobuf_test-unittest_no_arena_import.pb.o -MD -MP -MF google/protobuf/.deps/protobuf_test-unittest_no_arena_import.pb.Tpo -c -o google/protobuf/protobuf_test-unittest_no_arena_import.pb.o `test -f 'google/protobuf/unittest_no_arena_import.pb.cc' || echo './'`google/protobuf/unittest_no_arena_import.pb.cc
mv -f google/protobuf/.deps/protobuf_test-unittest_no_arena_import.pb.Tpo google/protobuf/.deps/protobuf_test-unittest_no_arena_import.pb.Po
make[3]: Leaving directory '/tmp/B.3GW_Hy/BUILD/protobuf-3.5.1.1/src'
make[3]: Entering directory '/tmp/B.3GW_Hy/BUILD/protobuf-3.5.1.1/src'
x86_64-pld-linux-g++ -DHAVE_CONFIG_H -I. -I..  -I/usr/include/gtest -I/usr/src/gmock/src -DGOOGLE_PROTOBUF_NO_RTTI -pthread -DHAVE_PTHREAD=1 -DHAVE_ZLIB=1 -Wall -Wno-sign-compare -O2 -pipe -Wformat -Werror=format-security -gdwarf-4 -fno-debug-types-section -fvar-tracking-assignments -g2 -Wp,-D_FORTIFY_SOURCE=2 -fstack-protector-strong --param=ssp-buffer-size=4 -fPIC -march=x86-64 -gdwarf-4 -fno-debug-types-section -fvar-tracking-assignments -g2  -MT google/protobuf/protobuf_test-unittest_no_generic_services.pb.o -MD -MP -MF google/protobuf/.deps/protobuf_test-unittest_no_generic_services.pb.Tpo -c -o google/protobuf/protobuf_test-unittest_no_generic_services.pb.o `test -f 'google/protobuf/unittest_no_generic_services.pb.cc' || echo './'`google/protobuf/unittest_no_generic_services.pb.cc
mv -f google/protobuf/.deps/protobuf_test-unittest_no_generic_services.pb.Tpo google/protobuf/.deps/protobuf_test-unittest_no_generic_services.pb.Po
make[3]: Leaving directory '/tmp/B.3GW_Hy/BUILD/protobuf-3.5.1.1/src'
make[3]: Entering directory '/tmp/B.3GW_Hy/BUILD/protobuf-3.5.1.1/src'
x86_64-pld-linux-g++ -DHAVE_CONFIG_H -I. -I..  -I/usr/include/gtest -I/usr/src/gmock/src -DGOOGLE_PROTOBUF_NO_RTTI -pthread -DHAVE_PTHREAD=1 -DHAVE_ZLIB=1 -Wall -Wno-sign-compare -O2 -pipe -Wformat -Werror=format-security -gdwarf-4 -fno-debug-types-section -fvar-tracking-assignments -g2 -Wp,-D_FORTIFY_SOURCE=2 -fstack-protector-strong --param=ssp-buffer-size=4 -fPIC -march=x86-64 -gdwarf-4 -fno-debug-types-section -fvar-tracking-assignments -g2  -MT google/protobuf/protobuf_test-unittest_optimize_for.pb.o -MD -MP -MF google/protobuf/.deps/protobuf_test-unittest_optimize_for.pb.Tpo -c -o google/protobuf/protobuf_test-unittest_optimize_for.pb.o `test -f 'google/protobuf/unittest_optimize_for.pb.cc' || echo './'`google/protobuf/unittest_optimize_for.pb.cc
mv -f google/protobuf/.deps/protobuf_test-unittest_optimize_for.pb.Tpo google/protobuf/.deps/protobuf_test-unittest_optimize_for.pb.Po
make[3]: Leaving directory '/tmp/B.3GW_Hy/BUILD/protobuf-3.5.1.1/src'
make[3]: Entering directory '/tmp/B.3GW_Hy/BUILD/protobuf-3.5.1.1/src'
x86_64-pld-linux-g++ -DHAVE_CONFIG_H -I. -I..  -I/usr/include/gtest -I/usr/src/gmock/src -DGOOGLE_PROTOBUF_NO_RTTI -pthread -DHAVE_PTHREAD=1 -DHAVE_ZLIB=1 -Wall -Wno-sign-compare -O2 -pipe -Wformat -Werror=format-security -gdwarf-4 -fno-debug-types-section -fvar-tracking-assignments -g2 -Wp,-D_FORTIFY_SOURCE=2 -fstack-protector-strong --param=ssp-buffer-size=4 -fPIC -march=x86-64 -gdwarf-4 -fno-debug-types-section -fvar-tracking-assignments -g2  -MT google/protobuf/protobuf_test-map_test_util.o -MD -MP -MF google/protobuf/.deps/protobuf_test-map_test_util.Tpo -c -o google/protobuf/protobuf_test-map_test_util.o `test -f 'google/protobuf/map_test_util.cc' || echo './'`google/protobuf/map_test_util.cc
mv -f google/protobuf/.deps/protobuf_test-map_test_util.Tpo google/protobuf/.deps/protobuf_test-map_test_util.Po
make[3]: Leaving directory '/tmp/B.3GW_Hy/BUILD/protobuf-3.5.1.1/src'
make[3]: Entering directory '/tmp/B.3GW_Hy/BUILD/protobuf-3.5.1.1/src'
x86_64-pld-linux-g++ -DHAVE_CONFIG_H -I. -I..  -I/usr/include/gtest -I/usr/src/gmock/src -DGOOGLE_PROTOBUF_NO_RTTI -pthread -DHAVE_PTHREAD=1 -DHAVE_ZLIB=1 -Wall -Wno-sign-compare -O2 -pipe -Wformat -Werror=format-security -gdwarf-4 -fno-debug-types-section -fvar-tracking-assignments -g2 -Wp,-D_FORTIFY_SOURCE=2 -fstack-protector-strong --param=ssp-buffer-size=4 -fPIC -march=x86-64 -gdwarf-4 -fno-debug-types-section -fvar-tracking-assignments -g2  -MT google/protobuf/protobuf_test-unittest_no_field_presence.pb.o -MD -MP -MF google/protobuf/.deps/protobuf_test-unittest_no_field_presence.pb.Tpo -c -o google/protobuf/protobuf_test-unittest_no_field_presence.pb.o `test -f 'google/protobuf/unittest_no_field_presence.pb.cc' || echo './'`google/protobuf/unittest_no_field_presence.pb.cc
mv -f google/protobuf/.deps/protobuf_test-unittest_no_field_presence.pb.Tpo google/protobuf/.deps/protobuf_test-unittest_no_field_presence.pb.Po
make[3]: Leaving directory '/tmp/B.3GW_Hy/BUILD/protobuf-3.5.1.1/src'
make[3]: Entering directory '/tmp/B.3GW_Hy/BUILD/protobuf-3.5.1.1/src'
x86_64-pld-linux-g++ -DHAVE_CONFIG_H -I. -I..  -I/usr/include/gtest -I/usr/src/gmock/src -DGOOGLE_PROTOBUF_NO_RTTI -pthread -DHAVE_PTHREAD=1 -DHAVE_ZLIB=1 -Wall -Wno-sign-compare -O2 -pipe -Wformat -Werror=format-security -gdwarf-4 -fno-debug-types-section -fvar-tracking-assignments -g2 -Wp,-D_FORTIFY_SOURCE=2 -fstack-protector-strong --param=ssp-buffer-size=4 -fPIC -march=x86-64 -gdwarf-4 -fno-debug-types-section -fvar-tracking-assignments -g2  -MT google/protobuf/protobuf_test-unittest_no_arena.pb.o -MD -MP -MF google/protobuf/.deps/protobuf_test-unittest_no_arena.pb.Tpo -c -o google/protobuf/protobuf_test-unittest_no_arena.pb.o `test -f 'google/protobuf/unittest_no_arena.pb.cc' || echo './'`google/protobuf/unittest_no_arena.pb.cc
mv -f google/protobuf/.deps/protobuf_test-unittest_no_arena.pb.Tpo google/protobuf/.deps/protobuf_test-unittest_no_arena.pb.Po
make[3]: Leaving directory '/tmp/B.3GW_Hy/BUILD/protobuf-3.5.1.1/src'
make[3]: Entering directory '/tmp/B.3GW_Hy/BUILD/protobuf-3.5.1.1/src'
x86_64-pld-linux-g++ -DHAVE_CONFIG_H -I. -I..  -I/usr/include/gtest -I/usr/src/gmock/src -DGOOGLE_PROTOBUF_NO_RTTI -pthread -DHAVE_PTHREAD=1 -DHAVE_ZLIB=1 -Wall -Wno-sign-compare -O2 -pipe -Wformat -Werror=format-security -gdwarf-4 -fno-debug-types-section -fvar-tracking-assignments -g2 -Wp,-D_FORTIFY_SOURCE=2 -fstack-protector-strong --param=ssp-buffer-size=4 -fPIC -march=x86-64 -gdwarf-4 -fno-debug-types-section -fvar-tracking-assignments -g2  -MT google/protobuf/protobuf_test-unittest_preserve_unknown_enum2.pb.o -MD -MP -MF google/protobuf/.deps/protobuf_test-unittest_preserve_unknown_enum2.pb.Tpo -c -o google/protobuf/protobuf_test-unittest_preserve_unknown_enum2.pb.o `test -f 'google/protobuf/unittest_preserve_unknown_enum2.pb.cc' || echo './'`google/protobuf/unittest_preserve_unknown_enum2.pb.cc
mv -f google/protobuf/.deps/protobuf_test-unittest_preserve_unknown_enum2.pb.Tpo google/protobuf/.deps/protobuf_test-unittest_preserve_unknown_enum2.pb.Po
make[3]: Leaving directory '/tmp/B.3GW_Hy/BUILD/protobuf-3.5.1.1/src'
make[3]: Entering directory '/tmp/B.3GW_Hy/BUILD/protobuf-3.5.1.1/src'
x86_64-pld-linux-g++ -DHAVE_CONFIG_H -I. -I..  -I/usr/include/gtest -I/usr/src/gmock/src -DGOOGLE_PROTOBUF_NO_RTTI -pthread -DHAVE_PTHREAD=1 -DHAVE_ZLIB=1 -Wall -Wno-sign-compare -O2 -pipe -Wformat -Werror=format-security -gdwarf-4 -fno-debug-types-section -fvar-tracking-assignments -g2 -Wp,-D_FORTIFY_SOURCE=2 -fstack-protector-strong --param=ssp-buffer-size=4 -fPIC -march=x86-64 -gdwarf-4 -fno-debug-types-section -fvar-tracking-assignments -g2  -MT google/protobuf/protobuf_test-unittest_preserve_unknown_enum.pb.o -MD -MP -MF google/protobuf/.deps/protobuf_test-unittest_preserve_unknown_enum.pb.Tpo -c -o google/protobuf/protobuf_test-unittest_preserve_unknown_enum.pb.o `test -f 'google/protobuf/unittest_preserve_unknown_enum.pb.cc' || echo './'`google/protobuf/unittest_preserve_unknown_enum.pb.cc
mv -f google/protobuf/.deps/protobuf_test-unittest_preserve_unknown_enum.pb.Tpo google/protobuf/.deps/protobuf_test-unittest_preserve_unknown_enum.pb.Po
make[3]: Leaving directory '/tmp/B.3GW_Hy/BUILD/protobuf-3.5.1.1/src'
make[3]: Entering directory '/tmp/B.3GW_Hy/BUILD/protobuf-3.5.1.1/src'
x86_64-pld-linux-g++ -DHAVE_CONFIG_H -I. -I..  -I/usr/include/gtest -I/usr/src/gmock/src -DGOOGLE_PROTOBUF_NO_RTTI -pthread -DHAVE_PTHREAD=1 -DHAVE_ZLIB=1 -Wall -Wno-sign-compare -O2 -pipe -Wformat -Werror=format-security -gdwarf-4 -fno-debug-types-section -fvar-tracking-assignments -g2 -Wp,-D_FORTIFY_SOURCE=2 -fstack-protector-strong --param=ssp-buffer-size=4 -fPIC -march=x86-64 -gdwarf-4 -fno-debug-types-section -fvar-tracking-assignments -g2  -MT google/protobuf/protobuf_test-map_proto2_unittest.pb.o -MD -MP -MF google/protobuf/.deps/protobuf_test-map_proto2_unittest.pb.Tpo -c -o google/protobuf/protobuf_test-map_proto2_unittest.pb.o `test -f 'google/protobuf/map_proto2_unittest.pb.cc' || echo './'`google/protobuf/map_proto2_unittest.pb.cc
mv -f google/protobuf/.deps/protobuf_test-map_proto2_unittest.pb.Tpo google/protobuf/.deps/protobuf_test-map_proto2_unittest.pb.Po
make[3]: Leaving directory '/tmp/B.3GW_Hy/BUILD/protobuf-3.5.1.1/src'
make[3]: Entering directory '/tmp/B.3GW_Hy/BUILD/protobuf-3.5.1.1/src'
x86_64-pld-linux-g++ -DHAVE_CONFIG_H -I. -I..  -I/usr/include/gtest -I/usr/src/gmock/src -DGOOGLE_PROTOBUF_NO_RTTI -pthread -DHAVE_PTHREAD=1 -DHAVE_ZLIB=1 -Wall -Wno-sign-compare -O2 -pipe -Wformat -Werror=format-security -gdwarf-4 -fno-debug-types-section -fvar-tracking-assignments -g2 -Wp,-D_FORTIFY_SOURCE=2 -fstack-protector-strong --param=ssp-buffer-size=4 -fPIC -march=x86-64 -gdwarf-4 -fno-debug-types-section -fvar-tracking-assignments -g2  -MT google/protobuf/protobuf_test-unittest_proto3_arena.pb.o -MD -MP -MF google/protobuf/.deps/protobuf_test-unittest_proto3_arena.pb.Tpo -c -o google/protobuf/protobuf_test-unittest_proto3_arena.pb.o `test -f 'google/protobuf/unittest_proto3_arena.pb.cc' || echo './'`google/protobuf/unittest_proto3_arena.pb.cc
mv -f google/protobuf/.deps/protobuf_test-unittest_proto3_arena.pb.Tpo google/protobuf/.deps/protobuf_test-unittest_proto3_arena.pb.Po
make[3]: Leaving directory '/tmp/B.3GW_Hy/BUILD/protobuf-3.5.1.1/src'
make[3]: Entering directory '/tmp/B.3GW_Hy/BUILD/protobuf-3.5.1.1/src'
x86_64-pld-linux-g++ -DHAVE_CONFIG_H -I. -I..  -I/usr/include/gtest -I/usr/src/gmock/src -DGOOGLE_PROTOBUF_NO_RTTI -pthread -DHAVE_PTHREAD=1 -DHAVE_ZLIB=1 -Wall -Wno-sign-compare -O2 -pipe -Wformat -Werror=format-security -gdwarf-4 -fno-debug-types-section -fvar-tracking-assignments -g2 -Wp,-D_FORTIFY_SOURCE=2 -fstack-protector-strong --param=ssp-buffer-size=4 -fPIC -march=x86-64 -gdwarf-4 -fno-debug-types-section -fvar-tracking-assignments -g2  -MT google/protobuf/protobuf_test-map_lite_unittest.pb.o -MD -MP -MF google/protobuf/.deps/protobuf_test-map_lite_unittest.pb.Tpo -c -o google/protobuf/protobuf_test-map_lite_unittest.pb.o `test -f 'google/protobuf/map_lite_unittest.pb.cc' || echo './'`google/protobuf/map_lite_unittest.pb.cc
mv -f google/protobuf/.deps/protobuf_test-map_lite_unittest.pb.Tpo google/protobuf/.deps/protobuf_test-map_lite_unittest.pb.Po
make[3]: Leaving directory '/tmp/B.3GW_Hy/BUILD/protobuf-3.5.1.1/src'
make[3]: *** No rule to make target 'gmock_main.cc', needed by 'gmock_main.lo'.  Stop.
make[3]: *** Waiting for unfinished jobs....
make[3]: Entering directory '/tmp/B.3GW_Hy/BUILD/protobuf-3.5.1.1/src'
x86_64-pld-linux-g++ -DHAVE_CONFIG_H -I. -I..  -I/usr/include/gtest -I/usr/src/gmock/src -DGOOGLE_PROTOBUF_NO_RTTI -pthread -DHAVE_PTHREAD=1 -DHAVE_ZLIB=1 -Wall -Wno-sign-compare -O2 -pipe -Wformat -Werror=format-security -gdwarf-4 -fno-debug-types-section -fvar-tracking-assignments -g2 -Wp,-D_FORTIFY_SOURCE=2 -fstack-protector-strong --param=ssp-buffer-size=4 -fPIC -march=x86-64 -gdwarf-4 -fno-debug-types-section -fvar-tracking-assignments -g2  -MT google/protobuf/protobuf_test-unittest_proto3_arena_lite.pb.o -MD -MP -MF google/protobuf/.deps/protobuf_test-unittest_proto3_arena_lite.pb.Tpo -c -o google/protobuf/protobuf_test-unittest_proto3_arena_lite.pb.o `test -f 'google/protobuf/unittest_proto3_arena_lite.pb.cc' || echo './'`google/protobuf/unittest_proto3_arena_lite.pb.cc
mv -f google/protobuf/.deps/protobuf_test-unittest_proto3_arena_lite.pb.Tpo google/protobuf/.deps/protobuf_test-unittest_proto3_arena_lite.pb.Po
make[3]: Leaving directory '/tmp/B.3GW_Hy/BUILD/protobuf-3.5.1.1/src'
make[3]: Entering directory '/tmp/B.3GW_Hy/BUILD/protobuf-3.5.1.1/src'
x86_64-pld-linux-g++ -DHAVE_CONFIG_H -I. -I..  -I/usr/include/gtest -I/usr/src/gmock/src -DGOOGLE_PROTOBUF_NO_RTTI -pthread -DHAVE_PTHREAD=1 -DHAVE_ZLIB=1 -Wall -Wno-sign-compare -O2 -pipe -Wformat -Werror=format-security -gdwarf-4 -fno-debug-types-section -fvar-tracking-assignments -g2 -Wp,-D_FORTIFY_SOURCE=2 -fstack-protector-strong --param=ssp-buffer-size=4 -fPIC -march=x86-64 -gdwarf-4 -fno-debug-types-section -fvar-tracking-assignments -g2  -MT google/protobuf/protobuf_test-unittest_proto3_lite.pb.o -MD -MP -MF google/protobuf/.deps/protobuf_test-unittest_proto3_lite.pb.Tpo -c -o google/protobuf/protobuf_test-unittest_proto3_lite.pb.o `test -f 'google/protobuf/unittest_proto3_lite.pb.cc' || echo './'`google/protobuf/unittest_proto3_lite.pb.cc
mv -f google/protobuf/.deps/protobuf_test-unittest_proto3_lite.pb.Tpo google/protobuf/.deps/protobuf_test-unittest_proto3_lite.pb.Po
make[3]: Leaving directory '/tmp/B.3GW_Hy/BUILD/protobuf-3.5.1.1/src'
make[3]: Entering directory '/tmp/B.3GW_Hy/BUILD/protobuf-3.5.1.1/src'
x86_64-pld-linux-g++ -DHAVE_CONFIG_H -I. -I..  -I/usr/include/gtest -I/usr/src/gmock/src -DGOOGLE_PROTOBUF_NO_RTTI -pthread -DHAVE_PTHREAD=1 -DHAVE_ZLIB=1 -Wall -Wno-sign-compare -O2 -pipe -Wformat -Werror=format-security -gdwarf-4 -fno-debug-types-section -fvar-tracking-assignments -g2 -Wp,-D_FORTIFY_SOURCE=2 -fstack-protector-strong --param=ssp-buffer-size=4 -fPIC -march=x86-64 -gdwarf-4 -fno-debug-types-section -fvar-tracking-assignments -g2  -MT google/protobuf/util/protobuf_test-message_differencer_unittest.pb.o -MD -MP -MF google/protobuf/util/.deps/protobuf_test-message_differencer_unittest.pb.Tpo -c -o google/protobuf/util/protobuf_test-message_differencer_unittest.pb.o `test -f 'google/protobuf/util/message_differencer_unittest.pb.cc' || echo './'`google/protobuf/util/message_differencer_unittest.pb.cc
mv -f google/protobuf/util/.deps/protobuf_test-message_differencer_unittest.pb.Tpo google/protobuf/util/.deps/protobuf_test-message_differencer_unittest.pb.Po
make[3]: Leaving directory '/tmp/B.3GW_Hy/BUILD/protobuf-3.5.1.1/src'
make[3]: Entering directory '/tmp/B.3GW_Hy/BUILD/protobuf-3.5.1.1/src'
x86_64-pld-linux-g++ -DHAVE_CONFIG_H -I. -I..  -I/usr/include/gtest -I/usr/src/gmock/src -DGOOGLE_PROTOBUF_NO_RTTI -pthread -DHAVE_PTHREAD=1 -DHAVE_ZLIB=1 -Wall -Wno-sign-compare -O2 -pipe -Wformat -Werror=format-security -gdwarf-4 -fno-debug-types-section -fvar-tracking-assignments -g2 -Wp,-D_FORTIFY_SOURCE=2 -fstack-protector-strong --param=ssp-buffer-size=4 -fPIC -march=x86-64 -gdwarf-4 -fno-debug-types-section -fvar-tracking-assignments -g2  -MT google/protobuf/protobuf_test-unittest.pb.o -MD -MP -MF google/protobuf/.deps/protobuf_test-unittest.pb.Tpo -c -o google/protobuf/protobuf_test-unittest.pb.o `test -f 'google/protobuf/unittest.pb.cc' || echo './'`google/protobuf/unittest.pb.cc
mv -f google/protobuf/.deps/protobuf_test-unittest.pb.Tpo google/protobuf/.deps/protobuf_test-unittest.pb.Po
make[3]: Leaving directory '/tmp/B.3GW_Hy/BUILD/protobuf-3.5.1.1/src'
make[3]: Entering directory '/tmp/B.3GW_Hy/BUILD/protobuf-3.5.1.1/src'
x86_64-pld-linux-g++ -DHAVE_CONFIG_H -I. -I..  -I/usr/include/gtest -I/usr/src/gmock/src -DGOOGLE_PROTOBUF_NO_RTTI -pthread -DHAVE_PTHREAD=1 -DHAVE_ZLIB=1 -Wall -Wno-sign-compare -O2 -pipe -Wformat -Werror=format-security -gdwarf-4 -fno-debug-types-section -fvar-tracking-assignments -g2 -Wp,-D_FORTIFY_SOURCE=2 -fstack-protector-strong --param=ssp-buffer-size=4 -fPIC -march=x86-64 -gdwarf-4 -fno-debug-types-section -fvar-tracking-assignments -g2  -MT google/protobuf/util/protobuf_test-json_format_proto3.pb.o -MD -MP -MF google/protobuf/util/.deps/protobuf_test-json_format_proto3.pb.Tpo -c -o google/protobuf/util/protobuf_test-json_format_proto3.pb.o `test -f 'google/protobuf/util/json_format_proto3.pb.cc' || echo './'`google/protobuf/util/json_format_proto3.pb.cc
mv -f google/protobuf/util/.deps/protobuf_test-json_format_proto3.pb.Tpo google/protobuf/util/.deps/protobuf_test-json_format_proto3.pb.Po
make[3]: Leaving directory '/tmp/B.3GW_Hy/BUILD/protobuf-3.5.1.1/src'
make[3]: Entering directory '/tmp/B.3GW_Hy/BUILD/protobuf-3.5.1.1/src'
x86_64-pld-linux-g++ -DHAVE_CONFIG_H -I. -I..  -I/usr/include/gtest -I/usr/src/gmock/src -DGOOGLE_PROTOBUF_NO_RTTI -pthread -DHAVE_PTHREAD=1 -DHAVE_ZLIB=1 -Wall -Wno-sign-compare -O2 -pipe -Wformat -Werror=format-security -gdwarf-4 -fno-debug-types-section -fvar-tracking-assignments -g2 -Wp,-D_FORTIFY_SOURCE=2 -fstack-protector-strong --param=ssp-buffer-size=4 -fPIC -march=x86-64 -gdwarf-4 -fno-debug-types-section -fvar-tracking-assignments -g2  -MT google/protobuf/protobuf_test-map_unittest.pb.o -MD -MP -MF google/protobuf/.deps/protobuf_test-map_unittest.pb.Tpo -c -o google/protobuf/protobuf_test-map_unittest.pb.o `test -f 'google/protobuf/map_unittest.pb.cc' || echo './'`google/protobuf/map_unittest.pb.cc
mv -f google/protobuf/.deps/protobuf_test-map_unittest.pb.Tpo google/protobuf/.deps/protobuf_test-map_unittest.pb.Po
make[3]: Leaving directory '/tmp/B.3GW_Hy/BUILD/protobuf-3.5.1.1/src'
make[3]: Entering directory '/tmp/B.3GW_Hy/BUILD/protobuf-3.5.1.1/src'
x86_64-pld-linux-g++ -DHAVE_CONFIG_H -I. -I..  -I/usr/include/gtest -I/usr/src/gmock/src -DGOOGLE_PROTOBUF_NO_RTTI -pthread -DHAVE_PTHREAD=1 -DHAVE_ZLIB=1 -Wall -Wno-sign-compare -O2 -pipe -Wformat -Werror=format-security -gdwarf-4 -fno-debug-types-section -fvar-tracking-assignments -g2 -Wp,-D_FORTIFY_SOURCE=2 -fstack-protector-strong --param=ssp-buffer-size=4 -fPIC -march=x86-64 -gdwarf-4 -fno-debug-types-section -fvar-tracking-assignments -g2  -MT google/protobuf/protobuf_test-unittest_well_known_types.pb.o -MD -MP -MF google/protobuf/.deps/protobuf_test-unittest_well_known_types.pb.Tpo -c -o google/protobuf/protobuf_test-unittest_well_known_types.pb.o `test -f 'google/protobuf/unittest_well_known_types.pb.cc' || echo './'`google/protobuf/unittest_well_known_types.pb.cc
mv -f google/protobuf/.deps/protobuf_test-unittest_well_known_types.pb.Tpo google/protobuf/.deps/protobuf_test-unittest_well_known_types.pb.Po
make[3]: Leaving directory '/tmp/B.3GW_Hy/BUILD/protobuf-3.5.1.1/src'
make[3]: Entering directory '/tmp/B.3GW_Hy/BUILD/protobuf-3.5.1.1/src'
x86_64-pld-linux-g++ -DHAVE_CONFIG_H -I. -I..  -I/usr/include/gtest -I/usr/src/gmock/src -DGOOGLE_PROTOBUF_NO_RTTI -pthread -DHAVE_PTHREAD=1 -DHAVE_ZLIB=1 -Wall -Wno-sign-compare -O2 -pipe -Wformat -Werror=format-security -gdwarf-4 -fno-debug-types-section -fvar-tracking-assignments -g2 -Wp,-D_FORTIFY_SOURCE=2 -fstack-protector-strong --param=ssp-buffer-size=4 -fPIC -march=x86-64 -gdwarf-4 -fno-debug-types-section -fvar-tracking-assignments -g2  -MT google/protobuf/protobuf_test-test_util.o -MD -MP -MF google/protobuf/.deps/protobuf_test-test_util.Tpo -c -o google/protobuf/protobuf_test-test_util.o `test -f 'google/protobuf/test_util.cc' || echo './'`google/protobuf/test_util.cc
mv -f google/protobuf/.deps/protobuf_test-test_util.Tpo google/protobuf/.deps/protobuf_test-test_util.Po
make[3]: Leaving directory '/tmp/B.3GW_Hy/BUILD/protobuf-3.5.1.1/src'
make[3]: Entering directory '/tmp/B.3GW_Hy/BUILD/protobuf-3.5.1.1/src'
x86_64-pld-linux-g++ -DHAVE_CONFIG_H -I. -I..  -I/usr/include/gtest -I/usr/src/gmock/src -DGOOGLE_PROTOBUF_NO_RTTI -pthread -DHAVE_PTHREAD=1 -DHAVE_ZLIB=1 -Wall -Wno-sign-compare -O2 -pipe -Wformat -Werror=format-security -gdwarf-4 -fno-debug-types-section -fvar-tracking-assignments -g2 -Wp,-D_FORTIFY_SOURCE=2 -fstack-protector-strong --param=ssp-buffer-size=4 -fPIC -march=x86-64 -gdwarf-4 -fno-debug-types-section -fvar-tracking-assignments -g2  -MT google/protobuf/protobuf_test-unittest_enormous_descriptor.pb.o -MD -MP -MF google/protobuf/.deps/protobuf_test-unittest_enormous_descriptor.pb.Tpo -c -o google/protobuf/protobuf_test-unittest_enormous_descriptor.pb.o `test -f 'google/protobuf/unittest_enormous_descriptor.pb.cc' || echo './'`google/protobuf/unittest_enormous_descriptor.pb.cc
google/protobuf/unittest_enormous_descriptor.pb.cc: In function 'void protobuf_google_2fprotobuf_2funittest_5fenormous_5fdescriptor_2eproto::InitDefaultsTestEnormousDescriptorImpl()':
google/protobuf/unittest_enormous_descriptor.pb.cc:32:6: note: variable tracking size limit exceeded with -fvar-tracking-assignments, retrying without
 void InitDefaultsTestEnormousDescriptorImpl() {
      ^~~~~~~~~~~~~~~~~~~~~~~~~~~~~~~~~~~~~~
mv -f google/protobuf/.deps/protobuf_test-unittest_enormous_descriptor.pb.Tpo google/protobuf/.deps/protobuf_test-unittest_enormous_descriptor.pb.Po
make[3]: Leaving directory '/tmp/B.3GW_Hy/BUILD/protobuf-3.5.1.1/src'
make[2]: *** [Makefile:8487: check-am] Error 2
make[1]: *** [Makefile:8490: check] Error 2
make: *** [Makefile:1557: check-recursive] Error 1
error: Bad exit status from /tmp/B.3GW_Hy/BUILD/tmp/rpm-tmp.56482 (%build)


RPM build errors:
    Bad exit status from /tmp/B.3GW_Hy/BUILD/tmp/rpm-tmp.56482 (%build)
ended at: Wed Jun  6 09:03:55 2018, done in 0:06:29.612981
error: No files produced.
mesg: ttyname failed: Inappropriate ioctl for device
+ chmod -R u+rwX /tmp/B.3GW_Hy/BUILD
+ rm -rf /tmp/B.3GW_Hy/tmp /tmp/B.3GW_Hy/BUILD
mesg: ttyname failed: Inappropriate ioctl for device
+ rm -rf /tmp/B.3GW_Hy
Begin-PLD-Builder-Info
Build-Time: user:2119.60s sys:105.45s real:393.97s (faults io:0 non-io:28273536)

End-PLD-Builder-Info
[Back to list of logs] [View rpm -qa of builder]