FailedOk

th/SRPMS[OK]
th/x32[OK]
th/i686[OK]
th/x86_64[OK]

ac/SRPMS[OK]
ac/i386[OK]
ac/i586[OK]
ac/i686[OK]
ac/alpha[OK]
ac/amd64[OK]
ac/athlon[OK]
ac/ppc[OK]
ac/sparc[OK]
ac/sparc64[OK]

Advanced Search
main()
Powered by PLD Linux
(c) 2002-2017 PLD Team
$Revision: 1.37 $
Powered by x-files.
Your IP: 54.225.42.99

protoshares 8e1da2d2-d227-428a-9908-7a9551dc277e

Status:Failed
Source URL:ftp://buildlogs.pld-linux.org/th/x86_64/FAIL/protoshares,8e1da2d2-d227-428a-9908-7a9551dc277e.bz2
text/plain URL:View!
full text:View!
rpm -qa of builder:View!
Date:2017/04/16 14:31:06
Runtime:0:01:01.759878

Toc:

  • error 1
  • src/net.cpp:1087:68: error: invalid conversion from 'int*' to 'unsigned char' [-fpermissive]
  • error 2
  • src/net.cpp:1087:74: error: too few arguments to function 'UPNPDev* upnpDiscover(int, const char*, const char*, int, int, unsigned char, int*)'
  • error 3
  • error: Bad exit status from /tmp/B.huokgH/BUILD/tmp/rpm-tmp.35676 (%build)
  • error 4
  • RPM build errors:
  • error 5
  • error: No files produced.

Content:

         "    nRelayUntil  = %"PRI64d"\n"
         ^
src/alert.cpp:55:9: warning: C++11 requires a space between string literal and macro [-Wc++11-compat]
         "    nExpiration  = %"PRI64d"\n"
         ^
x86_64-pld-linux-g++ -c -pipe -fstack-protector-all -D_FORTIFY_SOURCE=2 -O2 -O2 -fwrapv -pipe -Wformat -Werror=format-security -gdwarf-4 -fno-debug-types-section -fvar-tracking-assignments -g2 -Wp,-D_FORTIFY_SOURCE=2 -fno-strict-aliasing -std=gnu++98 -fstack-protector-strong --param=ssp-buffer-size=4 -fPIC -march=x86-64 -gdwarf-4 -fno-debug-types-section -fvar-tracking-assignments -g2 -D_REENTRANT -fdiagnostics-show-option -Wall -Wextra -Wformat -Wformat-security -Wno-unused-parameter -Wstack-protector -DQT_GUI -DBOOST_THREAD_USE_LIB -DBOOST_SPIRIT_THREADSAFE -DUSE_QRCODE -DUSE_UPNP=1 -DSTATICLIB -DUSE_DBUS -DUSE_IPV6=1 -DHAVE_BUILD_INFO -DLINUX -D_FILE_OFFSET_BITS=64 -DQT_NO_DEBUG -DQT_DBUS_LIB -DQT_GUI_LIB -DQT_NETWORK_LIB -DQT_CORE_LIB -I/usr/share/qt4/mkspecs/linux-g++ -I/usr/include/qt4/QtCore -I/usr/include/qt4/QtNetwork -I/usr/include/qt4/QtGui -I/usr/include/qt4/QtDBus -I/usr/include/qt4 -Isrc -Isrc/json -Isrc/qt -Isrc/leveldb/include -Isrc/leveldb/helpers -Ibuild -Ibuild -o build/netbase.o src/netbase.cpp
In file included from src/netbase.cpp:7:0:
src/util.h:243:22: warning: C++11 requires a space between string literal and macro [-Wc++11-compat]
     return strprintf("%"PRI64d, n);
                      ^
x86_64-pld-linux-g++ -c -pipe -fstack-protector-all -D_FORTIFY_SOURCE=2 -O2 -O2 -fwrapv -pipe -Wformat -Werror=format-security -gdwarf-4 -fno-debug-types-section -fvar-tracking-assignments -g2 -Wp,-D_FORTIFY_SOURCE=2 -fno-strict-aliasing -std=gnu++98 -fstack-protector-strong --param=ssp-buffer-size=4 -fPIC -march=x86-64 -gdwarf-4 -fno-debug-types-section -fvar-tracking-assignments -g2 -D_REENTRANT -fdiagnostics-show-option -Wall -Wextra -Wformat -Wformat-security -Wno-unused-parameter -Wstack-protector -DQT_GUI -DBOOST_THREAD_USE_LIB -DBOOST_SPIRIT_THREADSAFE -DUSE_QRCODE -DUSE_UPNP=1 -DSTATICLIB -DUSE_DBUS -DUSE_IPV6=1 -DHAVE_BUILD_INFO -DLINUX -D_FILE_OFFSET_BITS=64 -DQT_NO_DEBUG -DQT_DBUS_LIB -DQT_GUI_LIB -DQT_NETWORK_LIB -DQT_CORE_LIB -I/usr/share/qt4/mkspecs/linux-g++ -I/usr/include/qt4/QtCore -I/usr/include/qt4/QtNetwork -I/usr/include/qt4/QtGui -I/usr/include/qt4/QtDBus -I/usr/include/qt4 -Isrc -Isrc/json -Isrc/qt -Isrc/leveldb/include -Isrc/leveldb/helpers -Ibuild -Ibuild -o build/util.o src/util.cpp
In file included from src/util.cpp:16:0:
src/util.h:243:22: warning: C++11 requires a space between string literal and macro [-Wc++11-compat]
     return strprintf("%"PRI64d, n);
                      ^
src/util.cpp:395:28: warning: C++11 requires a space between string literal and macro [-Wc++11-compat]
     string str = strprintf("%"PRI64d".%08"PRI64d, quotient, remainder);
                            ^
src/util.cpp:395:37: warning: C++11 requires a space between string literal and macro [-Wc++11-compat]
     string str = strprintf("%"PRI64d".%08"PRI64d, quotient, remainder);
                                     ^
src/util.cpp:1315:12: warning: C++11 requires a space between string literal and macro [-Wc++11-compat]
     printf("Added time data, samples %d, offset %+"PRI64d" (%+"PRI64d" minutes)\n", vTimeOffsets.size(), nOffsetSample, nOffsetSample/60);
            ^
src/util.cpp:1315:58: warning: C++11 requires a space between string literal and macro [-Wc++11-compat]
     printf("Added time data, samples %d, offset %+"PRI64d" (%+"PRI64d" minutes)\n", vTimeOffsets.size(), nOffsetSample, nOffsetSample/60);
                                                          ^
src/util.cpp:1350:24: warning: C++11 requires a space between string literal and macro [-Wc++11-compat]
                 printf("%+"PRI64d"  ", n);
                        ^
src/util.cpp:1353:16: warning: C++11 requires a space between string literal and macro [-Wc++11-compat]
         printf("nTimeOffset = %+"PRI64d"  (%+"PRI64d" minutes)\n", nTimeOffset, nTimeOffset/60);
                ^
src/util.cpp:1353:40: warning: C++11 requires a space between string literal and macro [-Wc++11-compat]
         printf("nTimeOffset = %+"PRI64d"  (%+"PRI64d" minutes)\n", nTimeOffset, nTimeOffset/60);
                                        ^
x86_64-pld-linux-g++ -c -pipe -fstack-protector-all -D_FORTIFY_SOURCE=2 -O2 -O2 -fwrapv -pipe -Wformat -Werror=format-security -gdwarf-4 -fno-debug-types-section -fvar-tracking-assignments -g2 -Wp,-D_FORTIFY_SOURCE=2 -fno-strict-aliasing -std=gnu++98 -fstack-protector-strong --param=ssp-buffer-size=4 -fPIC -march=x86-64 -gdwarf-4 -fno-debug-types-section -fvar-tracking-assignments -g2 -D_REENTRANT -fdiagnostics-show-option -Wall -Wextra -Wformat -Wformat-security -Wno-unused-parameter -Wstack-protector -DQT_GUI -DBOOST_THREAD_USE_LIB -DBOOST_SPIRIT_THREADSAFE -DUSE_QRCODE -DUSE_UPNP=1 -DSTATICLIB -DUSE_DBUS -DUSE_IPV6=1 -DHAVE_BUILD_INFO -DLINUX -D_FILE_OFFSET_BITS=64 -DQT_NO_DEBUG -DQT_DBUS_LIB -DQT_GUI_LIB -DQT_NETWORK_LIB -DQT_CORE_LIB -I/usr/share/qt4/mkspecs/linux-g++ -I/usr/include/qt4/QtCore -I/usr/include/qt4/QtNetwork -I/usr/include/qt4/QtGui -I/usr/include/qt4/QtDBus -I/usr/include/qt4 -Isrc -Isrc/json -Isrc/qt -Isrc/leveldb/include -Isrc/leveldb/helpers -Ibuild -Ibuild -o build/script.o src/script.cpp
In file included from src/bignum.h:12:0,
                 from src/script.h:15,
                 from src/script.cpp:11:
src/util.h:243:22: warning: C++11 requires a space between string literal and macro [-Wc++11-compat]
     return strprintf("%"PRI64d, n);
                      ^
In file included from src/main.h:10:0,
                 from src/script.cpp:15:
src/net.h:362:20: warning: C++11 requires a space between string literal and macro [-Wc++11-compat]
             printf("askfor %s   %"PRI64d" (%s)\n", inv.ToString().c_str(), nRequestTime, DateTimeStrFormat("%H:%M:%S", nRequestTime/1000000).c_str());
                    ^
In file included from src/script.cpp:15:0:
src/main.h:446:26: warning: C++11 requires a space between string literal and macro [-Wc++11-compat]
         return strprintf("CTxOut(nValue=%"PRI64d".%08"PRI64d", scriptPubKey=%s)", nValue / COIN, nValue % COIN, scriptPubKey.ToString().substr(0,30).c_str());
                          ^
src/main.h:446:49: warning: C++11 requires a space between string literal and macro [-Wc++11-compat]
         return strprintf("CTxOut(nValue=%"PRI64d".%08"PRI64d", scriptPubKey=%s)", nValue / COIN, nValue % COIN, scriptPubKey.ToString().substr(0,30).c_str());
                                                 ^
src/main.h:634:26: warning: C++11 requires a space between string literal and macro [-Wc++11-compat]
         str += strprintf("CTransaction(hash=%s, ver=%d, vin.size=%"PRIszu", vout.size=%"PRIszu", nLockTime=%u)\n",
                          ^
src/main.h:634:74: warning: C++11 requires a space between string literal and macro [-Wc++11-compat]
         str += strprintf("CTransaction(hash=%s, ver=%d, vin.size=%"PRIszu", vout.size=%"PRIszu", nLockTime=%u)\n",
                                                                          ^
src/main.h:1486:16: warning: C++11 requires a space between string literal and macro [-Wc++11-compat]
         printf("CBlock(hash=%s, ver=%d, hashPrevBlock=%s, hashMerkleRoot=%s, nTime=%u, nBits=%08x, nNonce=%u, vtx=%"PRIszu", birthdayA=%u, birthdayB=%u)\n",
                ^
x86_64-pld-linux-g++ -c -pipe -fstack-protector-all -D_FORTIFY_SOURCE=2 -O2 -O2 -fwrapv -pipe -Wformat -Werror=format-security -gdwarf-4 -fno-debug-types-section -fvar-tracking-assignments -g2 -Wp,-D_FORTIFY_SOURCE=2 -fno-strict-aliasing -std=gnu++98 -fstack-protector-strong --param=ssp-buffer-size=4 -fPIC -march=x86-64 -gdwarf-4 -fno-debug-types-section -fvar-tracking-assignments -g2 -D_REENTRANT -fdiagnostics-show-option -Wall -Wextra -Wformat -Wformat-security -Wno-unused-parameter -Wstack-protector -DQT_GUI -DBOOST_THREAD_USE_LIB -DBOOST_SPIRIT_THREADSAFE -DUSE_QRCODE -DUSE_UPNP=1 -DSTATICLIB -DUSE_DBUS -DUSE_IPV6=1 -DHAVE_BUILD_INFO -DLINUX -D_FILE_OFFSET_BITS=64 -DQT_NO_DEBUG -DQT_DBUS_LIB -DQT_GUI_LIB -DQT_NETWORK_LIB -DQT_CORE_LIB -I/usr/share/qt4/mkspecs/linux-g++ -I/usr/include/qt4/QtCore -I/usr/include/qt4/QtNetwork -I/usr/include/qt4/QtGui -I/usr/include/qt4/QtDBus -I/usr/include/qt4 -Isrc -Isrc/json -Isrc/qt -Isrc/leveldb/include -Isrc/leveldb/helpers -Ibuild -Ibuild -o build/net.o src/net.cpp
In file included from src/bignum.h:12:0,
                 from src/main.h:8,
                 from src/db.h:8,
                 from src/net.cpp:6:
src/util.h:243:22: warning: C++11 requires a space between string literal and macro [-Wc++11-compat]
     return strprintf("%"PRI64d, n);
                      ^
In file included from src/main.h:10:0,
                 from src/db.h:8,
                 from src/net.cpp:6:
src/net.h:362:20: warning: C++11 requires a space between string literal and macro [-Wc++11-compat]
             printf("askfor %s   %"PRI64d" (%s)\n", inv.ToString().c_str(), nRequestTime, DateTimeStrFormat("%H:%M:%S", nRequestTime/1000000).c_str());
                    ^
In file included from src/db.h:8:0,
                 from src/net.cpp:6:
src/main.h:446:26: warning: C++11 requires a space between string literal and macro [-Wc++11-compat]
         return strprintf("CTxOut(nValue=%"PRI64d".%08"PRI64d", scriptPubKey=%s)", nValue / COIN, nValue % COIN, scriptPubKey.ToString().substr(0,30).c_str());
                          ^
src/main.h:446:49: warning: C++11 requires a space between string literal and macro [-Wc++11-compat]
         return strprintf("CTxOut(nValue=%"PRI64d".%08"PRI64d", scriptPubKey=%s)", nValue / COIN, nValue % COIN, scriptPubKey.ToString().substr(0,30).c_str());
                                                 ^
src/main.h:634:26: warning: C++11 requires a space between string literal and macro [-Wc++11-compat]
         str += strprintf("CTransaction(hash=%s, ver=%d, vin.size=%"PRIszu", vout.size=%"PRIszu", nLockTime=%u)\n",
                          ^
src/main.h:634:74: warning: C++11 requires a space between string literal and macro [-Wc++11-compat]
         str += strprintf("CTransaction(hash=%s, ver=%d, vin.size=%"PRIszu", vout.size=%"PRIszu", nLockTime=%u)\n",
                                                                          ^
src/main.h:1486:16: warning: C++11 requires a space between string literal and macro [-Wc++11-compat]
         printf("CBlock(hash=%s, ver=%d, hashPrevBlock=%s, hashMerkleRoot=%s, nTime=%u, nBits=%08x, nNonce=%u, vtx=%"PRIszu", birthdayA=%u, birthdayB=%u)\n",
                ^
src/net.cpp:1271:12: warning: C++11 requires a space between string literal and macro [-Wc++11-compat]
     printf("Flushed %d addresses to peers.dat  %"PRI64d"ms\n",
            ^
src/net.cpp: In function 'void ThreadMapPort()':
src/net.cpp:1087:68: error: invalid conversion from 'int*' to 'unsigned char' [-fpermissive]
     devlist = upnpDiscover(2000, multicastif, minissdpdpath, 0, 0, &error);
                                                                    ^~~~~~
src/net.cpp:1087:74: error: too few arguments to function 'UPNPDev* upnpDiscover(int, const char*, const char*, int, int, unsigned char, int*)'
     devlist = upnpDiscover(2000, multicastif, minissdpdpath, 0, 0, &error);
                                                                          ^
In file included from src/net.cpp:19:0:
/usr/include/miniupnpc/miniupnpc.h:62:1: note: declared here
 upnpDiscover(int delay, const char * multicastif,
 ^~~~~~~~~~~~
make: *** [Makefile:1344: build/net.o] Error 1
make: *** Waiting for unfinished jobs....
make[1]: Entering directory '/tmp/B.huokgH/BUILD/ProtoShares/src/leveldb'
x86_64-pld-linux-g++ -I. -I./include -pthread -DOS_LINUX -DLEVELDB_PLATFORM_POSIX -pipe -fstack-protector-all -D_FORTIFY_SOURCE=2 -O2 -O2 -fwrapv -pipe -Wformat -Werror=format-security -gdwarf-4 -fno-debug-types-section -fvar-tracking-assignments -g2 -Wp,-D_FORTIFY_SOURCE=2 -fno-strict-aliasing -std=gnu++98 -fstack-protector-strong --param=ssp-buffer-size=4 -fPIC -march=x86-64 -gdwarf-4 -fno-debug-types-section -fvar-tracking-assignments -g2 -c util/env.cc -o util/env.o
make[1]: Leaving directory '/tmp/B.huokgH/BUILD/ProtoShares/src/leveldb'
make[1]: Entering directory '/tmp/B.huokgH/BUILD/ProtoShares/src/leveldb'
x86_64-pld-linux-g++ -I. -I./include -pthread -DOS_LINUX -DLEVELDB_PLATFORM_POSIX -pipe -fstack-protector-all -D_FORTIFY_SOURCE=2 -O2 -O2 -fwrapv -pipe -Wformat -Werror=format-security -gdwarf-4 -fno-debug-types-section -fvar-tracking-assignments -g2 -Wp,-D_FORTIFY_SOURCE=2 -fno-strict-aliasing -std=gnu++98 -fstack-protector-strong --param=ssp-buffer-size=4 -fPIC -march=x86-64 -gdwarf-4 -fno-debug-types-section -fvar-tracking-assignments -g2 -c util/env_win.cc -o util/env_win.o
make[1]: Leaving directory '/tmp/B.huokgH/BUILD/ProtoShares/src/leveldb'
make[1]: Entering directory '/tmp/B.huokgH/BUILD/ProtoShares/src/leveldb'
x86_64-pld-linux-g++ -I. -I./include -pthread -DOS_LINUX -DLEVELDB_PLATFORM_POSIX -pipe -fstack-protector-all -D_FORTIFY_SOURCE=2 -O2 -O2 -fwrapv -pipe -Wformat -Werror=format-security -gdwarf-4 -fno-debug-types-section -fvar-tracking-assignments -g2 -Wp,-D_FORTIFY_SOURCE=2 -fno-strict-aliasing -std=gnu++98 -fstack-protector-strong --param=ssp-buffer-size=4 -fPIC -march=x86-64 -gdwarf-4 -fno-debug-types-section -fvar-tracking-assignments -g2 -c util/filter_policy.cc -o util/filter_policy.o
make[1]: Leaving directory '/tmp/B.huokgH/BUILD/ProtoShares/src/leveldb'
make[1]: Entering directory '/tmp/B.huokgH/BUILD/ProtoShares/src/leveldb'
x86_64-pld-linux-g++ -I. -I./include -pthread -DOS_LINUX -DLEVELDB_PLATFORM_POSIX -pipe -fstack-protector-all -D_FORTIFY_SOURCE=2 -O2 -O2 -fwrapv -pipe -Wformat -Werror=format-security -gdwarf-4 -fno-debug-types-section -fvar-tracking-assignments -g2 -Wp,-D_FORTIFY_SOURCE=2 -fno-strict-aliasing -std=gnu++98 -fstack-protector-strong --param=ssp-buffer-size=4 -fPIC -march=x86-64 -gdwarf-4 -fno-debug-types-section -fvar-tracking-assignments -g2 -c util/hash.cc -o util/hash.o
make[1]: Leaving directory '/tmp/B.huokgH/BUILD/ProtoShares/src/leveldb'
make[1]: Entering directory '/tmp/B.huokgH/BUILD/ProtoShares/src/leveldb'
x86_64-pld-linux-g++ -I. -I./include -pthread -DOS_LINUX -DLEVELDB_PLATFORM_POSIX -pipe -fstack-protector-all -D_FORTIFY_SOURCE=2 -O2 -O2 -fwrapv -pipe -Wformat -Werror=format-security -gdwarf-4 -fno-debug-types-section -fvar-tracking-assignments -g2 -Wp,-D_FORTIFY_SOURCE=2 -fno-strict-aliasing -std=gnu++98 -fstack-protector-strong --param=ssp-buffer-size=4 -fPIC -march=x86-64 -gdwarf-4 -fno-debug-types-section -fvar-tracking-assignments -g2 -c util/histogram.cc -o util/histogram.o
make[1]: Leaving directory '/tmp/B.huokgH/BUILD/ProtoShares/src/leveldb'
make[1]: Entering directory '/tmp/B.huokgH/BUILD/ProtoShares/src/leveldb'
x86_64-pld-linux-g++ -I. -I./include -pthread -DOS_LINUX -DLEVELDB_PLATFORM_POSIX -pipe -fstack-protector-all -D_FORTIFY_SOURCE=2 -O2 -O2 -fwrapv -pipe -Wformat -Werror=format-security -gdwarf-4 -fno-debug-types-section -fvar-tracking-assignments -g2 -Wp,-D_FORTIFY_SOURCE=2 -fno-strict-aliasing -std=gnu++98 -fstack-protector-strong --param=ssp-buffer-size=4 -fPIC -march=x86-64 -gdwarf-4 -fno-debug-types-section -fvar-tracking-assignments -g2 -c util/logging.cc -o util/logging.o
make[1]: Leaving directory '/tmp/B.huokgH/BUILD/ProtoShares/src/leveldb'
make[1]: Entering directory '/tmp/B.huokgH/BUILD/ProtoShares/src/leveldb'
x86_64-pld-linux-g++ -I. -I./include -pthread -DOS_LINUX -DLEVELDB_PLATFORM_POSIX -pipe -fstack-protector-all -D_FORTIFY_SOURCE=2 -O2 -O2 -fwrapv -pipe -Wformat -Werror=format-security -gdwarf-4 -fno-debug-types-section -fvar-tracking-assignments -g2 -Wp,-D_FORTIFY_SOURCE=2 -fno-strict-aliasing -std=gnu++98 -fstack-protector-strong --param=ssp-buffer-size=4 -fPIC -march=x86-64 -gdwarf-4 -fno-debug-types-section -fvar-tracking-assignments -g2 -c util/env_posix.cc -o util/env_posix.o
make[1]: Leaving directory '/tmp/B.huokgH/BUILD/ProtoShares/src/leveldb'
make[1]: Entering directory '/tmp/B.huokgH/BUILD/ProtoShares/src/leveldb'
x86_64-pld-linux-g++ -I. -I./include -pthread -DOS_LINUX -DLEVELDB_PLATFORM_POSIX -pipe -fstack-protector-all -D_FORTIFY_SOURCE=2 -O2 -O2 -fwrapv -pipe -Wformat -Werror=format-security -gdwarf-4 -fno-debug-types-section -fvar-tracking-assignments -g2 -Wp,-D_FORTIFY_SOURCE=2 -fno-strict-aliasing -std=gnu++98 -fstack-protector-strong --param=ssp-buffer-size=4 -fPIC -march=x86-64 -gdwarf-4 -fno-debug-types-section -fvar-tracking-assignments -g2 -c util/options.cc -o util/options.o
make[1]: Leaving directory '/tmp/B.huokgH/BUILD/ProtoShares/src/leveldb'
make[1]: Entering directory '/tmp/B.huokgH/BUILD/ProtoShares/src/leveldb'
x86_64-pld-linux-g++ -I. -I./include -pthread -DOS_LINUX -DLEVELDB_PLATFORM_POSIX -pipe -fstack-protector-all -D_FORTIFY_SOURCE=2 -O2 -O2 -fwrapv -pipe -Wformat -Werror=format-security -gdwarf-4 -fno-debug-types-section -fvar-tracking-assignments -g2 -Wp,-D_FORTIFY_SOURCE=2 -fno-strict-aliasing -std=gnu++98 -fstack-protector-strong --param=ssp-buffer-size=4 -fPIC -march=x86-64 -gdwarf-4 -fno-debug-types-section -fvar-tracking-assignments -g2 -c util/status.cc -o util/status.o
make[1]: Leaving directory '/tmp/B.huokgH/BUILD/ProtoShares/src/leveldb'
make[1]: Entering directory '/tmp/B.huokgH/BUILD/ProtoShares/src/leveldb'
x86_64-pld-linux-g++ -I. -I./include -pthread -DOS_LINUX -DLEVELDB_PLATFORM_POSIX -pipe -fstack-protector-all -D_FORTIFY_SOURCE=2 -O2 -O2 -fwrapv -pipe -Wformat -Werror=format-security -gdwarf-4 -fno-debug-types-section -fvar-tracking-assignments -g2 -Wp,-D_FORTIFY_SOURCE=2 -fno-strict-aliasing -std=gnu++98 -fstack-protector-strong --param=ssp-buffer-size=4 -fPIC -march=x86-64 -gdwarf-4 -fno-debug-types-section -fvar-tracking-assignments -g2 -c port/port_posix.cc -o port/port_posix.o
make[1]: Leaving directory '/tmp/B.huokgH/BUILD/ProtoShares/src/leveldb'
make[1]: Entering directory '/tmp/B.huokgH/BUILD/ProtoShares/src/leveldb'
rm -f libleveldb.a
ar -rs libleveldb.a db/builder.o db/c.o db/db_impl.o db/db_iter.o db/dbformat.o db/filename.o db/log_reader.o db/log_writer.o db/memtable.o db/repair.o db/table_cache.o db/version_edit.o db/version_set.o db/write_batch.o table/block.o table/block_builder.o table/filter_block.o table/format.o table/iterator.o table/merger.o table/table.o table/table_builder.o table/two_level_iterator.o util/arena.o util/bloom.o util/cache.o util/coding.o util/comparator.o util/crc32c.o util/env.o util/env_posix.o util/env_win.o util/filter_policy.o util/hash.o util/histogram.o util/logging.o util/options.o util/status.o port/port_posix.o
ar: creating libleveldb.a
make[1]: Leaving directory '/tmp/B.huokgH/BUILD/ProtoShares/src/leveldb'
make[1]: Entering directory '/tmp/B.huokgH/BUILD/ProtoShares/src/leveldb'
x86_64-pld-linux-g++ -I. -I./include -pthread -DOS_LINUX -DLEVELDB_PLATFORM_POSIX -pipe -fstack-protector-all -D_FORTIFY_SOURCE=2 -O2 -O2 -fwrapv -pipe -Wformat -Werror=format-security -gdwarf-4 -fno-debug-types-section -fvar-tracking-assignments -g2 -Wp,-D_FORTIFY_SOURCE=2 -fno-strict-aliasing -std=gnu++98 -fstack-protector-strong --param=ssp-buffer-size=4 -fPIC -march=x86-64 -gdwarf-4 -fno-debug-types-section -fvar-tracking-assignments -g2 -c helpers/memenv/memenv.cc -o helpers/memenv/memenv.o
make[1]: Leaving directory '/tmp/B.huokgH/BUILD/ProtoShares/src/leveldb'
make[1]: Entering directory '/tmp/B.huokgH/BUILD/ProtoShares/src/leveldb'
rm -f libmemenv.a
ar -rs libmemenv.a helpers/memenv/memenv.o
ar: creating libmemenv.a
make[1]: Leaving directory '/tmp/B.huokgH/BUILD/ProtoShares/src/leveldb'
x86_64-pld-linux-g++ -c -pipe -fstack-protector-all -D_FORTIFY_SOURCE=2 -O2 -O2 -fwrapv -pipe -Wformat -Werror=format-security -gdwarf-4 -fno-debug-types-section -fvar-tracking-assignments -g2 -Wp,-D_FORTIFY_SOURCE=2 -fno-strict-aliasing -std=gnu++98 -fstack-protector-strong --param=ssp-buffer-size=4 -fPIC -march=x86-64 -gdwarf-4 -fno-debug-types-section -fvar-tracking-assignments -g2 -D_REENTRANT -fdiagnostics-show-option -Wall -Wextra -Wformat -Wformat-security -Wno-unused-parameter -Wstack-protector -DQT_GUI -DBOOST_THREAD_USE_LIB -DBOOST_SPIRIT_THREADSAFE -DUSE_QRCODE -DUSE_UPNP=1 -DSTATICLIB -DUSE_DBUS -DUSE_IPV6=1 -DHAVE_BUILD_INFO -DLINUX -D_FILE_OFFSET_BITS=64 -DQT_NO_DEBUG -DQT_DBUS_LIB -DQT_GUI_LIB -DQT_NETWORK_LIB -DQT_CORE_LIB -I/usr/share/qt4/mkspecs/linux-g++ -I/usr/include/qt4/QtCore -I/usr/include/qt4/QtNetwork -I/usr/include/qt4/QtGui -I/usr/include/qt4/QtDBus -I/usr/include/qt4 -Isrc -Isrc/json -Isrc/qt -Isrc/leveldb/include -Isrc/leveldb/helpers -Ibuild -Ibuild -o build/bloom.o src/bloom.cpp
In file included from src/bignum.h:12:0,
                 from src/main.h:8,
                 from src/bloom.cpp:8:
src/util.h:243:22: warning: C++11 requires a space between string literal and macro [-Wc++11-compat]
     return strprintf("%"PRI64d, n);
                      ^
In file included from src/main.h:10:0,
                 from src/bloom.cpp:8:
src/net.h:362:20: warning: C++11 requires a space between string literal and macro [-Wc++11-compat]
             printf("askfor %s   %"PRI64d" (%s)\n", inv.ToString().c_str(), nRequestTime, DateTimeStrFormat("%H:%M:%S", nRequestTime/1000000).c_str());
                    ^
In file included from src/bloom.cpp:8:0:
src/main.h:446:26: warning: C++11 requires a space between string literal and macro [-Wc++11-compat]
         return strprintf("CTxOut(nValue=%"PRI64d".%08"PRI64d", scriptPubKey=%s)", nValue / COIN, nValue % COIN, scriptPubKey.ToString().substr(0,30).c_str());
                          ^
src/main.h:446:49: warning: C++11 requires a space between string literal and macro [-Wc++11-compat]
         return strprintf("CTxOut(nValue=%"PRI64d".%08"PRI64d", scriptPubKey=%s)", nValue / COIN, nValue % COIN, scriptPubKey.ToString().substr(0,30).c_str());
                                                 ^
src/main.h:634:26: warning: C++11 requires a space between string literal and macro [-Wc++11-compat]
         str += strprintf("CTransaction(hash=%s, ver=%d, vin.size=%"PRIszu", vout.size=%"PRIszu", nLockTime=%u)\n",
                          ^
src/main.h:634:74: warning: C++11 requires a space between string literal and macro [-Wc++11-compat]
         str += strprintf("CTransaction(hash=%s, ver=%d, vin.size=%"PRIszu", vout.size=%"PRIszu", nLockTime=%u)\n",
                                                                          ^
src/main.h:1486:16: warning: C++11 requires a space between string literal and macro [-Wc++11-compat]
         printf("CBlock(hash=%s, ver=%d, hashPrevBlock=%s, hashMerkleRoot=%s, nTime=%u, nBits=%08x, nNonce=%u, vtx=%"PRIszu", birthdayA=%u, birthdayB=%u)\n",
                ^
x86_64-pld-linux-g++ -c -pipe -fstack-protector-all -D_FORTIFY_SOURCE=2 -O2 -O2 -fwrapv -pipe -Wformat -Werror=format-security -gdwarf-4 -fno-debug-types-section -fvar-tracking-assignments -g2 -Wp,-D_FORTIFY_SOURCE=2 -fno-strict-aliasing -std=gnu++98 -fstack-protector-strong --param=ssp-buffer-size=4 -fPIC -march=x86-64 -gdwarf-4 -fno-debug-types-section -fvar-tracking-assignments -g2 -D_REENTRANT -fdiagnostics-show-option -Wall -Wextra -Wformat -Wformat-security -Wno-unused-parameter -Wstack-protector -DQT_GUI -DBOOST_THREAD_USE_LIB -DBOOST_SPIRIT_THREADSAFE -DUSE_QRCODE -DUSE_UPNP=1 -DSTATICLIB -DUSE_DBUS -DUSE_IPV6=1 -DHAVE_BUILD_INFO -DLINUX -D_FILE_OFFSET_BITS=64 -DQT_NO_DEBUG -DQT_DBUS_LIB -DQT_GUI_LIB -DQT_NETWORK_LIB -DQT_CORE_LIB -I/usr/share/qt4/mkspecs/linux-g++ -I/usr/include/qt4/QtCore -I/usr/include/qt4/QtNetwork -I/usr/include/qt4/QtGui -I/usr/include/qt4/QtDBus -I/usr/include/qt4 -Isrc -Isrc/json -Isrc/qt -Isrc/leveldb/include -Isrc/leveldb/helpers -Ibuild -Ibuild -o build/init.o src/init.cpp
In file included from src/bignum.h:12:0,
                 from src/main.h:8,
                 from src/txdb.h:8,
                 from src/init.cpp:6:
src/util.h:243:22: warning: C++11 requires a space between string literal and macro [-Wc++11-compat]
     return strprintf("%"PRI64d, n);
                      ^
In file included from src/main.h:10:0,
                 from src/txdb.h:8,
                 from src/init.cpp:6:
src/net.h:362:20: warning: C++11 requires a space between string literal and macro [-Wc++11-compat]
             printf("askfor %s   %"PRI64d" (%s)\n", inv.ToString().c_str(), nRequestTime, DateTimeStrFormat("%H:%M:%S", nRequestTime/1000000).c_str());
                    ^
In file included from src/txdb.h:8:0,
                 from src/init.cpp:6:
src/main.h:446:26: warning: C++11 requires a space between string literal and macro [-Wc++11-compat]
         return strprintf("CTxOut(nValue=%"PRI64d".%08"PRI64d", scriptPubKey=%s)", nValue / COIN, nValue % COIN, scriptPubKey.ToString().substr(0,30).c_str());
                          ^
src/main.h:446:49: warning: C++11 requires a space between string literal and macro [-Wc++11-compat]
         return strprintf("CTxOut(nValue=%"PRI64d".%08"PRI64d", scriptPubKey=%s)", nValue / COIN, nValue % COIN, scriptPubKey.ToString().substr(0,30).c_str());
                                                 ^
src/main.h:634:26: warning: C++11 requires a space between string literal and macro [-Wc++11-compat]
         str += strprintf("CTransaction(hash=%s, ver=%d, vin.size=%"PRIszu", vout.size=%"PRIszu", nLockTime=%u)\n",
                          ^
src/main.h:634:74: warning: C++11 requires a space between string literal and macro [-Wc++11-compat]
         str += strprintf("CTransaction(hash=%s, ver=%d, vin.size=%"PRIszu", vout.size=%"PRIszu", nLockTime=%u)\n",
                                                                          ^
src/main.h:1486:16: warning: C++11 requires a space between string literal and macro [-Wc++11-compat]
         printf("CBlock(hash=%s, ver=%d, hashPrevBlock=%s, hashMerkleRoot=%s, nTime=%u, nBits=%08x, nNonce=%u, vtx=%"PRIszu", birthdayA=%u, birthdayB=%u)\n",
                ^
src/init.cpp:661:76: warning: C++11 requires a space between string literal and macro [-Wc++11-compat]
         boost::filesystem::path pathDatabaseBak = GetDataDir() / strprintf("database.%"PRI64d".bak", GetTime());
                                                                            ^
src/init.cpp:915:12: warning: C++11 requires a space between string literal and macro [-Wc++11-compat]
     printf(" block index %15"PRI64d"ms\n", GetTimeMillis() - nStart);
            ^
src/init.cpp:1008:12: warning: C++11 requires a space between string literal and macro [-Wc++11-compat]
     printf(" wallet      %15"PRI64d"ms\n", GetTimeMillis() - nStart);
            ^
src/init.cpp:1030:16: warning: C++11 requires a space between string literal and macro [-Wc++11-compat]
         printf(" rescan      %15"PRI64d"ms\n", GetTimeMillis() - nStart);
                ^
src/init.cpp:1062:12: warning: C++11 requires a space between string literal and macro [-Wc++11-compat]
     printf("Loaded %i addresses from peers.dat  %"PRI64d"ms\n",
            ^
src/init.cpp:1076:12: warning: C++11 requires a space between string literal and macro [-Wc++11-compat]
     printf("mapBlockIndex.size() = %"PRIszu"\n",   mapBlockIndex.size());
            ^
src/init.cpp:1078:12: warning: C++11 requires a space between string literal and macro [-Wc++11-compat]
     printf("setKeyPool.size() = %"PRIszu"\n",      pwalletMain->setKeyPool.size());
            ^
src/init.cpp:1079:12: warning: C++11 requires a space between string literal and macro [-Wc++11-compat]
     printf("mapWallet.size() = %"PRIszu"\n",       pwalletMain->mapWallet.size());
            ^
src/init.cpp:1080:12: warning: C++11 requires a space between string literal and macro [-Wc++11-compat]
     printf("mapAddressBook.size() = %"PRIszu"\n",  pwalletMain->mapAddressBook.size());
            ^
In file included from src/bitcoinrpc.h:17:0,
                 from src/init.cpp:8:
src/json/json_spirit_writer_template.h: In function 'String_type json_spirit::non_printable_to_string(unsigned int)':
src/json/json_spirit_writer_template.h:31:50: warning: typedef 'Char_type' locally defined but not used [-Wunused-local-typedefs]
         typedef typename String_type::value_type Char_type;
                                                  ^~~~~~~~~
x86_64-pld-linux-g++ -c -pipe -fstack-protector-all -D_FORTIFY_SOURCE=2 -O2 -O2 -fwrapv -pipe -Wformat -Werror=format-security -gdwarf-4 -fno-debug-types-section -fvar-tracking-assignments -g2 -Wp,-D_FORTIFY_SOURCE=2 -fno-strict-aliasing -std=gnu++98 -fstack-protector-strong --param=ssp-buffer-size=4 -fPIC -march=x86-64 -gdwarf-4 -fno-debug-types-section -fvar-tracking-assignments -g2 -D_REENTRANT -fdiagnostics-show-option -Wall -Wextra -Wformat -Wformat-security -Wno-unused-parameter -Wstack-protector -DQT_GUI -DBOOST_THREAD_USE_LIB -DBOOST_SPIRIT_THREADSAFE -DUSE_QRCODE -DUSE_UPNP=1 -DSTATICLIB -DUSE_DBUS -DUSE_IPV6=1 -DHAVE_BUILD_INFO -DLINUX -D_FILE_OFFSET_BITS=64 -DQT_NO_DEBUG -DQT_DBUS_LIB -DQT_GUI_LIB -DQT_NETWORK_LIB -DQT_CORE_LIB -I/usr/share/qt4/mkspecs/linux-g++ -I/usr/include/qt4/QtCore -I/usr/include/qt4/QtNetwork -I/usr/include/qt4/QtGui -I/usr/include/qt4/QtDBus -I/usr/include/qt4 -Isrc -Isrc/json -Isrc/qt -Isrc/leveldb/include -Isrc/leveldb/helpers -Ibuild -Ibuild -o build/main.o src/main.cpp
In file included from src/alert.h:13:0,
                 from src/main.cpp:6:
src/util.h:243:22: warning: C++11 requires a space between string literal and macro [-Wc++11-compat]
     return strprintf("%"PRI64d, n);
                      ^
In file included from src/main.h:10:0,
                 from src/db.h:8,
                 from src/main.cpp:8:
src/net.h:362:20: warning: C++11 requires a space between string literal and macro [-Wc++11-compat]
             printf("askfor %s   %"PRI64d" (%s)\n", inv.ToString().c_str(), nRequestTime, DateTimeStrFormat("%H:%M:%S", nRequestTime/1000000).c_str());
                    ^
In file included from src/db.h:8:0,
                 from src/main.cpp:8:
src/main.h:446:26: warning: C++11 requires a space between string literal and macro [-Wc++11-compat]
         return strprintf("CTxOut(nValue=%"PRI64d".%08"PRI64d", scriptPubKey=%s)", nValue / COIN, nValue % COIN, scriptPubKey.ToString().substr(0,30).c_str());
                          ^
src/main.h:446:49: warning: C++11 requires a space between string literal and macro [-Wc++11-compat]
         return strprintf("CTxOut(nValue=%"PRI64d".%08"PRI64d", scriptPubKey=%s)", nValue / COIN, nValue % COIN, scriptPubKey.ToString().substr(0,30).c_str());
                                                 ^
src/main.h:634:26: warning: C++11 requires a space between string literal and macro [-Wc++11-compat]
         str += strprintf("CTransaction(hash=%s, ver=%d, vin.size=%"PRIszu", vout.size=%"PRIszu", nLockTime=%u)\n",
                          ^
src/main.h:634:74: warning: C++11 requires a space between string literal and macro [-Wc++11-compat]
         str += strprintf("CTransaction(hash=%s, ver=%d, vin.size=%"PRIszu", vout.size=%"PRIszu", nLockTime=%u)\n",
                                                                          ^
src/main.h:1486:16: warning: C++11 requires a space between string literal and macro [-Wc++11-compat]
         printf("CBlock(hash=%s, ver=%d, hashPrevBlock=%s, hashMerkleRoot=%s, nTime=%u, nBits=%08x, nNonce=%u, vtx=%"PRIszu", birthdayA=%u, birthdayB=%u)\n",
                ^
src/main.cpp:317:12: warning: C++11 requires a space between string literal and macro [-Wc++11-compat]
     printf("stored orphan tx %s (mapsz %"PRIszu")\n", hash.ToString().c_str(),
            ^
src/main.cpp:760:26: warning: C++11 requires a space between string literal and macro [-Wc++11-compat]
             return error("CTxMemPool::accept() : not enough fees %s, %"PRI64d" < %"PRI64d,
                          ^
src/main.cpp:760:78: warning: C++11 requires a space between string literal and macro [-Wc++11-compat]
             return error("CTxMemPool::accept() : not enough fees %s, %"PRI64d" < %"PRI64d,
                                                                              ^
src/main.cpp:812:12: warning: C++11 requires a space between string literal and macro [-Wc++11-compat]
     printf("CTxMemPool::accept() : accepted %s (poolsz %"PRIszu")\n",
            ^
src/main.cpp:1161:12: warning: C++11 requires a space between string literal and macro [-Wc++11-compat]
     printf("  nActualTimespan = %"PRI64d"  before bounds\n", nActualTimespan);
            ^
src/main.cpp:1189:12: warning: C++11 requires a space between string literal and macro [-Wc++11-compat]
     printf("nTargetTimespan = %"PRI64d"    nActualTimespan = %"PRI64d"\n", nTargetTimespan, nActualTimespan);
            ^
src/main.cpp:1189:39: warning: C++11 requires a space between string literal and macro [-Wc++11-compat]
     printf("nTargetTimespan = %"PRI64d"    nActualTimespan = %"PRI64d"\n", nTargetTimespan, nActualTimespan);
                                       ^
src/main.cpp:1760:37: warning: C++11 requires a space between string literal and macro [-Wc++11-compat]
         return state.DoS(100, error("ConnectBlock() : coinbase pays too much (actual=%"PRI64d" vs limit=%"PRI64d")", vtx[0].GetValueOut(), GetBlockValue(pindex->nHeight, nFees)));
                                     ^
src/main.cpp:1760:94: warning: C++11 requires a space between string literal and macro [-Wc++11-compat]
         return state.DoS(100, error("ConnectBlock() : coinbase pays too much (actual=%"PRI64d" vs limit=%"PRI64d")", vtx[0].GetValueOut(), GetBlockValue(pindex->nHeight, nFees)));
                                                                                              ^
src/main.cpp:1840:16: warning: C++11 requires a space between string literal and macro [-Wc++11-compat]
         printf("REORGANIZE: Disconnect %"PRIszu" blocks; %s..\n", vDisconnect.size(), pfork->GetBlockHash().ToString().c_str());
                ^
src/main.cpp:1841:16: warning: C++11 requires a space between string literal and macro [-Wc++11-compat]
         printf("REORGANIZE: Connect %"PRIszu" blocks; ..%s\n", vConnect.size(), pindexNew->GetBlockHash().ToString().c_str());
                ^
src/main.cpp:2926:16: warning: C++11 requires a space between string literal and macro [-Wc++11-compat]
         printf("%d (blk%05u.dat:0x%x)  %s  tx %"PRIszu"",
                ^
src/main.cpp:3019:16: warning: C++11 requires a space between string literal and macro [-Wc++11-compat]
         printf("Loaded %i blocks from external file in %"PRI64d"ms\n", nLoaded, GetTimeMillis() - nStart);
                ^
src/main.cpp:3244:16: warning: C++11 requires a space between string literal and macro [-Wc++11-compat]
         printf("received: %s (%"PRIszu" bytes)\n", strCommand.c_str(), vRecv.size());
                ^
src/main.cpp:3382:26: warning: C++11 requires a space between string literal and macro [-Wc++11-compat]
             return error("message addr size() = %"PRIszu"", vAddr.size());
                          ^
src/main.cpp:3445:26: warning: C++11 requires a space between string literal and macro [-Wc++11-compat]
             return error("message inv size() = %"PRIszu"", vInv.size());
                          ^
src/main.cpp:3494:26: warning: C++11 requires a space between string literal and macro [-Wc++11-compat]
             return error("message getdata size() = %"PRIszu"", vInv.size());
                          ^
src/main.cpp:3498:20: warning: C++11 requires a space between string literal and macro [-Wc++11-compat]
             printf("received getdata (%"PRIszu" invsz)\n", vInv.size());
                    ^
src/main.cpp:4430:16: warning: C++11 requires a space between string literal and macro [-Wc++11-compat]
         printf("CreateNewBlock(): total size %"PRI64u"\n", nBlockSize);
                ^
src/main.cpp:4592:16: warning: C++11 requires a space between string literal and macro [-Wc++11-compat]
         printf("Running ProtoSharesMiner with %"PRIszu" transactions in block (%u bytes)\n", pblock->vtx.size(),
                ^
error: Bad exit status from /tmp/B.huokgH/BUILD/tmp/rpm-tmp.35676 (%build)


RPM build errors:
    Bad exit status from /tmp/B.huokgH/BUILD/tmp/rpm-tmp.35676 (%build)
ended at: Sun Apr 16 14:31:05 2017, done in 0:01:01.759878
error: No files produced.
mesg: ttyname failed: Inappropriate ioctl for device
+ chmod -R u+rwX /tmp/B.huokgH/BUILD
+ rm -rf /tmp/B.huokgH/tmp /tmp/B.huokgH/BUILD
mesg: ttyname failed: Inappropriate ioctl for device
+ rm -rf /tmp/B.huokgH
Begin-PLD-Builder-Info
Build-Time: user:195.46s sys:9.95s real:64.67s (faults io:0 non-io:2914350)

End-PLD-Builder-Info
[Back to list of logs] [View rpm -qa of builder]