FailedOk

th/SRPMS[OK]
th/x32[OK]
th/i686[OK]
th/x86_64[OK]

ac/SRPMS[OK]
ac/i386[OK]
ac/i586[OK]
ac/i686[OK]
ac/alpha[OK]
ac/amd64[OK]
ac/athlon[OK]
ac/ppc[OK]
ac/sparc[OK]
ac/sparc64[OK]

Advanced Search
main()
Powered by PLD Linux
(c) 2002-2018 PLD Team
$Revision: 1.37 $
Powered by Real Operating System.
Your IP: 54.196.190.32

python 4206e6ed-c4d8-42ed-bfc8-67270861b0c8

Status:Failed
Source URL:ftp://buildlogs.pld-linux.org/th/x86_64/FAIL/python,4206e6ed-c4d8-42ed-bfc8-67270861b0c8.bz2
text/plain URL:View!
full text:View!
rpm -qa of builder:View!
Date:2018/09/14 07:33:25
Runtime:0:21:53.214610

Toc:

  • error 1
  • error: [Errno 104] Connection reset by peer
  • error 2
  • error: [Errno 104] Connection reset by peer
  • error 3
  • SSLError: [SSL: TLSV1_ALERT_UNKNOWN_CA] tlsv1 alert unknown ca (_ssl.c:726)
  • error 4
  • error: [Errno 104] Connection reset by peer
  • error 5
  • ERROR: test_tls1_3 (test.test_ssl.ThreadedTests)
  • error 6
  • AttributeError: __exit__
  • error 7
  • FAIL: test_options (test.test_ssl.ContextTests)
  • error 8
  • AssertionError: 2181169236 != 2182217812L
  • error 9
  • FAIL: test_default_ciphers (test.test_ssl.ThreadedTests)
  • error 10
  • AssertionError: SSLError not raised
  • error 11
  • FAIL: test_default_ecdh_curve (test.test_ssl.ThreadedTests)
  • error 12
  • AssertionError: 'ECDH' not found in 'TLS_AES_256_GCM_SHA384'
  • error 13
  • error: [Errno 104] Connection reset by peer
  • error 14
  • error: [Errno 104] Connection reset by peer
  • error 15
  • SSLError: [SSL: TLSV1_ALERT_UNKNOWN_CA] tlsv1 alert unknown ca (_ssl.c:726)
  • error 16
  • error: [Errno 104] Connection reset by peer
  • error 17
  • ERROR: test_tls1_3 (test.test_ssl.ThreadedTests)
  • error 18
  • AttributeError: __exit__
  • error 19
  • FAIL: test_options (test.test_ssl.ContextTests)
  • error 20
  • AssertionError: 2181169236 != 2182217812L
  • error 21
  • FAIL: test_default_ciphers (test.test_ssl.ThreadedTests)
  • error 22
  • AssertionError: SSLError not raised
  • error 23
  • FAIL: test_default_ecdh_curve (test.test_ssl.ThreadedTests)
  • error 24
  • AssertionError: 'ECDH' not found in 'TLS_AES_256_GCM_SHA384'
  • error 25
  • error: Bad exit status from /tmp/B.s9fqCB/BUILD/tmp/rpm-tmp.24445 (%build)
  • error 26
  • RPM build errors:
  • error 27
  • error: No files produced.

Content:

0:00:29 load avg: 1.05 [ 92/389] test_cprofile
0:00:29 load avg: 1.05 [ 93/389] test_crypt
0:00:29 load avg: 1.05 [ 94/389] test_csv
0:00:30 load avg: 1.05 [ 95/389] test_ctypes
0:00:31 load avg: 1.05 [ 96/389] test_curses
test_curses skipped -- Use of the `curses' resource not enabled
0:00:31 load avg: 1.05 [ 97/389] test_datetime -- test_curses skipped (resource denied)
0:00:32 load avg: 1.05 [ 98/389] test_dbm
0:00:32 load avg: 1.05 [ 99/389] test_decimal
0:00:34 load avg: 1.04 [100/389] test_decorators
0:00:34 load avg: 1.04 [101/389] test_defaultdict
0:00:34 load avg: 1.04 [102/389] test_deque
0:00:38 load avg: 1.04 [103/389] test_descr
0:00:41 load avg: 1.04 [104/389] test_descrtut
0:00:41 load avg: 1.04 [105/389] test_dictcomps
0:00:41 load avg: 1.04 [106/389] test_dictviews
0:00:41 load avg: 1.04 [107/389] test_difflib
0:00:42 load avg: 1.04 [108/389] test_dircache
0:00:43 load avg: 0.95 [109/389] test_dis
0:00:43 load avg: 0.95 [110/389] test_dl
test_dl skipped -- No module named dl
0:00:43 load avg: 0.95 [111/389] test_docxmlrpc -- test_dl skipped
0:00:47 load avg: 0.95 [112/389] test_dumbdbm
0:00:47 load avg: 0.95 [113/389] test_dummy_thread
0:00:47 load avg: 0.95 [114/389] test_dummy_threading
0:00:47 load avg: 0.95 [115/389] test_email
0:00:51 load avg: 0.96 [116/389] test_email_codecs
0:00:51 load avg: 0.96 [117/389] test_email_renamed
0:00:51 load avg: 0.96 [118/389] test_ensurepip
0:00:51 load avg: 0.96 [119/389] test_enumerate
0:00:52 load avg: 0.96 [120/389] test_eof
0:00:52 load avg: 0.96 [121/389] test_epoll
0:00:54 load avg: 0.88 [122/389] test_errno
0:00:54 load avg: 0.88 [123/389] test_exception_variations
0:00:54 load avg: 0.88 [124/389] test_extcall
0:00:54 load avg: 0.88 [125/389] test_fcntl
0:00:54 load avg: 0.88 [126/389] test_file
0:00:55 load avg: 0.88 [127/389] test_file2k
0:01:02 load avg: 0.97 [128/389] test_file_eintr
0:01:03 load avg: 0.97 [129/389] test_filecmp
0:01:03 load avg: 0.97 [130/389] test_fileinput
0:01:03 load avg: 0.97 [131/389] test_fileio
0:01:03 load avg: 0.97 [132/389] test_float
0:01:03 load avg: 0.97 [133/389] test_fnmatch
0:01:03 load avg: 0.97 [134/389] test_fork1
0:01:10 load avg: 0.98 [135/389] test_format
0:01:10 load avg: 0.98 [136/389] test_fpformat
0:01:11 load avg: 0.98 [137/389] test_fractions
0:01:11 load avg: 0.98 [138/389] test_frozen
0:01:11 load avg: 0.98 [139/389] test_ftplib
0:01:15 load avg: 0.90 [140/389] test_funcattrs
0:01:15 load avg: 0.90 [141/389] test_functools
0:01:15 load avg: 0.90 [142/389] test_future
0:01:15 load avg: 0.90 [143/389] test_future3
0:01:15 load avg: 0.90 [144/389] test_future4
0:01:15 load avg: 0.90 [145/389] test_future5
0:01:15 load avg: 0.90 [146/389] test_future_builtins
0:01:15 load avg: 0.90 [147/389] test_gc
0:01:21 load avg: 0.91 [148/389] test_gdbm
0:01:21 load avg: 0.91 [149/389] test_generators
0:01:21 load avg: 0.91 [150/389] test_genericpath
0:01:21 load avg: 0.91 [151/389] test_genexps
0:01:21 load avg: 0.91 [152/389] test_getargs
0:01:22 load avg: 0.91 [153/389] test_getargs2
0:01:22 load avg: 0.91 [154/389] test_getopt
0:01:22 load avg: 0.91 [155/389] test_gettext
0:01:22 load avg: 0.91 [156/389] test_gl
test_gl skipped -- No module named gl
0:01:22 load avg: 0.91 [157/389] test_glob -- test_gl skipped
0:01:22 load avg: 0.91 [158/389] test_global
0:01:22 load avg: 0.91 [159/389] test_grp
0:01:22 load avg: 0.91 [160/389] test_gzip
0:01:23 load avg: 0.91 [161/389] test_hash
0:01:23 load avg: 0.91 [162/389] test_hashlib
0:01:24 load avg: 0.91 [163/389] test_heapq
0:01:25 load avg: 0.91 [164/389] test_hmac
0:01:25 load avg: 0.91 [165/389] test_hotshot
0:01:25 load avg: 0.91 [166/389] test_htmllib
0:01:25 load avg: 0.91 [167/389] test_htmlparser
0:01:25 load avg: 0.91 [168/389] test_httplib
Traceback (most recent call last):
  File "/tmp/B.s9fqCB/BUILD/Python-2.7.15/Lib/SocketServer.py", line 290, in _handle_request_noblock
    self.process_request(request, client_address)
  File "/tmp/B.s9fqCB/BUILD/Python-2.7.15/Lib/SocketServer.py", line 318, in process_request
    self.finish_request(request, client_address)
  File "/tmp/B.s9fqCB/BUILD/Python-2.7.15/Lib/SocketServer.py", line 331, in finish_request
    self.RequestHandlerClass(request, client_address, self)
  File "/tmp/B.s9fqCB/BUILD/Python-2.7.15/Lib/SocketServer.py", line 652, in __init__
    self.handle()
  File "/tmp/B.s9fqCB/BUILD/Python-2.7.15/Lib/BaseHTTPServer.py", line 340, in handle
    self.handle_one_request()
  File "/tmp/B.s9fqCB/BUILD/Python-2.7.15/Lib/BaseHTTPServer.py", line 310, in handle_one_request
    self.raw_requestline = self.rfile.readline(65537)
  File "/tmp/B.s9fqCB/BUILD/Python-2.7.15/Lib/socket.py", line 480, in readline
    data = self._sock.recv(self._rbufsize)
  File "/tmp/B.s9fqCB/BUILD/Python-2.7.15/Lib/ssl.py", line 772, in recv
    return self.read(buflen)
  File "/tmp/B.s9fqCB/BUILD/Python-2.7.15/Lib/ssl.py", line 659, in read
    v = self._sslobj.read(len)
error: [Errno 104] Connection reset by peer
test test_httplib produced unexpected output:
**********************************************************************
----------------------------------------
Exception happened during processing of request from ('127.0.0.1', 49272)
----------------------------------------

**********************************************************************
0:01:26 load avg: 0.91 [169/389/1] test_httpservers -- test_httplib failed
0:01:28 load avg: 1.00 [170/389/1] test_idle
0:01:29 load avg: 1.00 [171/389/1] test_imaplib
0:01:29 load avg: 1.00 [172/389/1] test_imgfile
test_imgfile skipped -- No module named imgfile
0:01:29 load avg: 1.00 [173/389/1] test_imghdr -- test_imgfile skipped
0:01:29 load avg: 1.00 [174/389/1] test_imp
0:01:29 load avg: 1.00 [175/389/1] test_import
0:01:30 load avg: 1.00 [176/389/1] test_import_magic
0:01:30 load avg: 1.00 [177/389/1] test_importhooks
0:01:30 load avg: 1.00 [178/389/1] test_importlib
0:01:30 load avg: 1.00 [179/389/1] test_index
0:01:30 load avg: 1.00 [180/389/1] test_inspect
0:01:31 load avg: 1.00 [181/389/1] test_int
0:01:31 load avg: 1.00 [182/389/1] test_int_literal
0:01:32 load avg: 1.00 [183/389/1] test_io
0:02:10 load avg: 0.73 [184/389/1] test_ioctl -- test_io passed in 39 sec
test_ioctl skipped -- Unable to open /dev/tty
0:02:10 load avg: 0.73 [185/389/1] test_isinstance -- test_ioctl skipped
0:02:11 load avg: 0.73 [186/389/1] test_iter
0:02:11 load avg: 0.73 [187/389/1] test_iterlen
0:02:11 load avg: 0.73 [188/389/1] test_itertools
0:02:15 load avg: 0.75 [189/389/1] test_json
0:02:18 load avg: 0.77 [190/389/1] test_kqueue
test_kqueue skipped -- test works only on BSD
0:02:18 load avg: 0.77 [191/389/1] test_largefile -- test_kqueue skipped
0:02:18 load avg: 0.77 [192/389/1] test_lib2to3
0:02:39 load avg: 0.91 [193/389/1] test_linecache
0:02:39 load avg: 0.91 [194/389/1] test_linuxaudiodev
test_linuxaudiodev skipped -- Use of the `audio' resource not enabled
0:02:39 load avg: 0.91 [195/389/1] test_list -- test_linuxaudiodev skipped (resource denied)
0:02:40 load avg: 0.91 [196/389/1] test_logging
0:02:50 load avg: 0.77 [197/389/1] test_long
0:02:52 load avg: 0.77 [198/389/1] test_long_future
0:02:54 load avg: 0.79 [199/389/1] test_longexp
0:02:54 load avg: 0.79 [200/389/1] test_macos
test_macos skipped -- No module named MacOS
0:02:54 load avg: 0.79 [201/389/1] test_macostools -- test_macos skipped
test_macostools skipped -- No module named MacOS
0:02:55 load avg: 0.79 [202/389/1] test_macpath -- test_macostools skipped
0:02:55 load avg: 0.79 [203/389/1] test_macurl2path
0:02:55 load avg: 0.79 [204/389/1] test_mailbox
0:02:58 load avg: 0.80 [205/389/1] test_marshal
0:02:58 load avg: 0.80 [206/389/1] test_math
0:02:59 load avg: 0.80 [207/389/1] test_md5
0:03:00 load avg: 0.80 [208/389/1] test_memoryio
0:03:00 load avg: 0.80 [209/389/1] test_memoryview
0:03:00 load avg: 0.80 [210/389/1] test_mhlib
0:03:01 load avg: 0.80 [211/389/1] test_mimetools
0:03:01 load avg: 0.80 [212/389/1] test_mimetypes
0:03:01 load avg: 0.80 [213/389/1] test_minidom
0:03:01 load avg: 0.80 [214/389/1] test_mmap
0:03:01 load avg: 0.80 [215/389/1] test_module
0:03:02 load avg: 0.80 [216/389/1] test_modulefinder
0:03:02 load avg: 0.80 [217/389/1] test_msilib
test_msilib skipped -- No module named _msi
0:03:03 load avg: 0.80 [218/389/1] test_multibytecodec -- test_msilib skipped
0:03:04 load avg: 0.82 [219/389/1] test_multifile
0:03:04 load avg: 0.82 [220/389/1] test_multiprocessing
0:03:31 load avg: 0.89 [221/389/1] test_mutants
0:03:32 load avg: 0.89 [222/389/1] test_mutex
0:03:32 load avg: 0.89 [223/389/1] test_netrc
0:03:32 load avg: 0.89 [224/389/1] test_new
0:03:32 load avg: 0.89 [225/389/1] test_nntplib
0:03:33 load avg: 0.89 [226/389/1] test_normalization
0:03:33 load avg: 0.90 [227/389/1] test_ntpath
0:03:33 load avg: 0.90 [228/389/1] test_old_mailbox
0:03:33 load avg: 0.90 [229/389/1] test_operator
0:03:33 load avg: 0.90 [230/389/1] test_optparse
0:03:34 load avg: 0.90 [231/389/1] test_ordered_dict
0:03:35 load avg: 0.90 [232/389/1] test_os
0:03:36 load avg: 0.90 [233/389/1] test_ossaudiodev
test_ossaudiodev skipped -- Use of the `audio' resource not enabled
0:03:36 load avg: 0.90 [234/389/1] test_parser -- test_ossaudiodev skipped (resource denied)
0:03:36 load avg: 0.90 [235/389/1] test_pdb
0:03:36 load avg: 0.90 [236/389/1] test_peepholer
0:03:37 load avg: 0.90 [237/389/1] test_pep247
0:03:37 load avg: 0.90 [238/389/1] test_pep277
0:03:37 load avg: 0.90 [239/389/1] test_pep352
0:03:37 load avg: 0.90 [240/389/1] test_pickle
0:03:39 load avg: 0.91 [241/389/1] test_pickletools
0:03:40 load avg: 0.91 [242/389/1] test_pipes
0:03:40 load avg: 0.91 [243/389/1] test_pkg
0:03:40 load avg: 0.91 [244/389/1] test_pkgimport
0:03:40 load avg: 0.91 [245/389/1] test_pkgutil
0:03:40 load avg: 0.91 [246/389/1] test_platform
0:03:41 load avg: 0.91 [247/389/1] test_plistlib
0:03:41 load avg: 0.91 [248/389/1] test_poll
0:03:52 load avg: 0.77 [249/389/1] test_popen
0:03:52 load avg: 0.77 [250/389/1] test_popen2
0:03:53 load avg: 0.79 [251/389/1] test_poplib
0:03:55 load avg: 0.79 [252/389/1] test_posixpath
0:03:55 load avg: 0.79 [253/389/1] test_pow
0:03:56 load avg: 0.79 [254/389/1] test_pprint
0:03:56 load avg: 0.79 [255/389/1] test_print
0:03:56 load avg: 0.79 [256/389/1] test_profile
0:03:56 load avg: 0.79 [257/389/1] test_property
0:03:57 load avg: 0.79 [258/389/1] test_pstats
0:03:57 load avg: 0.79 [259/389/1] test_pwd
0:03:57 load avg: 0.79 [260/389/1] test_py3kwarn
test_py3kwarn skipped -- test.test_py3kwarn must be run with the -3 flag
0:03:57 load avg: 0.79 [261/389/1] test_py_compile -- test_py3kwarn skipped
0:03:57 load avg: 0.79 [262/389/1] test_pyclbr
0:03:58 load avg: 0.80 [263/389/1] test_pyexpat
0:03:58 load avg: 0.80 [264/389/1] test_queue
0:04:02 load avg: 0.80 [265/389/1] test_quopri
0:04:02 load avg: 0.80 [266/389/1] test_random
0:04:03 load avg: 0.74 [267/389/1] test_re
0:04:04 load avg: 0.74 [268/389/1] test_readline
0:04:04 load avg: 0.74 [269/389/1] test_regrtest
0:04:07 load avg: 0.74 [270/389/1] test_repr
0:04:07 load avg: 0.74 [271/389/1] test_rfc822
0:04:07 load avg: 0.74 [272/389/1] test_richcmp
0:04:07 load avg: 0.74 [273/389/1] test_rlcompleter
0:04:08 load avg: 0.76 [274/389/1] test_robotparser
0:04:08 load avg: 0.76 [275/389/1] test_runpy
0:04:12 load avg: 0.76 [276/389/1] test_sax
0:04:12 load avg: 0.76 [277/389/1] test_scope
0:04:12 load avg: 0.76 [278/389/1] test_scriptpackages
test_scriptpackages skipped -- No module named aetools
0:04:12 load avg: 0.76 [279/389/1] test_select -- test_scriptpackages skipped
0:04:23 load avg: 0.59 [280/389/1] test_set
0:04:25 load avg: 0.59 [281/389/1] test_setcomps
0:04:25 load avg: 0.59 [282/389/1] test_sets
0:04:26 load avg: 0.59 [283/389/1] test_sgmllib
0:04:26 load avg: 0.59 [284/389/1] test_sha
0:04:26 load avg: 0.59 [285/389/1] test_shelve
0:04:27 load avg: 0.59 [286/389/1] test_shlex
0:04:27 load avg: 0.59 [287/389/1] test_shutil
0:04:27 load avg: 0.59 [288/389/1] test_signal
0:04:36 load avg: 0.50 [289/389/1] test_site
0:04:37 load avg: 0.50 [290/389/1] test_slice
0:04:37 load avg: 0.50 [291/389/1] test_smtplib
0:04:38 load avg: 0.50 [292/389/1] test_smtpnet
test_smtpnet skipped -- Use of the `network' resource not enabled
0:04:38 load avg: 0.54 [293/389/1] test_socketserver -- test_smtpnet skipped (resource denied)
test_socketserver skipped -- Use of the `network' resource not enabled
0:04:38 load avg: 0.54 [294/389/1] test_softspace -- test_socketserver skipped (resource denied)
0:04:38 load avg: 0.54 [295/389/1] test_sort
0:04:38 load avg: 0.54 [296/389/1] test_source_encoding
0:04:39 load avg: 0.54 [297/389/1] test_spwd
0:04:39 load avg: 0.54 [298/389/1] test_sqlite
0:04:40 load avg: 0.54 [299/389/1] test_ssl
test test_ssl failed -- multiple errors occurred; run in verbose mode for details
0:04:42 load avg: 0.54 [300/389/2] test_startfile -- test_ssl failed
test_startfile skipped -- module 'os' has no attribute 'startfile'
0:04:42 load avg: 0.54 [301/389/2] test_stat -- test_startfile skipped
0:04:42 load avg: 0.54 [302/389/2] test_str
0:04:43 load avg: 0.58 [303/389/2] test_strftime
0:04:44 load avg: 0.58 [304/389/2] test_string
0:04:45 load avg: 0.58 [305/389/2] test_stringprep
0:04:45 load avg: 0.58 [306/389/2] test_strop
0:04:45 load avg: 0.58 [307/389/2] test_strptime
0:04:45 load avg: 0.58 [308/389/2] test_strtod
0:04:46 load avg: 0.58 [309/389/2] test_struct
0:04:47 load avg: 0.58 [310/389/2] test_structmembers
0:04:48 load avg: 0.58 [311/389/2] test_structseq
0:04:48 load avg: 0.61 [312/389/2] test_subprocess
0:06:34 load avg: 1.15 [313/389/2] test_sunau -- test_subprocess passed in 1 min 46 sec
0:06:34 load avg: 1.15 [314/389/2] test_sunaudiodev
test_sunaudiodev skipped -- No module named sunaudiodev
0:06:34 load avg: 1.15 [315/389/2] test_sundry -- test_sunaudiodev skipped
0:06:35 load avg: 1.15 [316/389/2] test_symtable
0:06:35 load avg: 1.15 [317/389/2] test_syntax
0:06:35 load avg: 1.15 [318/389/2] test_sys
0:06:36 load avg: 1.15 [319/389/2] test_sys_setprofile
0:06:36 load avg: 1.15 [320/389/2] test_sys_settrace
0:06:36 load avg: 1.15 [321/389/2] test_sysconfig
0:06:37 load avg: 1.15 [322/389/2] test_tarfile
0:06:39 load avg: 1.14 [323/389/2] test_tcl
0:06:40 load avg: 1.14 [324/389/2] test_telnetlib
0:06:45 load avg: 1.21 [325/389/2] test_tempfile
0:06:45 load avg: 1.21 [326/389/2] test_test_support
0:06:45 load avg: 1.21 [327/389/2] test_textwrap
0:06:46 load avg: 1.21 [328/389/2] test_thread
0:06:46 load avg: 1.21 [329/389/2] test_threaded_import
0:06:46 load avg: 1.21 [330/389/2] test_threadedtempfile
0:06:47 load avg: 1.21 [331/389/2] test_threading
0:06:51 load avg: 1.11 [332/389/2] test_threading_local
0:06:53 load avg: 1.11 [333/389/2] test_threadsignals
0:06:53 load avg: 1.18 [334/389/2] test_time
0:06:54 load avg: 1.18 [335/389/2] test_timeit
0:06:54 load avg: 1.18 [336/389/2] test_timeout
test_timeout skipped -- Use of the `network' resource not enabled
0:06:55 load avg: 1.18 [337/389/2] test_tk -- test_timeout skipped (resource denied)
test_tk skipped -- Use of the `gui' resource not enabled
0:06:55 load avg: 1.18 [338/389/2] test_tokenize -- test_tk skipped (resource denied)
0:06:55 load avg: 1.18 [339/389/2] test_tools
recursedown('@test_1856_tmp')
0:06:57 load avg: 1.18 [340/389/2] test_trace
0:06:59 load avg: 1.17 [341/389/2] test_traceback
0:07:03 load avg: 1.23 [342/389/2] test_transformer
0:07:03 load avg: 1.23 [343/389/2] test_ttk_guionly
test_ttk_guionly skipped -- Use of the `gui' resource not enabled
0:07:04 load avg: 1.23 [344/389/2] test_ttk_textonly -- test_ttk_guionly skipped (resource denied)
0:07:04 load avg: 1.23 [345/389/2] test_tuple
0:07:17 load avg: 1.20 [346/389/2] test_turtle
0:07:17 load avg: 1.20 [347/389/2] test_typechecks
0:07:17 load avg: 1.20 [348/389/2] test_ucn
0:07:18 load avg: 1.18 [349/389/2] test_unary
0:07:18 load avg: 1.18 [350/389/2] test_undocumented_details
0:07:18 load avg: 1.18 [351/389/2] test_unicode
0:07:30 load avg: 1.15 [352/389/2] test_unicode_file
0:07:30 load avg: 1.15 [353/389/2] test_unicodedata
0:07:32 load avg: 1.15 [354/389/2] test_univnewlines
0:07:32 load avg: 1.15 [355/389/2] test_univnewlines2k
0:07:33 load avg: 1.15 [356/389/2] test_unpack
0:07:33 load avg: 1.14 [357/389/2] test_urllib
0:07:33 load avg: 1.14 [358/389/2] test_urllib2_localnet
0:07:34 load avg: 1.14 [359/389/2] test_urllib2net
test_urllib2net skipped -- Use of the `network' resource not enabled
0:07:35 load avg: 1.14 [360/389/2] test_urllibnet -- test_urllib2net skipped (resource denied)
test_urllibnet skipped -- Use of the `network' resource not enabled
0:07:35 load avg: 1.14 [361/389/2] test_urlparse -- test_urllibnet skipped (resource denied)
0:07:35 load avg: 1.14 [362/389/2] test_userdict
0:07:36 load avg: 1.14 [363/389/2] test_userlist
0:07:36 load avg: 1.14 [364/389/2] test_userstring
0:07:39 load avg: 1.13 [365/389/2] test_uu
0:07:40 load avg: 1.13 [366/389/2] test_uuid
0:07:40 load avg: 1.13 [367/389/2] test_wait3
0:07:46 load avg: 1.04 [368/389/2] test_wait4
0:07:51 load avg: 0.95 [369/389/2] test_warnings
0:07:52 load avg: 0.95 [370/389/2] test_wave
0:07:52 load avg: 0.95 [371/389/2] test_weakref
0:09:57 load avg: 1.01 [372/389/2] test_weakset -- test_weakref passed in 2 min 4 sec
0:09:58 load avg: 1.01 [373/389/2] test_whichdb
0:09:58 load avg: 1.01 [374/389/2] test_winreg
test_winreg skipped -- No module named _winreg
0:09:58 load avg: 1.01 [375/389/2] test_winsound -- test_winreg skipped
test_winsound skipped -- Use of the `audio' resource not enabled
0:09:58 load avg: 1.01 [376/389/2] test_with -- test_winsound skipped (resource denied)
0:09:59 load avg: 1.01 [377/389/2] test_wsgiref
0:09:59 load avg: 1.01 [378/389/2] test_xdrlib
0:09:59 load avg: 1.01 [379/389/2] test_xml_etree
0:10:00 load avg: 1.01 [380/389/2] test_xml_etree_c
0:10:00 load avg: 1.01 [381/389/2] test_xmllib
0:10:00 load avg: 1.01 [382/389/2] test_xmlrpc
0:10:04 load avg: 0.93 [383/389/2] test_xpickle
0:10:04 load avg: 0.93 [384/389/2] test_xrange
0:10:05 load avg: 0.93 [385/389/2] test_zipfile
0:10:08 load avg: 0.93 [386/389/2] test_zipfile64
test_zipfile64 skipped -- test requires loads of disk-space bytes and a long time to run
0:10:08 load avg: 0.93 [387/389/2] test_zipimport -- test_zipfile64 skipped (resource denied)
0:10:09 load avg: 0.93 [388/389/2] test_zipimport_support
0:10:09 load avg: 0.93 [389/389/2] test_zlib
350 tests OK.
2 tests failed:
    test_httplib test_ssl
37 tests skipped:
    test_aepack test_al test_applesingle test_bsddb185 test_bsddb3
    test_cd test_cl test_codecmaps_cn test_codecmaps_hk
    test_codecmaps_jp test_codecmaps_kr test_codecmaps_tw test_curses
    test_dl test_gl test_imgfile test_ioctl test_kqueue
    test_linuxaudiodev test_macos test_macostools test_msilib
    test_ossaudiodev test_py3kwarn test_scriptpackages test_smtpnet
    test_socketserver test_startfile test_sunaudiodev test_timeout
    test_tk test_ttk_guionly test_urllib2net test_urllibnet
    test_winreg test_winsound test_zipfile64
1 skip unexpected on linux2:
    test_ioctl
Re-running failed tests in verbose mode
Re-running test 'test_httplib' in verbose mode
test_auto_headers (test.test_httplib.HeaderTests) ... ok
test_blank_line_forms (test.test_httplib.HeaderTests) ... ok
test_content_length_0 (test.test_httplib.HeaderTests) ... ok
test_from_line (test.test_httplib.HeaderTests) ... ok
test_invalid_headers (test.test_httplib.HeaderTests) ... ok
test_ipv6host_header (test.test_httplib.HeaderTests) ... ok
test_malformed_headers_coped_with (test.test_httplib.HeaderTests) ... ok
test_malformed_truncation (test.test_httplib.HeaderTests) ... ok
test_parse_all_octets (test.test_httplib.HeaderTests) ... ok
test_putheader (test.test_httplib.HeaderTests) ... ok
test_responses (test.test_httplib.OfflineTest) ... ok
test_bad_status_repr (test.test_httplib.BasicTest) ... ok
test_chunked (test.test_httplib.BasicTest) ... ok
test_chunked_head (test.test_httplib.BasicTest) ... ok
test_early_eof (test.test_httplib.BasicTest) ... ok
test_epipe (test.test_httplib.BasicTest) ... ok
test_error_leak (test.test_httplib.BasicTest) ... ok
test_filenoattr (test.test_httplib.BasicTest) ... ok
test_host_port (test.test_httplib.BasicTest) ... ok
test_incomplete_read (test.test_httplib.BasicTest) ... ok
test_negative_content_length (test.test_httplib.BasicTest) ... ok
test_overflowing_chunked_line (test.test_httplib.BasicTest) ... ok
test_overflowing_header_line (test.test_httplib.BasicTest) ... ok
test_overflowing_status_line (test.test_httplib.BasicTest) ... skipped 'disabled for HTTP 0.9 support'
test_partial_reads (test.test_httplib.BasicTest) ... ok
test_partial_reads_incomplete_body (test.test_httplib.BasicTest) ... ok
test_partial_reads_no_content_length (test.test_httplib.BasicTest) ... ok
test_proxy_tunnel_without_status_line (test.test_httplib.BasicTest) ... ok
test_read_head (test.test_httplib.BasicTest) ... ok
test_response_headers (test.test_httplib.BasicTest) ... ok
test_send (test.test_httplib.BasicTest) ... ok
test_send_file (test.test_httplib.BasicTest) ... ok
test_send_tempfile (test.test_httplib.BasicTest) ... ok
test_status_lines (test.test_httplib.BasicTest) ... ok
test_too_many_headers (test.test_httplib.BasicTest) ... ok
testTimeoutAttribute (test.test_httplib.TimeoutTest)
This will prove that the timeout gets through ... ok
testHTTPConnection (test.test_httplib.HTTPTest) ... ok
testHTTPWithConnectHostPort (test.test_httplib.HTTPTest) ... ok
test_attributes (test.test_httplib.HTTPSTest) ... ok
test_host_port (test.test_httplib.HTTPSTest) ... ok
test_local_bad_hostname (test.test_httplib.HTTPSTest) ... Traceback (most recent call last):
  File "/tmp/B.s9fqCB/BUILD/Python-2.7.15/Lib/SocketServer.py", line 290, in _handle_request_noblock
    self.process_request(request, client_address)
  File "/tmp/B.s9fqCB/BUILD/Python-2.7.15/Lib/SocketServer.py", line 318, in process_request
    self.finish_request(request, client_address)
  File "/tmp/B.s9fqCB/BUILD/Python-2.7.15/Lib/SocketServer.py", line 331, in finish_request
    self.RequestHandlerClass(request, client_address, self)
  File "/tmp/B.s9fqCB/BUILD/Python-2.7.15/Lib/SocketServer.py", line 652, in __init__
    self.handle()
  File "/tmp/B.s9fqCB/BUILD/Python-2.7.15/Lib/BaseHTTPServer.py", line 340, in handle
    self.handle_one_request()
  File "/tmp/B.s9fqCB/BUILD/Python-2.7.15/Lib/BaseHTTPServer.py", line 310, in handle_one_request
    self.raw_requestline = self.rfile.readline(65537)
  File "/tmp/B.s9fqCB/BUILD/Python-2.7.15/Lib/socket.py", line 480, in readline
    data = self._sock.recv(self._rbufsize)
  File "/tmp/B.s9fqCB/BUILD/Python-2.7.15/Lib/ssl.py", line 772, in recv
    return self.read(buflen)
  File "/tmp/B.s9fqCB/BUILD/Python-2.7.15/Lib/ssl.py", line 659, in read
    v = self._sslobj.read(len)
error: [Errno 104] Connection reset by peer
----------------------------------------
Exception happened during processing of request from ('127.0.0.1', 52900)
----------------------------------------
 server (('127.0.0.1', 42985):42985 ('TLS_AES_256_GCM_SHA384', 'TLSv1.3', 256)):
   [14/Sep/2018 07:23:10] code 404, message File not found
 server (('127.0.0.1', 42985):42985 ('TLS_AES_256_GCM_SHA384', 'TLSv1.3', 256)):
   [14/Sep/2018 07:23:10] "GET /nonexistent HTTP/1.1" 404 -
stopping HTTPS server
joining HTTPS thread
ok
test_local_good_hostname (test.test_httplib.HTTPSTest) ...  server (('127.0.0.1', 38071):38071 ('TLS_AES_256_GCM_SHA384', 'TLSv1.3', 256)):
   [14/Sep/2018 07:23:10] code 404, message File not found
 server (('127.0.0.1', 38071):38071 ('TLS_AES_256_GCM_SHA384', 'TLSv1.3', 256)):
   [14/Sep/2018 07:23:10] "GET /nonexistent HTTP/1.1" 404 -
stopping HTTPS server
joining HTTPS thread
ok
test_local_unknown_cert (test.test_httplib.HTTPSTest) ... stopping HTTPS server
joining HTTPS thread
ok
test_networked (test.test_httplib.HTTPSTest) ... skipped "Use of the `network' resource not enabled"
test_networked_bad_cert (test.test_httplib.HTTPSTest) ... skipped "Use of the `network' resource not enabled"
test_networked_good_cert (test.test_httplib.HTTPSTest) ... skipped "Use of the `network' resource not enabled"
test_networked_noverification (test.test_httplib.HTTPSTest) ... skipped "Use of the `network' resource not enabled"
test_networked_trusted_by_default_cert (test.test_httplib.HTTPSTest) ... skipped "Use of the `network' resource not enabled"
testHTTPConnectionSourceAddress (test.test_httplib.SourceAddressTest) ... ok
testHTTPSConnectionSourceAddress (test.test_httplib.SourceAddressTest) ... ok
test_connect (test.test_httplib.TunnelTests) ... ok

----------------------------------------------------------------------
Ran 51 tests in 0.276s

OK (skipped=6)
Re-running test 'test_ssl' in verbose mode
test_ssl: testing with 'OpenSSL 1.1.1  11 Sep 2018' (1, 1, 1, 0, 15)
          under Linux ('PLD Linux (Th)', '3.0', '')
          HAS_SNI = True
          OP_ALL = 0x80000054
          OP_NO_TLSv1_1 = 0x10000000
test__create_stdlib_context (test.test_ssl.ContextTests) ... ok
test__https_verify_certificates (test.test_ssl.ContextTests) ... ok
test__https_verify_envvar (test.test_ssl.ContextTests) ... ok
test_cert_store_stats (test.test_ssl.ContextTests) ... ok
test_check_hostname (test.test_ssl.ContextTests) ... ok
test_ciphers (test.test_ssl.ContextTests) ... ok
test_constructor (test.test_ssl.ContextTests) ... ok
test_create_default_context (test.test_ssl.ContextTests) ... ok
test_get_ca_certs (test.test_ssl.ContextTests) ... ok
test_load_cert_chain (test.test_ssl.ContextTests) ... ok
test_load_default_certs (test.test_ssl.ContextTests) ... ok
test_load_default_certs_env (test.test_ssl.ContextTests) ... ok
test_load_default_certs_env_windows (test.test_ssl.ContextTests) ... skipped 'Windows specific'
test_load_dh_params (test.test_ssl.ContextTests) ... ok
test_load_verify_cadata (test.test_ssl.ContextTests) ... ok
test_load_verify_locations (test.test_ssl.ContextTests) ... ok
test_options (test.test_ssl.ContextTests) ... FAIL
test_protocol (test.test_ssl.ContextTests) ... ok
test_session_stats (test.test_ssl.ContextTests) ... ok
test_set_default_verify_paths (test.test_ssl.ContextTests) ... ok
test_set_ecdh_curve (test.test_ssl.ContextTests) ... ok
test_sni_callback (test.test_ssl.ContextTests) ... ok
test_sni_callback_refcycle (test.test_ssl.ContextTests) ... ok
test_verify_flags (test.test_ssl.ContextTests) ... ok
test_verify_mode (test.test_ssl.ContextTests) ... ok
test_sslwrap_simple (test.test_ssl.BasicTests) ... ok
test_DER_to_PEM (test.test_ssl.BasicSocketTests) ... ok
test_asn1object (test.test_ssl.BasicSocketTests) ... ok
test_cert_time_to_seconds (test.test_ssl.BasicSocketTests) ... ok
test_cert_time_to_seconds_locale (test.test_ssl.BasicSocketTests) ... skipped 'locale-specific month name needs to be different from C locale'
test_cert_time_to_seconds_timezone (test.test_ssl.BasicSocketTests) ... ok
test_constants (test.test_ssl.BasicSocketTests) ... ok
test_empty_cert (test.test_ssl.BasicSocketTests)
Wrapping with an empty cert file ... ok
test_enum_certificates (test.test_ssl.BasicSocketTests) ... skipped 'Windows specific'
test_enum_crls (test.test_ssl.BasicSocketTests) ... skipped 'Windows specific'
test_errors (test.test_ssl.BasicSocketTests) ... ok
test_get_default_verify_paths (test.test_ssl.BasicSocketTests) ... ok
test_malformed_cert (test.test_ssl.BasicSocketTests)
Wrapping with a badly formatted certificate (syntax error) ... ok
test_malformed_key (test.test_ssl.BasicSocketTests)
Wrapping with a badly formatted key (syntax error) ... ok
test_match_hostname (test.test_ssl.BasicSocketTests) ... ok
test_openssl_version (test.test_ssl.BasicSocketTests) ... ok
test_parse_all_sans (test.test_ssl.BasicSocketTests) ... ok
test_parse_cert (test.test_ssl.BasicSocketTests) ... 
{'issuer': ((('countryName', u'XY'),),
            (('localityName', u'Castle Anthrax'),),
            (('organizationName', u'Python Software Foundation'),),
            (('commonName', u'localhost'),)),
 'notAfter': 'Oct  5 23:01:56 2020 GMT',
 'notBefore': u'Oct  8 23:01:56 2010 GMT',
 'serialNumber': u'D7C7381919AFC24E',
 'subject': ((('countryName', u'XY'),),
             (('localityName', u'Castle Anthrax'),),
             (('organizationName', u'Python Software Foundation'),),
             (('commonName', u'localhost'),)),
 'subjectAltName': (('DNS', 'localhost'),),
 'version': 3L}

{'OCSP': (u'http://ocsp.verisign.com',),
 'caIssuers': (u'http://SVRIntl-G3-aia.verisign.com/SVRIntlG3.cer',),
 'crlDistributionPoints': (u'http://SVRIntl-G3-crl.verisign.com/SVRIntlG3.crl',),
 'issuer': ((('countryName', u'US'),),
            (('organizationName', u'VeriSign, Inc.'),),
            (('organizationalUnitName', u'VeriSign Trust Network'),),
            (('organizationalUnitName',
              u'Terms of use at https://www.verisign.com/rpa (c)10'),),
            (('commonName',
              u'VeriSign Class 3 International Server CA - G3'),)),
 'notAfter': 'Sep 20 23:59:59 2012 GMT',
 'notBefore': u'Sep 21 00:00:00 2011 GMT',
 'serialNumber': u'2EE6EA7640A075CEE5005F4D7C79549A',
 'subject': ((('countryName', u'FI'),),
             (('stateOrProvinceName', u'Espoo'),),
             (('localityName', u'Espoo'),),
             (('organizationName', u'Nokia'),),
             (('organizationalUnitName', u'BI'),),
             (('commonName', u'projects.developer.nokia.com'),)),
 'subjectAltName': (('DNS', 'projects.developer.nokia.com'),
                    ('DNS', 'projects.forum.nokia.com')),
 'version': 3L}
ok
test_parse_cert_CVE_2013_4238 (test.test_ssl.BasicSocketTests) ... 
{'issuer': ((('countryName', u'US'),),
            (('stateOrProvinceName', u'Oregon'),),
            (('localityName', u'Beaverton'),),
            (('organizationName', u'Python Software Foundation'),),
            (('organizationalUnitName', u'Python Core Development'),),
            (('commonName', u'null.python.org\x00example.org'),),
            (('emailAddress', u'python-dev@python.org'),)),
 'notAfter': 'Aug  7 13:12:52 2013 GMT',
 'notBefore': u'Aug  7 13:11:52 2013 GMT',
 'serialNumber': u'00',
 'subject': ((('countryName', u'US'),),
             (('stateOrProvinceName', u'Oregon'),),
             (('localityName', u'Beaverton'),),
             (('organizationName', u'Python Software Foundation'),),
             (('organizationalUnitName', u'Python Core Development'),),
             (('commonName', u'null.python.org\x00example.org'),),
             (('emailAddress', u'python-dev@python.org'),)),
 'subjectAltName': (('DNS', 'altnull.python.org\x00example.com'),
                    ('email', 'null@python.org\x00user@example.org'),
                    ('URI', 'http://null.python.org\x00http://example.org'),
                    ('IP Address', '192.0.2.1'),
                    ('IP Address', '2001:DB8:0:0:0:0:0:1\n')),
 'version': 3L}
ok
test_purpose_enum (test.test_ssl.BasicSocketTests) ... ok
test_random (test.test_ssl.BasicSocketTests) ... 
 RAND_status is 1 (sufficient randomness)
ok
test_refcycle (test.test_ssl.BasicSocketTests) ... ok
test_server_side (test.test_ssl.BasicSocketTests) ... ok
test_timeout (test.test_ssl.BasicSocketTests) ... ok
test_tls_unique_channel_binding (test.test_ssl.BasicSocketTests) ... ok
test_unknown_channel_binding (test.test_ssl.BasicSocketTests) ... ok
test_unsupported_dtls (test.test_ssl.BasicSocketTests) ... ok
test_wrapped_unconnected (test.test_ssl.BasicSocketTests) ... ok
test_lib_reason (test.test_ssl.SSLErrorTests) ... ok
test_str (test.test_ssl.SSLErrorTests) ... ok
test_subclass (test.test_ssl.SSLErrorTests) ... ok
test_alpn_protocols (test.test_ssl.ThreadedTests) ...  server:  new connection from ('127.0.0.1', 43704)
 server: connection cipher is now ('ECDHE-RSA-AES256-GCM-SHA384', 'TLSv1.2', 256)
 server: selected protocol is now None
 client:  sending 'FOO\n'...
 client:  read 'foo\n'
 client:  sending 'FOO\n'...
 client:  read 'foo\n'
 client:  sending 'FOO\n'...
 client:  read 'foo\n'
 client:  closing connection.
 server:  new connection from ('127.0.0.1', 43194)
 server: connection cipher is now ('ECDHE-RSA-AES256-GCM-SHA384', 'TLSv1.2', 256)
 server: selected protocol is now None
 client:  sending 'FOO\n'...
 client:  read 'foo\n'
 client:  sending 'FOO\n'...
 client:  read 'foo\n'
 client:  sending 'FOO\n'...
 client:  read 'foo\n'
 client:  closing connection.
 server:  new connection from ('127.0.0.1', 46574)
 server: connection cipher is now ('ECDHE-RSA-AES256-GCM-SHA384', 'TLSv1.2', 256)
 server: selected protocol is now None
 client:  sending 'FOO\n'...
 client:  read 'foo\n'
 client:  sending 'FOO\n'...
 client:  read 'foo\n'
 client:  sending 'FOO\n'...
 client:  read 'foo\n'
 client:  closing connection.
 server:  new connection from ('127.0.0.1', 45288)
 server: connection cipher is now ('ECDHE-RSA-AES256-GCM-SHA384', 'TLSv1.2', 256)
 server: selected protocol is now None
 client:  sending 'FOO\n'...
 client:  read 'foo\n'
 client:  sending 'FOO\n'...
 client:  read 'foo\n'
 client:  sending 'FOO\n'...
 client:  read 'foo\n'
 client:  closing connection.
ok
test_asyncore_server (test.test_ssl.ThreadedTests)
Check the example asyncore integration. ... 
 server:  new connection from 127.0.0.1:56638
 client:  sending 'FOO\n'...
 server:  read 'FOO\n' from client
 client:  read 'foo\n'
 client:  closing connection.
 client:  connection closed.
 cleanup: stopping server.
 cleanup: joining server thread.
 server:  read 'over\n' from client
 server:  closed connection <ssl.SSLSocket object at 0x7ff2de62a230>
 server:  read '' from client
 cleanup: successfully joined.
ok
test_check_hostname (test.test_ssl.ThreadedTests) ... 
 server:  new connection from ('127.0.0.1', 53158)
 server: connection cipher is now ('ECDHE-RSA-AES256-SHA', 'TLSv1.0', 256)
 server: selected protocol is now None
 server:  new connection from ('127.0.0.1', 35400)
 server: connection cipher is now ('ECDHE-RSA-AES256-SHA', 'TLSv1.0', 256)
 server: selected protocol is now None
ok
test_compression (test.test_ssl.ThreadedTests) ...  server:  new connection from ('127.0.0.1', 45522)
 server: connection cipher is now ('ECDHE-RSA-AES256-SHA', 'TLSv1.0', 256)
 server: selected protocol is now None
 client:  sending 'FOO\n'...
 client:  read 'foo\n'
 client:  sending 'FOO\n'...
 client:  read 'foo\n'
 client:  sending 'FOO\n'...
 client:  read 'foo\n'
 client:  closing connection.
 got compression: None
ok
test_compression_disabled (test.test_ssl.ThreadedTests) ...  server:  new connection from ('127.0.0.1', 41382)
 server: connection cipher is now ('ECDHE-RSA-AES256-SHA', 'TLSv1.0', 256)
 server: selected protocol is now None
 client:  sending 'FOO\n'...
 client:  read 'foo\n'
 client:  sending 'FOO\n'...
 client:  read 'foo\n'
 client:  sending 'FOO\n'...
 client:  read 'foo\n'
 client:  closing connection.
ok
test_crl_check (test.test_ssl.ThreadedTests) ... 
 server:  new connection from ('127.0.0.1', 55824)
 server: connection cipher is now ('ECDHE-RSA-AES256-SHA', 'TLSv1.0', 256)
 server: selected protocol is now None
 server:  new connection from ('127.0.0.1', 44692)

 server:  bad connection attempt from ('127.0.0.1', 44692):
Traceback (most recent call last):
   File "/tmp/B.s9fqCB/BUILD/Python-2.7.15/Lib/test/test_ssl.py", line 1663, in wrap_conn
    self.sock, server_side=True)
   File "/tmp/B.s9fqCB/BUILD/Python-2.7.15/Lib/ssl.py", line 369, in wrap_socket
    _context=self)
   File "/tmp/B.s9fqCB/BUILD/Python-2.7.15/Lib/ssl.py", line 617, in __init__
    self.do_handshake()
   File "/tmp/B.s9fqCB/BUILD/Python-2.7.15/Lib/ssl.py", line 846, in do_handshake
    self._sslobj.do_handshake()
 SSLError: [SSL: TLSV1_ALERT_UNKNOWN_CA] tlsv1 alert unknown ca (_ssl.c:726)
 server:  new connection from ('127.0.0.1', 48094)
 server: connection cipher is now ('ECDHE-RSA-AES256-SHA', 'TLSv1.0', 256)
 server: selected protocol is now None
ok
test_default_ciphers (test.test_ssl.ThreadedTests) ... FAIL
test_default_ecdh_curve (test.test_ssl.ThreadedTests) ...  server:  new connection from ('127.0.0.1', 35360)
 server: connection cipher is now ('TLS_AES_256_GCM_SHA384', 'TLSv1.3', 256)
 server: selected protocol is now None
FAIL
test_dh_params (test.test_ssl.ThreadedTests) ...  server:  new connection from ('127.0.0.1', 44196)
 server: connection cipher is now ('DHE-RSA-AES256-SHA', 'SSLv3', 256)
 server: selected protocol is now None
 client:  sending 'FOO\n'...
 client:  read 'foo\n'
 client:  sending 'FOO\n'...
 client:  read 'foo\n'
 client:  sending 'FOO\n'...
 client:  read 'foo\n'
 client:  closing connection.
ok
test_do_handshake_enotconn (test.test_ssl.ThreadedTests) ... ok
test_echo (test.test_ssl.ThreadedTests)
Basic test of an SSL client connecting to a server ... 
 server:  new connection from ('127.0.0.1', 57888)
 client:  sending 'FOO\n'...
 server: connection cipher is now ('TLS_AES_256_GCM_SHA384', 'TLSv1.3', 256)
 server: selected protocol is now None
 client:  read 'foo\n'
 client:  sending 'FOO\n'...
 client:  read 'foo\n'
 client:  sending 'FOO\n'...
 client:  read 'foo\n'
 client:  closing connection.
 server:  new connection from ('127.0.0.1', 47146)
 server: connection cipher is now ('ECDHE-RSA-AES256-SHA', 'TLSv1.0', 256)
 server: selected protocol is now None
 client:  sending 'FOO\n'...
 client:  read 'foo\n'
 client:  sending 'FOO\n'...
 client:  read 'foo\n'
 client:  sending 'FOO\n'...
 client:  read 'foo\n'
 client:  closing connection.
 server:  new connection from ('127.0.0.1', 34860)
 server: connection cipher is now ('ECDHE-RSA-AES256-SHA', 'TLSv1.0', 256)
 server: selected protocol is now None
 client:  sending 'FOO\n'...
 client:  read 'foo\n'
 client:  sending 'FOO\n'...
 client:  read 'foo\n'
 client:  sending 'FOO\n'...
 client:  read 'foo\n'
 client:  closing connection.
 server:  new connection from ('127.0.0.1', 55412)
 server: connection cipher is now ('ECDHE-RSA-AES256-GCM-SHA384', 'TLSv1.2', 256)
 server: selected protocol is now None
 client:  sending 'FOO\n'...
 client:  read 'foo\n'
 client:  sending 'FOO\n'...
 client:  read 'foo\n'
 client:  sending 'FOO\n'...
 client:  read 'foo\n'
 client:  closing connection.
ok
test_getpeercert (test.test_ssl.ThreadedTests) ... Exception in thread Thread-1476:
Traceback (most recent call last):
  File "/tmp/B.s9fqCB/BUILD/Python-2.7.15/Lib/threading.py", line 801, in __bootstrap_inner
    self.run()
  File "/tmp/B.s9fqCB/BUILD/Python-2.7.15/Lib/test/test_ssl.py", line 1723, in run
    msg = self.read()
  File "/tmp/B.s9fqCB/BUILD/Python-2.7.15/Lib/test/test_ssl.py", line 1700, in read
    return self.sslconn.read()
  File "/tmp/B.s9fqCB/BUILD/Python-2.7.15/Lib/ssl.py", line 659, in read
    v = self._sslobj.read(len)
error: [Errno 104] Connection reset by peer


{'issuer': ((('countryName', u'XY'),),
            (('localityName', u'Castle Anthrax'),),
            (('organizationName', u'Python Software Foundation'),),
            (('commonName', u'localhost'),)),
 'notAfter': 'Oct  5 23:01:56 2020 GMT',
 'notBefore': u'Oct  8 23:01:56 2010 GMT',
 'serialNumber': u'D7C7381919AFC24E',
 'subject': ((('countryName', u'XY'),),
             (('localityName', u'Castle Anthrax'),),
             (('organizationName', u'Python Software Foundation'),),
             (('commonName', u'localhost'),)),
 'subjectAltName': (('DNS', 'localhost'),),
 'version': 3L}
Connection cipher is ('TLS_AES_256_GCM_SHA384', 'TLSv1.3', 256).
ok
test_getpeercert_enotconn (test.test_ssl.ThreadedTests) ... ok
test_handshake_timeout (test.test_ssl.ThreadedTests) ... ok
test_npn_protocols (test.test_ssl.ThreadedTests) ... skipped 'NPN support needed for this test'
test_protocol_sslv2 (test.test_ssl.ThreadedTests)
Connecting to an SSLv2 server with various client options ... skipped 'OpenSSL is compiled without SSLv2 support'
test_protocol_sslv23 (test.test_ssl.ThreadedTests)
Connecting to an SSLv23 server with various client options ... 
 PROTOCOL_TLS->PROTOCOL_TLS CERT_NONE
 PROTOCOL_TLSv1->PROTOCOL_TLS CERT_NONE
 PROTOCOL_TLS->PROTOCOL_TLS CERT_OPTIONAL
 PROTOCOL_TLSv1->PROTOCOL_TLS CERT_OPTIONAL
 PROTOCOL_TLS->PROTOCOL_TLS CERT_REQUIRED
 PROTOCOL_TLSv1->PROTOCOL_TLS CERT_REQUIRED
 PROTOCOL_TLS->PROTOCOL_TLS CERT_NONE
 {PROTOCOL_TLSv1->PROTOCOL_TLS} CERT_NONE
ok
test_protocol_sslv3 (test.test_ssl.ThreadedTests)
Connecting to an SSLv3 server with various client options ... skipped 'OpenSSL is compiled without SSLv3 support'
test_protocol_tlsv1 (test.test_ssl.ThreadedTests)
Connecting to a TLSv1 server with various client options ... 
 PROTOCOL_TLSv1->PROTOCOL_TLSv1 CERT_NONE
 PROTOCOL_TLSv1->PROTOCOL_TLSv1 CERT_OPTIONAL
 PROTOCOL_TLSv1->PROTOCOL_TLSv1 CERT_REQUIRED
 {PROTOCOL_TLS->PROTOCOL_TLSv1} CERT_NONE
ok
test_protocol_tlsv1_1 (test.test_ssl.ThreadedTests)
Connecting to a TLSv1.1 server with various client options. ... 
 PROTOCOL_TLSv1_1->PROTOCOL_TLSv1_1 CERT_NONE
 {PROTOCOL_TLS->PROTOCOL_TLSv1_1} CERT_NONE
 PROTOCOL_TLSv1_1->PROTOCOL_TLS CERT_NONE
 {PROTOCOL_TLSv1->PROTOCOL_TLSv1_1} CERT_NONE
 {PROTOCOL_TLSv1_1->PROTOCOL_TLSv1} CERT_NONE
ok
test_protocol_tlsv1_2 (test.test_ssl.ThreadedTests)
Connecting to a TLSv1.2 server with various client options. ... 
 PROTOCOL_TLSv1_2->PROTOCOL_TLSv1_2 CERT_NONE
 {PROTOCOL_TLS->PROTOCOL_TLSv1_2} CERT_NONE
 PROTOCOL_TLSv1_2->PROTOCOL_TLS CERT_NONE
 {PROTOCOL_TLSv1->PROTOCOL_TLSv1_2} CERT_NONE
 {PROTOCOL_TLSv1_2->PROTOCOL_TLSv1} CERT_NONE
 {PROTOCOL_TLSv1_1->PROTOCOL_TLSv1_2} CERT_NONE
 {PROTOCOL_TLSv1_2->PROTOCOL_TLSv1_1} CERT_NONE
ok
test_read_write_after_close_raises_valuerror (test.test_ssl.ThreadedTests) ... ok
test_recv_send (test.test_ssl.ThreadedTests)
Test recv(), send() and friends. ... 
 server:  new connection from ('127.0.0.1', 52224)
 server: connection cipher is now ('ECDHE-RSA-AES256-SHA', 'TLSv1.0', 256)
 server: selected protocol is now None
ok
test_recv_zero (test.test_ssl.ThreadedTests) ...  server:  new connection from ('127.0.0.1', 47032)
 server: connection cipher is now ('TLS_AES_256_GCM_SHA384', 'TLSv1.3', 256)
 server: selected protocol is now None
ok
test_rude_shutdown (test.test_ssl.ThreadedTests)
A brutal shutdown of an SSL server should raise an OSError ... ok
test_selected_alpn_protocol (test.test_ssl.ThreadedTests) ...  server:  new connection from ('127.0.0.1', 38072)
 server: connection cipher is now ('ECDHE-RSA-AES256-SHA', 'TLSv1.0', 256)
 server: selected protocol is now None
 client:  sending 'FOO\n'...
 client:  read 'foo\n'
 client:  sending 'FOO\n'...
 client:  read 'foo\n'
 client:  sending 'FOO\n'...
 client:  read 'foo\n'
 client:  closing connection.
ok
test_selected_alpn_protocol_if_server_uses_alpn (test.test_ssl.ThreadedTests) ...  server:  new connection from ('127.0.0.1', 57620)
 server: connection cipher is now ('ECDHE-RSA-AES256-SHA', 'TLSv1.0', 256)
 server: selected protocol is now None
 client:  sending 'FOO\n'...
 client:  read 'foo\n'
 client:  sending 'FOO\n'...
 client:  read 'foo\n'
 client:  sending 'FOO\n'...
 client:  read 'foo\n'
 client:  closing connection.
ok
test_selected_npn_protocol (test.test_ssl.ThreadedTests) ...  server:  new connection from ('127.0.0.1', 35268)
 server: connection cipher is now ('ECDHE-RSA-AES256-SHA', 'TLSv1.0', 256)
 server: selected protocol is now None
 client:  sending 'FOO\n'...
 client:  read 'foo\n'
 client:  sending 'FOO\n'...
 client:  read 'foo\n'
 client:  sending 'FOO\n'...
 client:  read 'foo\n'
 client:  closing connection.
ok
test_server_accept (test.test_ssl.ThreadedTests) ... ok
test_sni_callback (test.test_ssl.ThreadedTests) ...  server:  new connection from ('127.0.0.1', 39096)
 server: connection cipher is now ('ECDHE-RSA-AES256-SHA', 'TLSv1.0', 256)
 server: selected protocol is now None
 server:  new connection from ('127.0.0.1', 45402)
 server: connection cipher is now ('ECDHE-RSA-AES256-SHA', 'TLSv1.0', 256)
 server: selected protocol is now None
 server:  new connection from ('127.0.0.1', 43406)
 server: connection cipher is now ('ECDHE-RSA-AES256-SHA', 'TLSv1.0', 256)
 server: selected protocol is now None
ok
test_sni_callback_alert (test.test_ssl.ThreadedTests) ... ok
test_sni_callback_raising (test.test_ssl.ThreadedTests) ... ok
test_sni_callback_wrong_return_type (test.test_ssl.ThreadedTests) ... ok
test_socketserver (test.test_ssl.ThreadedTests)
Using a SocketServer to create and manage SSL connections. ... 
 server (('127.0.0.1', 34845):34845 ('TLS_AES_256_GCM_SHA384', 'TLSv1.3', 256)):
   [14/Sep/2018 07:23:12] "GET /keycert.pem HTTP/1.1" 200 -
 client: read 1783 bytes from remote server '<HTTPSServerThread <HTTPSServer localhost:34845>>'
stopping HTTPS server
joining HTTPS thread
ok
test_starttls (test.test_ssl.ThreadedTests)
Switching from clear text to encrypted and back again. ... 
 client:  sending 'msg 1'...
 server:  new connection from ('127.0.0.1', 32928)
 server: read 'msg 1' (unencrypted), sending back 'msg 1' (unencrypted)...
 client:  read 'msg 1' from server
 client:  sending 'MSG 2'...
 server: read 'MSG 2' (unencrypted), sending back 'msg 2' (unencrypted)...
 client:  read 'msg 2' from server
 client:  sending 'STARTTLS'...
 server: read STARTTLS from client, sending OK...
 client:  read 'ok' from server, starting TLS...
 server: connection cipher is now ('ECDHE-RSA-AES256-SHA', 'TLSv1.0', 256)
 server: selected protocol is now None
 client:  sending 'MSG 3'...
 server: read 'MSG 3' (encrypted), sending back 'msg 3' (encrypted)...
 client:  read 'msg 3' from server
 client:  sending 'msg 4'...
 server: read 'msg 4' (encrypted), sending back 'msg 4' (encrypted)...
 client:  read 'msg 4' from server
 client:  sending 'ENDTLS'...
 server: read ENDTLS from client, sending OK...
 client:  read 'ok' from server, ending TLS...
 server: connection is now unencrypted...
 client:  sending 'msg 5'...
 server: read 'msg 5' (unencrypted), sending back 'msg 5' (unencrypted)...
 client:  read 'msg 5' from server
 client:  sending 'msg 6'...
 server: read 'msg 6' (unencrypted), sending back 'msg 6' (unencrypted)...
 client:  read 'msg 6' from server
 client:  closing connection.
 server: client closed connection
ok
test_tls1_3 (test.test_ssl.ThreadedTests) ... ERROR
test_tls_unique_channel_binding (test.test_ssl.ThreadedTests)
Test tls-unique channel binding. ... 
 server:  new connection from ('127.0.0.1', 53306)
 server: connection cipher is now ('ECDHE-RSA-AES256-SHA', 'TLSv1.0', 256)
 server: selected protocol is now None
 got channel binding data: 'nf\x8c[\xab\xd3Y^\xe4(\x13m'
 server:  new connection from ('127.0.0.1', 53308)
 server: connection cipher is now ('ECDHE-RSA-AES256-SHA', 'TLSv1.0', 256)
 server: selected protocol is now None
 got another channel binding data: '\x81\x9eH\xe4\xcb\xbc+#~.Y\xb2'
ok
test_version_basic (test.test_ssl.ThreadedTests) ... ok
test_wrong_cert (test.test_ssl.ThreadedTests)
Connecting when the server rejects the client's certificate ... test test_ssl failed -- multiple errors occurred

SSLError is SSLError(1, u'[SSL: TLSV1_ALERT_UNKNOWN_CA] tlsv1 alert unknown ca (_ssl.c:726)')
ok

======================================================================
ERROR: test_tls1_3 (test.test_ssl.ThreadedTests)
----------------------------------------------------------------------
Traceback (most recent call last):
  File "/tmp/B.s9fqCB/BUILD/Python-2.7.15/Lib/test/test_ssl.py", line 2808, in test_tls1_3
    with context.wrap_socket(socket.socket()) as s:
AttributeError: __exit__

======================================================================
FAIL: test_options (test.test_ssl.ContextTests)
----------------------------------------------------------------------
Traceback (most recent call last):
  File "/tmp/B.s9fqCB/BUILD/Python-2.7.15/Lib/test/test_ssl.py", line 780, in test_options
    self.assertEqual(default, ctx.options)
AssertionError: 2181169236 != 2182217812L

======================================================================
FAIL: test_default_ciphers (test.test_ssl.ThreadedTests)
----------------------------------------------------------------------
Traceback (most recent call last):
  File "/tmp/B.s9fqCB/BUILD/Python-2.7.15/Lib/test/test_ssl.py", line 2780, in test_default_ciphers
    s.connect((HOST, server.port))
AssertionError: SSLError not raised

======================================================================
FAIL: test_default_ecdh_curve (test.test_ssl.ThreadedTests)
----------------------------------------------------------------------
Traceback (most recent call last):
  File "/tmp/B.s9fqCB/BUILD/Python-2.7.15/Lib/test/test_ssl.py", line 2831, in test_default_ecdh_curve
    self.assertIn("ECDH", s.cipher()[0])
AssertionError: 'ECDH' not found in 'TLS_AES_256_GCM_SHA384'

----------------------------------------------------------------------
Ran 95 tests in 1.847s

FAILED (failures=3, errors=1, skipped=7)
1 test failed again:
    test_ssl

Total duration: 10 min 14 sec
Tests result: FAILURE
make: [Makefile:879: test] Error 2 (ignored)
LD_LIBRARY_PATH=/tmp/B.s9fqCB/BUILD/Python-2.7.15 PYTHONHOME=/tmp/B.s9fqCB/BUILD/Python-2.7.15 PYTHONPATH=/tmp/B.s9fqCB/BUILD/Python-2.7.15/Lib:/tmp/B.s9fqCB/BUILD/Python-2.7.15/Lib/lib-tk:/tmp/B.s9fqCB/BUILD/Python-2.7.15/build/lib.linux-x86_64-2.7 ./python -tt ./Lib/test/regrtest.py -w -l -x test_resource test_openpty test_socket test_nis test_posix test_locale test_pty test_urllib2 test_doctest test_pydoc test_distutils test_gdb test_audioop test_rgbimg test_imageop
== CPython 2.7.15 (default, Sep 14 2018, 07:12:05) [GCC 8.2.0 20180726 (release)]
==   Linux-4.9.119-1-x86_64-Intel-R-_Xeon-R-_CPU___________X5482__@_3.20GHz-with-pld-3.0 little-endian
==   /tmp/B.s9fqCB/BUILD/Python-2.7.15/build/test_python_8191
== CPU count: 8
Run tests sequentially
0:00:00 load avg: 0.86 [  1/389] test_grammar
0:00:00 load avg: 0.86 [  2/389] test_opcodes
0:00:00 load avg: 0.86 [  3/389] test_dict
0:00:00 load avg: 0.86 [  4/389] test_builtin
0:00:00 load avg: 0.86 [  5/389] test_exceptions
0:00:00 load avg: 0.86 [  6/389] test_types
0:00:00 load avg: 0.86 [  7/389] test_unittest
0:00:00 load avg: 0.86 [  8/389] test_doctest2
0:00:00 load avg: 0.86 [  9/389] test_MimeWriter
0:00:00 load avg: 0.86 [ 10/389] test_SimpleHTTPServer
0:00:00 load avg: 0.86 [ 11/389] test_StringIO
0:00:00 load avg: 0.86 [ 12/389] test___all__
0:00:01 load avg: 0.86 [ 13/389] test___future__
0:00:01 load avg: 0.86 [ 14/389] test__locale
0:00:01 load avg: 0.86 [ 15/389] test__osx_support
0:00:01 load avg: 0.86 [ 16/389] test_abc
0:00:01 load avg: 0.86 [ 17/389] test_abstract_numbers
0:00:01 load avg: 0.86 [ 18/389] test_aepack
test_aepack skipped -- No module named aetypes
0:00:01 load avg: 0.86 [ 19/389] test_aifc -- test_aepack skipped
0:00:01 load avg: 0.86 [ 20/389] test_al
test_al skipped -- No module named al
0:00:01 load avg: 0.86 [ 21/389] test_anydbm -- test_al skipped
0:00:01 load avg: 0.86 [ 22/389] test_applesingle
test_applesingle skipped -- No module named MacOS
0:00:01 load avg: 0.86 [ 23/389] test_argparse -- test_applesingle skipped
0:00:04 load avg: 0.87 [ 24/389] test_array
0:00:05 load avg: 0.87 [ 25/389] test_ascii_formatd
0:00:05 load avg: 0.87 [ 26/389] test_ast
0:00:05 load avg: 0.87 [ 27/389] test_asynchat
0:00:06 load avg: 0.87 [ 28/389] test_asyncore
0:00:07 load avg: 0.87 [ 29/389] test_atexit
0:00:08 load avg: 0.87 [ 30/389] test_augassign
0:00:08 load avg: 0.87 [ 31/389] test_base64
0:00:08 load avg: 0.87 [ 32/389] test_bastion
0:00:08 load avg: 0.87 [ 33/389] test_bigaddrspace
0:00:08 load avg: 0.87 [ 34/389] test_bigmem
0:00:08 load avg: 0.87 [ 35/389] test_binascii
0:00:08 load avg: 0.87 [ 36/389] test_binhex
0:00:08 load avg: 0.87 [ 37/389] test_binop
0:00:08 load avg: 0.87 [ 38/389] test_bisect
0:00:08 load avg: 0.87 [ 39/389] test_bool
0:00:08 load avg: 0.87 [ 40/389] test_bsddb
0:00:09 load avg: 0.88 [ 41/389] test_bsddb185
test_bsddb185 skipped -- No module named bsddb185
0:00:09 load avg: 0.88 [ 42/389] test_bsddb3 -- test_bsddb185 skipped
test_bsddb3 skipped -- Use of the `bsddb' resource not enabled
0:00:09 load avg: 0.88 [ 43/389] test_buffer -- test_bsddb3 skipped (resource denied)
0:00:09 load avg: 0.88 [ 44/389] test_bufio
0:00:10 load avg: 0.88 [ 45/389] test_bytes
0:00:11 load avg: 0.88 [ 46/389] test_bz2
0:00:12 load avg: 0.88 [ 47/389] test_calendar
0:00:14 load avg: 0.88 [ 48/389] test_call
0:00:14 load avg: 0.88 [ 49/389] test_capi
0:00:17 load avg: 0.89 [ 50/389] test_cd
test_cd skipped -- No module named cd
0:00:17 load avg: 0.89 [ 51/389] test_cfgparser -- test_cd skipped
0:00:17 load avg: 0.89 [ 52/389] test_cgi
0:00:17 load avg: 0.89 [ 53/389] test_charmapcodec
0:00:17 load avg: 0.89 [ 54/389] test_cl
test_cl skipped -- No module named cl
0:00:17 load avg: 0.89 [ 55/389] test_class -- test_cl skipped
0:00:17 load avg: 0.89 [ 56/389] test_cmath
0:00:17 load avg: 0.89 [ 57/389] test_cmd
0:00:18 load avg: 0.89 [ 58/389] test_cmd_line
0:00:18 load avg: 0.89 [ 59/389] test_cmd_line_script
0:00:19 load avg: 0.90 [ 60/389] test_code
0:00:19 load avg: 0.90 [ 61/389] test_codeccallbacks
0:00:19 load avg: 0.90 [ 62/389] test_codecencodings_cn
0:00:20 load avg: 0.90 [ 63/389] test_codecencodings_hk
0:00:20 load avg: 0.90 [ 64/389] test_codecencodings_iso2022
0:00:20 load avg: 0.90 [ 65/389] test_codecencodings_jp
0:00:21 load avg: 0.90 [ 66/389] test_codecencodings_kr
0:00:21 load avg: 0.90 [ 67/389] test_codecencodings_tw
0:00:22 load avg: 0.90 [ 68/389] test_codecmaps_cn
test_codecmaps_cn skipped -- Use of the `urlfetch' resource not enabled
0:00:22 load avg: 0.90 [ 69/389] test_codecmaps_hk -- test_codecmaps_cn skipped (resource denied)
test_codecmaps_hk skipped -- Use of the `urlfetch' resource not enabled
0:00:22 load avg: 0.90 [ 70/389] test_codecmaps_jp -- test_codecmaps_hk skipped (resource denied)
test_codecmaps_jp skipped -- Use of the `urlfetch' resource not enabled
0:00:22 load avg: 0.90 [ 71/389] test_codecmaps_kr -- test_codecmaps_jp skipped (resource denied)
test_codecmaps_kr skipped -- Use of the `urlfetch' resource not enabled
0:00:22 load avg: 0.90 [ 72/389] test_codecmaps_tw -- test_codecmaps_kr skipped (resource denied)
test_codecmaps_tw skipped -- Use of the `urlfetch' resource not enabled
0:00:22 load avg: 0.90 [ 73/389] test_codecs -- test_codecmaps_tw skipped (resource denied)
0:00:23 load avg: 0.90 [ 74/389] test_codeop
0:00:23 load avg: 0.90 [ 75/389] test_coercion
0:00:24 load avg: 0.90 [ 76/389] test_collections
0:00:24 load avg: 0.91 [ 77/389] test_colorsys
0:00:24 load avg: 0.91 [ 78/389] test_commands
0:00:24 load avg: 0.91 [ 79/389] test_compare
0:00:24 load avg: 0.91 [ 80/389] test_compile
0:00:25 load avg: 0.91 [ 81/389] test_compileall
0:00:25 load avg: 0.91 [ 82/389] test_compiler
0:00:25 load avg: 0.91 [ 83/389] test_complex
0:00:25 load avg: 0.91 [ 84/389] test_complex_args
0:00:25 load avg: 0.91 [ 85/389] test_contains
0:00:25 load avg: 0.91 [ 86/389] test_contextlib
0:00:25 load avg: 0.91 [ 87/389] test_cookie
0:00:26 load avg: 0.91 [ 88/389] test_cookielib
0:00:26 load avg: 0.91 [ 89/389] test_copy
0:00:26 load avg: 0.91 [ 90/389] test_copy_reg
0:00:26 load avg: 0.91 [ 91/389] test_cpickle
0:00:28 load avg: 0.91 [ 92/389] test_cprofile
0:00:28 load avg: 0.91 [ 93/389] test_crypt
0:00:28 load avg: 0.91 [ 94/389] test_csv
0:00:28 load avg: 0.91 [ 95/389] test_ctypes
0:00:29 load avg: 0.91 [ 96/389] test_curses
test_curses skipped -- Use of the `curses' resource not enabled
0:00:30 load avg: 0.91 [ 97/389] test_datetime -- test_curses skipped (resource denied)
0:00:30 load avg: 0.91 [ 98/389] test_dbm
0:00:30 load avg: 0.91 [ 99/389] test_decimal
0:00:32 load avg: 0.91 [100/389] test_decorators
0:00:32 load avg: 0.91 [101/389] test_defaultdict
0:00:32 load avg: 0.91 [102/389] test_deque
0:00:36 load avg: 0.92 [103/389] test_descr
0:00:39 load avg: 0.92 [104/389] test_descrtut
0:00:39 load avg: 0.93 [105/389] test_dictcomps
0:00:39 load avg: 0.93 [106/389] test_dictviews
0:00:39 load avg: 0.93 [107/389] test_difflib
0:00:40 load avg: 0.93 [108/389] test_dircache
0:00:41 load avg: 0.93 [109/389] test_dis
0:00:41 load avg: 0.93 [110/389] test_dl
test_dl skipped -- No module named dl
0:00:41 load avg: 0.93 [111/389] test_docxmlrpc -- test_dl skipped
0:00:45 load avg: 0.85 [112/389] test_dumbdbm
0:00:45 load avg: 0.85 [113/389] test_dummy_thread
0:00:45 load avg: 0.85 [114/389] test_dummy_threading
0:00:45 load avg: 0.85 [115/389] test_email
0:00:49 load avg: 0.85 [116/389] test_email_codecs
0:00:49 load avg: 0.87 [117/389] test_email_renamed
0:00:49 load avg: 0.87 [118/389] test_ensurepip
0:00:49 load avg: 0.87 [119/389] test_enumerate
0:00:49 load avg: 0.87 [120/389] test_eof
0:00:50 load avg: 0.87 [121/389] test_epoll
0:00:52 load avg: 0.87 [122/389] test_errno
0:00:52 load avg: 0.87 [123/389] test_exception_variations
0:00:52 load avg: 0.87 [124/389] test_extcall
0:00:52 load avg: 0.87 [125/389] test_fcntl
0:00:52 load avg: 0.87 [126/389] test_file
0:00:53 load avg: 0.87 [127/389] test_file2k
0:01:00 load avg: 0.88 [128/389] test_file_eintr
0:01:00 load avg: 0.88 [129/389] test_filecmp
0:01:01 load avg: 0.88 [130/389] test_fileinput
0:01:01 load avg: 0.88 [131/389] test_fileio
0:01:01 load avg: 0.88 [132/389] test_float
0:01:01 load avg: 0.88 [133/389] test_fnmatch
0:01:01 load avg: 0.88 [134/389] test_fork1
0:01:08 load avg: 0.81 [135/389] test_format
0:01:08 load avg: 0.81 [136/389] test_fpformat
0:01:09 load avg: 0.81 [137/389] test_fractions
0:01:09 load avg: 0.81 [138/389] test_frozen
0:01:09 load avg: 0.81 [139/389] test_ftplib
0:01:12 load avg: 0.91 [140/389] test_funcattrs
0:01:12 load avg: 0.91 [141/389] test_functools
0:01:12 load avg: 0.91 [142/389] test_future
0:01:13 load avg: 0.91 [143/389] test_future3
0:01:13 load avg: 0.91 [144/389] test_future4
0:01:13 load avg: 0.91 [145/389] test_future5
0:01:13 load avg: 0.91 [146/389] test_future_builtins
0:01:13 load avg: 0.91 [147/389] test_gc
0:01:18 load avg: 0.99 [148/389] test_gdbm
0:01:18 load avg: 0.99 [149/389] test_generators
0:01:19 load avg: 0.99 [150/389] test_genericpath
0:01:19 load avg: 0.99 [151/389] test_genexps
0:01:19 load avg: 0.99 [152/389] test_getargs
0:01:19 load avg: 1.07 [153/389] test_getargs2
0:01:19 load avg: 1.07 [154/389] test_getopt
0:01:19 load avg: 1.07 [155/389] test_gettext
0:01:19 load avg: 1.07 [156/389] test_gl
test_gl skipped -- No module named gl
0:01:20 load avg: 1.07 [157/389] test_glob -- test_gl skipped
0:01:20 load avg: 1.07 [158/389] test_global
0:01:20 load avg: 1.07 [159/389] test_grp
0:01:20 load avg: 1.07 [160/389] test_gzip
0:01:20 load avg: 1.07 [161/389] test_hash
0:01:21 load avg: 1.07 [162/389] test_hashlib
0:01:21 load avg: 1.07 [163/389] test_heapq
0:01:22 load avg: 1.07 [164/389] test_hmac
0:01:22 load avg: 1.07 [165/389] test_hotshot
0:01:22 load avg: 1.07 [166/389] test_htmllib
0:01:22 load avg: 1.07 [167/389] test_htmlparser
0:01:23 load avg: 1.07 [168/389] test_httplib
Traceback (most recent call last):
  File "/tmp/B.s9fqCB/BUILD/Python-2.7.15/Lib/SocketServer.py", line 290, in _handle_request_noblock
    self.process_request(request, client_address)
  File "/tmp/B.s9fqCB/BUILD/Python-2.7.15/Lib/SocketServer.py", line 318, in process_request
    self.finish_request(request, client_address)
  File "/tmp/B.s9fqCB/BUILD/Python-2.7.15/Lib/SocketServer.py", line 331, in finish_request
    self.RequestHandlerClass(request, client_address, self)
  File "/tmp/B.s9fqCB/BUILD/Python-2.7.15/Lib/SocketServer.py", line 652, in __init__
    self.handle()
  File "/tmp/B.s9fqCB/BUILD/Python-2.7.15/Lib/BaseHTTPServer.py", line 340, in handle
    self.handle_one_request()
  File "/tmp/B.s9fqCB/BUILD/Python-2.7.15/Lib/BaseHTTPServer.py", line 310, in handle_one_request
    self.raw_requestline = self.rfile.readline(65537)
  File "/tmp/B.s9fqCB/BUILD/Python-2.7.15/Lib/socket.py", line 480, in readline
    data = self._sock.recv(self._rbufsize)
  File "/tmp/B.s9fqCB/BUILD/Python-2.7.15/Lib/ssl.py", line 772, in recv
    return self.read(buflen)
  File "/tmp/B.s9fqCB/BUILD/Python-2.7.15/Lib/ssl.py", line 659, in read
    v = self._sslobj.read(len)
error: [Errno 104] Connection reset by peer
test test_httplib produced unexpected output:
**********************************************************************
----------------------------------------
Exception happened during processing of request from ('127.0.0.1', 46978)
----------------------------------------

**********************************************************************
0:01:23 load avg: 1.07 [169/389/1] test_httpservers -- test_httplib failed
0:01:26 load avg: 1.07 [170/389/1] test_idle
0:01:26 load avg: 1.07 [171/389/1] test_imaplib
0:01:27 load avg: 1.07 [172/389/1] test_imgfile
test_imgfile skipped -- No module named imgfile
0:01:27 load avg: 1.07 [173/389/1] test_imghdr -- test_imgfile skipped
0:01:27 load avg: 1.07 [174/389/1] test_imp
0:01:27 load avg: 1.07 [175/389/1] test_import
0:01:27 load avg: 1.07 [176/389/1] test_import_magic
0:01:27 load avg: 1.07 [177/389/1] test_importhooks
0:01:28 load avg: 1.07 [178/389/1] test_importlib
0:01:28 load avg: 1.07 [179/389/1] test_index
0:01:28 load avg: 1.07 [180/389/1] test_inspect
0:01:28 load avg: 1.07 [181/389/1] test_int
0:01:29 load avg: 1.14 [182/389/1] test_int_literal
0:01:29 load avg: 1.14 [183/389/1] test_io
0:02:08 load avg: 0.90 [184/389/1] test_ioctl -- test_io passed in 38 sec
test_ioctl skipped -- Unable to open /dev/tty
0:02:08 load avg: 0.90 [185/389/1] test_isinstance -- test_ioctl skipped
0:02:08 load avg: 0.90 [186/389/1] test_iter
0:02:08 load avg: 0.90 [187/389/1] test_iterlen
0:02:08 load avg: 0.90 [188/389/1] test_itertools
0:02:12 load avg: 0.90 [189/389/1] test_json
0:02:15 load avg: 0.91 [190/389/1] test_kqueue
test_kqueue skipped -- test works only on BSD
0:02:15 load avg: 0.91 [191/389/1] test_largefile -- test_kqueue skipped
0:02:15 load avg: 0.91 [192/389/1] test_lib2to3
0:02:36 load avg: 0.94 [193/389/1] test_linecache
0:02:36 load avg: 0.94 [194/389/1] test_linuxaudiodev
test_linuxaudiodev skipped -- Use of the `audio' resource not enabled
0:02:36 load avg: 0.94 [195/389/1] test_list -- test_linuxaudiodev skipped (resource denied)
0:02:37 load avg: 0.94 [196/389/1] test_logging
0:02:47 load avg: 0.79 [197/389/1] test_long
0:02:49 load avg: 0.79 [198/389/1] test_long_future
0:02:51 load avg: 0.81 [199/389/1] test_longexp
0:02:51 load avg: 0.81 [200/389/1] test_macos
test_macos skipped -- No module named MacOS
0:02:51 load avg: 0.81 [201/389/1] test_macostools -- test_macos skipped
test_macostools skipped -- No module named MacOS
0:02:51 load avg: 0.81 [202/389/1] test_macpath -- test_macostools skipped
0:02:52 load avg: 0.81 [203/389/1] test_macurl2path
0:02:52 load avg: 0.81 [204/389/1] test_mailbox
0:02:55 load avg: 0.91 [205/389/1] test_marshal
0:02:55 load avg: 0.91 [206/389/1] test_math
0:02:56 load avg: 0.91 [207/389/1] test_md5
0:02:56 load avg: 0.91 [208/389/1] test_memoryio
0:02:56 load avg: 0.91 [209/389/1] test_memoryview
0:02:57 load avg: 0.91 [210/389/1] test_mhlib
0:02:57 load avg: 0.91 [211/389/1] test_mimetools
0:02:57 load avg: 0.91 [212/389/1] test_mimetypes
0:02:58 load avg: 0.91 [213/389/1] test_minidom
0:02:58 load avg: 0.91 [214/389/1] test_mmap
0:02:58 load avg: 0.91 [215/389/1] test_module
0:02:59 load avg: 0.91 [216/389/1] test_modulefinder
0:02:59 load avg: 0.91 [217/389/1] test_msilib
test_msilib skipped -- No module named _msi
0:02:59 load avg: 0.91 [218/389/1] test_multibytecodec -- test_msilib skipped
0:03:00 load avg: 0.91 [219/389/1] test_multifile
0:03:00 load avg: 0.91 [220/389/1] test_multiprocessing
0:03:29 load avg: 0.78 [221/389/1] test_mutants
0:03:30 load avg: 0.78 [222/389/1] test_mutex
0:03:30 load avg: 0.78 [223/389/1] test_netrc
0:03:30 load avg: 0.78 [224/389/1] test_new
0:03:30 load avg: 0.78 [225/389/1] test_nntplib
0:03:31 load avg: 0.78 [226/389/1] test_normalization
0:03:31 load avg: 0.78 [227/389/1] test_ntpath
0:03:31 load avg: 0.78 [228/389/1] test_old_mailbox
0:03:31 load avg: 0.78 [229/389/1] test_operator
0:03:31 load avg: 0.78 [230/389/1] test_optparse
0:03:32 load avg: 0.78 [231/389/1] test_ordered_dict
0:03:33 load avg: 0.78 [232/389/1] test_os
0:03:34 load avg: 0.78 [233/389/1] test_ossaudiodev
test_ossaudiodev skipped -- Use of the `audio' resource not enabled
0:03:34 load avg: 0.78 [234/389/1] test_parser -- test_ossaudiodev skipped (resource denied)
0:03:34 load avg: 0.80 [235/389/1] test_pdb
0:03:35 load avg: 0.80 [236/389/1] test_peepholer
0:03:35 load avg: 0.80 [237/389/1] test_pep247
0:03:35 load avg: 0.80 [238/389/1] test_pep277
0:03:35 load avg: 0.80 [239/389/1] test_pep352
0:03:35 load avg: 0.80 [240/389/1] test_pickle
0:03:37 load avg: 0.80 [241/389/1] test_pickletools
0:03:38 load avg: 0.80 [242/389/1] test_pipes
0:03:38 load avg: 0.80 [243/389/1] test_pkg
0:03:38 load avg: 0.80 [244/389/1] test_pkgimport
0:03:38 load avg: 0.80 [245/389/1] test_pkgutil
0:03:38 load avg: 0.80 [246/389/1] test_platform
0:03:39 load avg: 0.80 [247/389/1] test_plistlib
0:03:39 load avg: 0.82 [248/389/1] test_poll
0:03:50 load avg: 0.69 [249/389/1] test_popen
0:03:50 load avg: 0.69 [250/389/1] test_popen2
0:03:51 load avg: 0.69 [251/389/1] test_poplib
0:03:53 load avg: 0.69 [252/389/1] test_posixpath
0:03:54 load avg: 0.69 [253/389/1] test_pow
0:03:54 load avg: 0.69 [254/389/1] test_pprint
0:03:54 load avg: 0.72 [255/389/1] test_print
0:03:54 load avg: 0.72 [256/389/1] test_profile
0:03:55 load avg: 0.72 [257/389/1] test_property
0:03:55 load avg: 0.72 [258/389/1] test_pstats
0:03:55 load avg: 0.72 [259/389/1] test_pwd
0:03:55 load avg: 0.72 [260/389/1] test_py3kwarn
test_py3kwarn skipped -- test.test_py3kwarn must be run with the -3 flag
0:03:55 load avg: 0.72 [261/389/1] test_py_compile -- test_py3kwarn skipped
0:03:55 load avg: 0.72 [262/389/1] test_pyclbr
0:03:56 load avg: 0.72 [263/389/1] test_pyexpat
0:03:57 load avg: 0.72 [264/389/1] test_queue
0:04:00 load avg: 0.66 [265/389/1] test_quopri
0:04:01 load avg: 0.66 [266/389/1] test_random
0:04:01 load avg: 0.66 [267/389/1] test_re
0:04:02 load avg: 0.66 [268/389/1] test_readline
0:04:02 load avg: 0.66 [269/389/1] test_regrtest
0:04:05 load avg: 0.69 [270/389/1] test_repr
0:04:05 load avg: 0.69 [271/389/1] test_rfc822
0:04:05 load avg: 0.69 [272/389/1] test_richcmp
0:04:06 load avg: 0.69 [273/389/1] test_rlcompleter
0:04:06 load avg: 0.69 [274/389/1] test_robotparser
0:04:06 load avg: 0.69 [275/389/1] test_runpy
0:04:10 load avg: 0.71 [276/389/1] test_sax
0:04:10 load avg: 0.71 [277/389/1] test_scope
0:04:10 load avg: 0.71 [278/389/1] test_scriptpackages
test_scriptpackages skipped -- No module named aetools
0:04:10 load avg: 0.71 [279/389/1] test_select -- test_scriptpackages skipped
0:04:22 load avg: 0.60 [280/389/1] test_set
0:04:23 load avg: 0.60 [281/389/1] test_setcomps
0:04:23 load avg: 0.60 [282/389/1] test_sets
0:04:24 load avg: 0.60 [283/389/1] test_sgmllib
0:04:24 load avg: 0.60 [284/389/1] test_sha
0:04:24 load avg: 0.63 [285/389/1] test_shelve
0:04:25 load avg: 0.63 [286/389/1] test_shlex
0:04:25 load avg: 0.63 [287/389/1] test_shutil
0:04:25 load avg: 0.63 [288/389/1] test_signal
0:04:34 load avg: 0.70 [289/389/1] test_site
0:04:35 load avg: 0.70 [290/389/1] test_slice
0:04:35 load avg: 0.70 [291/389/1] test_smtplib
0:04:35 load avg: 0.70 [292/389/1] test_smtpnet
test_smtpnet skipped -- Use of the `network' resource not enabled
0:04:36 load avg: 0.70 [293/389/1] test_socketserver -- test_smtpnet skipped (resource denied)
test_socketserver skipped -- Use of the `network' resource not enabled
0:04:36 load avg: 0.70 [294/389/1] test_softspace -- test_socketserver skipped (resource denied)
0:04:36 load avg: 0.70 [295/389/1] test_sort
0:04:36 load avg: 0.70 [296/389/1] test_source_encoding
0:04:37 load avg: 0.70 [297/389/1] test_spwd
0:04:37 load avg: 0.70 [298/389/1] test_sqlite
0:04:38 load avg: 0.70 [299/389/1] test_ssl
test test_ssl failed -- multiple errors occurred; run in verbose mode for details
0:04:40 load avg: 0.64 [300/389/2] test_startfile -- test_ssl failed
test_startfile skipped -- module 'os' has no attribute 'startfile'
0:04:40 load avg: 0.64 [301/389/2] test_stat -- test_startfile skipped
0:04:40 load avg: 0.64 [302/389/2] test_str
0:04:41 load avg: 0.64 [303/389/2] test_strftime
0:04:42 load avg: 0.64 [304/389/2] test_string
0:04:43 load avg: 0.64 [305/389/2] test_stringprep
0:04:43 load avg: 0.64 [306/389/2] test_strop
0:04:43 load avg: 0.64 [307/389/2] test_strptime
0:04:43 load avg: 0.64 [308/389/2] test_strtod
0:04:44 load avg: 0.67 [309/389/2] test_struct
0:04:45 load avg: 0.67 [310/389/2] test_structmembers
0:04:45 load avg: 0.67 [311/389/2] test_structseq
0:04:46 load avg: 0.67 [312/389/2] test_subprocess
0:06:35 load avg: 0.87 [313/389/2] test_sunau -- test_subprocess passed in 1 min 49 sec
0:06:35 load avg: 0.87 [314/389/2] test_sunaudiodev
test_sunaudiodev skipped -- No module named sunaudiodev
0:06:35 load avg: 0.87 [315/389/2] test_sundry -- test_sunaudiodev skipped
0:06:35 load avg: 0.87 [316/389/2] test_symtable
0:06:36 load avg: 0.87 [317/389/2] test_syntax
0:06:36 load avg: 0.87 [318/389/2] test_sys
0:06:37 load avg: 0.87 [319/389/2] test_sys_setprofile
0:06:37 load avg: 0.87 [320/389/2] test_sys_settrace
0:06:37 load avg: 0.87 [321/389/2] test_sysconfig
0:06:37 load avg: 0.87 [322/389/2] test_tarfile
0:06:40 load avg: 0.88 [323/389/2] test_tcl
0:06:40 load avg: 0.88 [324/389/2] test_telnetlib
0:06:45 load avg: 0.81 [325/389/2] test_tempfile
0:06:46 load avg: 0.81 [326/389/2] test_test_support
0:06:46 load avg: 0.81 [327/389/2] test_textwrap
0:06:46 load avg: 0.81 [328/389/2] test_thread
0:06:47 load avg: 0.81 [329/389/2] test_threaded_import
0:06:47 load avg: 0.81 [330/389/2] test_threadedtempfile
0:06:47 load avg: 0.81 [331/389/2] test_threading
0:06:52 load avg: 0.90 [332/389/2] test_threading_local
0:06:53 load avg: 0.90 [333/389/2] test_threadsignals
0:06:54 load avg: 0.90 [334/389/2] test_time
0:06:55 load avg: 0.83 [335/389/2] test_timeit
0:06:55 load avg: 0.83 [336/389/2] test_timeout
test_timeout skipped -- Use of the `network' resource not enabled
0:06:55 load avg: 0.83 [337/389/2] test_tk -- test_timeout skipped (resource denied)
test_tk skipped -- Use of the `gui' resource not enabled
0:06:56 load avg: 0.83 [338/389/2] test_tokenize -- test_tk skipped (resource denied)
0:06:56 load avg: 0.83 [339/389/2] test_tools
recursedown('@test_8191_tmp')
0:06:58 load avg: 0.83 [340/389/2] test_trace
0:07:00 load avg: 0.84 [341/389/2] test_traceback
0:07:04 load avg: 0.86 [342/389/2] test_transformer
0:07:04 load avg: 0.86 [343/389/2] test_ttk_guionly
test_ttk_guionly skipped -- Use of the `gui' resource not enabled
0:07:05 load avg: 0.86 [344/389/2] test_ttk_textonly -- test_ttk_guionly skipped (resource denied)
0:07:05 load avg: 0.86 [345/389/2] test_tuple
0:07:18 load avg: 0.88 [346/389/2] test_turtle
0:07:18 load avg: 0.88 [347/389/2] test_typechecks
0:07:18 load avg: 0.88 [348/389/2] test_ucn
0:07:19 load avg: 0.88 [349/389/2] test_unary
0:07:19 load avg: 0.88 [350/389/2] test_undocumented_details
0:07:19 load avg: 0.88 [351/389/2] test_unicode
0:07:31 load avg: 0.91 [352/389/2] test_unicode_file
0:07:31 load avg: 0.91 [353/389/2] test_unicodedata
0:07:33 load avg: 0.91 [354/389/2] test_univnewlines
0:07:33 load avg: 0.91 [355/389/2] test_univnewlines2k
0:07:34 load avg: 0.91 [356/389/2] test_unpack
0:07:34 load avg: 0.91 [357/389/2] test_urllib
0:07:34 load avg: 0.91 [358/389/2] test_urllib2_localnet
0:07:35 load avg: 0.91 [359/389/2] test_urllib2net
test_urllib2net skipped -- Use of the `network' resource not enabled
0:07:35 load avg: 0.91 [360/389/2] test_urllibnet -- test_urllib2net skipped (resource denied)
test_urllibnet skipped -- Use of the `network' resource not enabled
0:07:36 load avg: 0.91 [361/389/2] test_urlparse -- test_urllibnet skipped (resource denied)
0:07:36 load avg: 0.91 [362/389/2] test_userdict
0:07:37 load avg: 0.91 [363/389/2] test_userlist
0:07:37 load avg: 0.91 [364/389/2] test_userstring
0:07:40 load avg: 0.92 [365/389/2] test_uu
0:07:41 load avg: 0.92 [366/389/2] test_uuid
0:07:41 load avg: 0.92 [367/389/2] test_wait3
0:07:47 load avg: 0.85 [368/389/2] test_wait4
0:07:52 load avg: 0.78 [369/389/2] test_warnings
0:07:53 load avg: 0.78 [370/389/2] test_wave
0:07:54 load avg: 0.78 [371/389/2] test_weakref
0:09:55 load avg: 0.97 [372/389/2] test_weakset -- test_weakref passed in 2 min 1 sec
0:09:56 load avg: 0.97 [373/389/2] test_whichdb
0:09:56 load avg: 0.97 [374/389/2] test_winreg
test_winreg skipped -- No module named _winreg
0:09:56 load avg: 0.97 [375/389/2] test_winsound -- test_winreg skipped
test_winsound skipped -- Use of the `audio' resource not enabled
0:09:56 load avg: 0.97 [376/389/2] test_with -- test_winsound skipped (resource denied)
0:09:57 load avg: 0.97 [377/389/2] test_wsgiref
0:09:57 load avg: 0.97 [378/389/2] test_xdrlib
0:09:57 load avg: 0.97 [379/389/2] test_xml_etree
0:09:58 load avg: 0.97 [380/389/2] test_xml_etree_c
0:09:58 load avg: 0.97 [381/389/2] test_xmllib
0:09:58 load avg: 0.97 [382/389/2] test_xmlrpc
0:10:02 load avg: 0.90 [383/389/2] test_xpickle
0:10:02 load avg: 0.90 [384/389/2] test_xrange
0:10:03 load avg: 0.90 [385/389/2] test_zipfile
0:10:06 load avg: 0.91 [386/389/2] test_zipfile64
test_zipfile64 skipped -- test requires loads of disk-space bytes and a long time to run
0:10:06 load avg: 0.91 [387/389/2] test_zipimport -- test_zipfile64 skipped (resource denied)
0:10:06 load avg: 0.91 [388/389/2] test_zipimport_support
0:10:07 load avg: 0.91 [389/389/2] test_zlib
350 tests OK.
2 tests failed:
    test_httplib test_ssl
37 tests skipped:
    test_aepack test_al test_applesingle test_bsddb185 test_bsddb3
    test_cd test_cl test_codecmaps_cn test_codecmaps_hk
    test_codecmaps_jp test_codecmaps_kr test_codecmaps_tw test_curses
    test_dl test_gl test_imgfile test_ioctl test_kqueue
    test_linuxaudiodev test_macos test_macostools test_msilib
    test_ossaudiodev test_py3kwarn test_scriptpackages test_smtpnet
    test_socketserver test_startfile test_sunaudiodev test_timeout
    test_tk test_ttk_guionly test_urllib2net test_urllibnet
    test_winreg test_winsound test_zipfile64
1 skip unexpected on linux2:
    test_ioctl
Re-running failed tests in verbose mode
Re-running test 'test_httplib' in verbose mode
test_auto_headers (test.test_httplib.HeaderTests) ... ok
test_blank_line_forms (test.test_httplib.HeaderTests) ... ok
test_content_length_0 (test.test_httplib.HeaderTests) ... ok
test_from_line (test.test_httplib.HeaderTests) ... ok
test_invalid_headers (test.test_httplib.HeaderTests) ... ok
test_ipv6host_header (test.test_httplib.HeaderTests) ... ok
test_malformed_headers_coped_with (test.test_httplib.HeaderTests) ... ok
test_malformed_truncation (test.test_httplib.HeaderTests) ... ok
test_parse_all_octets (test.test_httplib.HeaderTests) ... ok
test_putheader (test.test_httplib.HeaderTests) ... ok
test_responses (test.test_httplib.OfflineTest) ... ok
test_bad_status_repr (test.test_httplib.BasicTest) ... ok
test_chunked (test.test_httplib.BasicTest) ... ok
test_chunked_head (test.test_httplib.BasicTest) ... ok
test_early_eof (test.test_httplib.BasicTest) ... ok
test_epipe (test.test_httplib.BasicTest) ... ok
test_error_leak (test.test_httplib.BasicTest) ... ok
test_filenoattr (test.test_httplib.BasicTest) ... ok
test_host_port (test.test_httplib.BasicTest) ... ok
test_incomplete_read (test.test_httplib.BasicTest) ... ok
test_negative_content_length (test.test_httplib.BasicTest) ... ok
test_overflowing_chunked_line (test.test_httplib.BasicTest) ... ok
test_overflowing_header_line (test.test_httplib.BasicTest) ... ok
test_overflowing_status_line (test.test_httplib.BasicTest) ... skipped 'disabled for HTTP 0.9 support'
test_partial_reads (test.test_httplib.BasicTest) ... ok
test_partial_reads_incomplete_body (test.test_httplib.BasicTest) ... ok
test_partial_reads_no_content_length (test.test_httplib.BasicTest) ... ok
test_proxy_tunnel_without_status_line (test.test_httplib.BasicTest) ... ok
test_read_head (test.test_httplib.BasicTest) ... ok
test_response_headers (test.test_httplib.BasicTest) ... ok
test_send (test.test_httplib.BasicTest) ... ok
test_send_file (test.test_httplib.BasicTest) ... ok
test_send_tempfile (test.test_httplib.BasicTest) ... ok
test_status_lines (test.test_httplib.BasicTest) ... ok
test_too_many_headers (test.test_httplib.BasicTest) ... ok
testTimeoutAttribute (test.test_httplib.TimeoutTest)
This will prove that the timeout gets through ... ok
testHTTPConnection (test.test_httplib.HTTPTest) ... ok
testHTTPWithConnectHostPort (test.test_httplib.HTTPTest) ... ok
test_attributes (test.test_httplib.HTTPSTest) ... ok
test_host_port (test.test_httplib.HTTPSTest) ... ok
test_local_bad_hostname (test.test_httplib.HTTPSTest) ... Traceback (most recent call last):
  File "/tmp/B.s9fqCB/BUILD/Python-2.7.15/Lib/SocketServer.py", line 290, in _handle_request_noblock
    self.process_request(request, client_address)
  File "/tmp/B.s9fqCB/BUILD/Python-2.7.15/Lib/SocketServer.py", line 318, in process_request
    self.finish_request(request, client_address)
  File "/tmp/B.s9fqCB/BUILD/Python-2.7.15/Lib/SocketServer.py", line 331, in finish_request
    self.RequestHandlerClass(request, client_address, self)
  File "/tmp/B.s9fqCB/BUILD/Python-2.7.15/Lib/SocketServer.py", line 652, in __init__
    self.handle()
  File "/tmp/B.s9fqCB/BUILD/Python-2.7.15/Lib/BaseHTTPServer.py", line 340, in handle
    self.handle_one_request()
  File "/tmp/B.s9fqCB/BUILD/Python-2.7.15/Lib/BaseHTTPServer.py", line 310, in handle_one_request
    self.raw_requestline = self.rfile.readline(65537)
  File "/tmp/B.s9fqCB/BUILD/Python-2.7.15/Lib/socket.py", line 480, in readline
    data = self._sock.recv(self._rbufsize)
  File "/tmp/B.s9fqCB/BUILD/Python-2.7.15/Lib/ssl.py", line 772, in recv
    return self.read(buflen)
  File "/tmp/B.s9fqCB/BUILD/Python-2.7.15/Lib/ssl.py", line 659, in read
    v = self._sslobj.read(len)
error: [Errno 104] Connection reset by peer
----------------------------------------
Exception happened during processing of request from ('127.0.0.1', 58808)
----------------------------------------
 server (('127.0.0.1', 44027):44027 ('TLS_AES_256_GCM_SHA384', 'TLSv1.3', 256)):
   [14/Sep/2018 07:33:22] code 404, message File not found
 server (('127.0.0.1', 44027):44027 ('TLS_AES_256_GCM_SHA384', 'TLSv1.3', 256)):
   [14/Sep/2018 07:33:22] "GET /nonexistent HTTP/1.1" 404 -
stopping HTTPS server
joining HTTPS thread
ok
test_local_good_hostname (test.test_httplib.HTTPSTest) ...  server (('127.0.0.1', 40261):40261 ('TLS_AES_256_GCM_SHA384', 'TLSv1.3', 256)):
   [14/Sep/2018 07:33:22] code 404, message File not found
 server (('127.0.0.1', 40261):40261 ('TLS_AES_256_GCM_SHA384', 'TLSv1.3', 256)):
   [14/Sep/2018 07:33:22] "GET /nonexistent HTTP/1.1" 404 -
stopping HTTPS server
joining HTTPS thread
ok
test_local_unknown_cert (test.test_httplib.HTTPSTest) ... stopping HTTPS server
joining HTTPS thread
ok
test_networked (test.test_httplib.HTTPSTest) ... skipped "Use of the `network' resource not enabled"
test_networked_bad_cert (test.test_httplib.HTTPSTest) ... skipped "Use of the `network' resource not enabled"
test_networked_good_cert (test.test_httplib.HTTPSTest) ... skipped "Use of the `network' resource not enabled"
test_networked_noverification (test.test_httplib.HTTPSTest) ... skipped "Use of the `network' resource not enabled"
test_networked_trusted_by_default_cert (test.test_httplib.HTTPSTest) ... skipped "Use of the `network' resource not enabled"
testHTTPConnectionSourceAddress (test.test_httplib.SourceAddressTest) ... ok
testHTTPSConnectionSourceAddress (test.test_httplib.SourceAddressTest) ... ok
test_connect (test.test_httplib.TunnelTests) ... ok

----------------------------------------------------------------------
Ran 51 tests in 0.276s

OK (skipped=6)
Re-running test 'test_ssl' in verbose mode
test_ssl: testing with 'OpenSSL 1.1.1  11 Sep 2018' (1, 1, 1, 0, 15)
          under Linux ('PLD Linux (Th)', '3.0', '')
          HAS_SNI = True
          OP_ALL = 0x80000054
          OP_NO_TLSv1_1 = 0x10000000
test__create_stdlib_context (test.test_ssl.ContextTests) ... ok
test__https_verify_certificates (test.test_ssl.ContextTests) ... ok
test__https_verify_envvar (test.test_ssl.ContextTests) ... ok
test_cert_store_stats (test.test_ssl.ContextTests) ... ok
test_check_hostname (test.test_ssl.ContextTests) ... ok
test_ciphers (test.test_ssl.ContextTests) ... ok
test_constructor (test.test_ssl.ContextTests) ... ok
test_create_default_context (test.test_ssl.ContextTests) ... ok
test_get_ca_certs (test.test_ssl.ContextTests) ... ok
test_load_cert_chain (test.test_ssl.ContextTests) ... ok
test_load_default_certs (test.test_ssl.ContextTests) ... ok
test_load_default_certs_env (test.test_ssl.ContextTests) ... ok
test_load_default_certs_env_windows (test.test_ssl.ContextTests) ... skipped 'Windows specific'
test_load_dh_params (test.test_ssl.ContextTests) ... ok
test_load_verify_cadata (test.test_ssl.ContextTests) ... ok
test_load_verify_locations (test.test_ssl.ContextTests) ... ok
test_options (test.test_ssl.ContextTests) ... FAIL
test_protocol (test.test_ssl.ContextTests) ... ok
test_session_stats (test.test_ssl.ContextTests) ... ok
test_set_default_verify_paths (test.test_ssl.ContextTests) ... ok
test_set_ecdh_curve (test.test_ssl.ContextTests) ... ok
test_sni_callback (test.test_ssl.ContextTests) ... ok
test_sni_callback_refcycle (test.test_ssl.ContextTests) ... ok
test_verify_flags (test.test_ssl.ContextTests) ... ok
test_verify_mode (test.test_ssl.ContextTests) ... ok
test_sslwrap_simple (test.test_ssl.BasicTests) ... ok
test_DER_to_PEM (test.test_ssl.BasicSocketTests) ... ok
test_asn1object (test.test_ssl.BasicSocketTests) ... ok
test_cert_time_to_seconds (test.test_ssl.BasicSocketTests) ... ok
test_cert_time_to_seconds_locale (test.test_ssl.BasicSocketTests) ... skipped 'locale-specific month name needs to be different from C locale'
test_cert_time_to_seconds_timezone (test.test_ssl.BasicSocketTests) ... ok
test_constants (test.test_ssl.BasicSocketTests) ... ok
test_empty_cert (test.test_ssl.BasicSocketTests)
Wrapping with an empty cert file ... ok
test_enum_certificates (test.test_ssl.BasicSocketTests) ... skipped 'Windows specific'
test_enum_crls (test.test_ssl.BasicSocketTests) ... skipped 'Windows specific'
test_errors (test.test_ssl.BasicSocketTests) ... ok
test_get_default_verify_paths (test.test_ssl.BasicSocketTests) ... ok
test_malformed_cert (test.test_ssl.BasicSocketTests)
Wrapping with a badly formatted certificate (syntax error) ... ok
test_malformed_key (test.test_ssl.BasicSocketTests)
Wrapping with a badly formatted key (syntax error) ... ok
test_match_hostname (test.test_ssl.BasicSocketTests) ... ok
test_openssl_version (test.test_ssl.BasicSocketTests) ... ok
test_parse_all_sans (test.test_ssl.BasicSocketTests) ... ok
test_parse_cert (test.test_ssl.BasicSocketTests) ... 
{'issuer': ((('countryName', u'XY'),),
            (('localityName', u'Castle Anthrax'),),
            (('organizationName', u'Python Software Foundation'),),
            (('commonName', u'localhost'),)),
 'notAfter': 'Oct  5 23:01:56 2020 GMT',
 'notBefore': u'Oct  8 23:01:56 2010 GMT',
 'serialNumber': u'D7C7381919AFC24E',
 'subject': ((('countryName', u'XY'),),
             (('localityName', u'Castle Anthrax'),),
             (('organizationName', u'Python Software Foundation'),),
             (('commonName', u'localhost'),)),
 'subjectAltName': (('DNS', 'localhost'),),
 'version': 3L}

{'OCSP': (u'http://ocsp.verisign.com',),
 'caIssuers': (u'http://SVRIntl-G3-aia.verisign.com/SVRIntlG3.cer',),
 'crlDistributionPoints': (u'http://SVRIntl-G3-crl.verisign.com/SVRIntlG3.crl',),
 'issuer': ((('countryName', u'US'),),
            (('organizationName', u'VeriSign, Inc.'),),
            (('organizationalUnitName', u'VeriSign Trust Network'),),
            (('organizationalUnitName',
              u'Terms of use at https://www.verisign.com/rpa (c)10'),),
            (('commonName',
              u'VeriSign Class 3 International Server CA - G3'),)),
 'notAfter': 'Sep 20 23:59:59 2012 GMT',
 'notBefore': u'Sep 21 00:00:00 2011 GMT',
 'serialNumber': u'2EE6EA7640A075CEE5005F4D7C79549A',
 'subject': ((('countryName', u'FI'),),
             (('stateOrProvinceName', u'Espoo'),),
             (('localityName', u'Espoo'),),
             (('organizationName', u'Nokia'),),
             (('organizationalUnitName', u'BI'),),
             (('commonName', u'projects.developer.nokia.com'),)),
 'subjectAltName': (('DNS', 'projects.developer.nokia.com'),
                    ('DNS', 'projects.forum.nokia.com')),
 'version': 3L}
ok
test_parse_cert_CVE_2013_4238 (test.test_ssl.BasicSocketTests) ... 
{'issuer': ((('countryName', u'US'),),
            (('stateOrProvinceName', u'Oregon'),),
            (('localityName', u'Beaverton'),),
            (('organizationName', u'Python Software Foundation'),),
            (('organizationalUnitName', u'Python Core Development'),),
            (('commonName', u'null.python.org\x00example.org'),),
            (('emailAddress', u'python-dev@python.org'),)),
 'notAfter': 'Aug  7 13:12:52 2013 GMT',
 'notBefore': u'Aug  7 13:11:52 2013 GMT',
 'serialNumber': u'00',
 'subject': ((('countryName', u'US'),),
             (('stateOrProvinceName', u'Oregon'),),
             (('localityName', u'Beaverton'),),
             (('organizationName', u'Python Software Foundation'),),
             (('organizationalUnitName', u'Python Core Development'),),
             (('commonName', u'null.python.org\x00example.org'),),
             (('emailAddress', u'python-dev@python.org'),)),
 'subjectAltName': (('DNS', 'altnull.python.org\x00example.com'),
                    ('email', 'null@python.org\x00user@example.org'),
                    ('URI', 'http://null.python.org\x00http://example.org'),
                    ('IP Address', '192.0.2.1'),
                    ('IP Address', '2001:DB8:0:0:0:0:0:1\n')),
 'version': 3L}
ok
test_purpose_enum (test.test_ssl.BasicSocketTests) ... ok
test_random (test.test_ssl.BasicSocketTests) ... 
 RAND_status is 1 (sufficient randomness)
ok
test_refcycle (test.test_ssl.BasicSocketTests) ... ok
test_server_side (test.test_ssl.BasicSocketTests) ... ok
test_timeout (test.test_ssl.BasicSocketTests) ... ok
test_tls_unique_channel_binding (test.test_ssl.BasicSocketTests) ... ok
test_unknown_channel_binding (test.test_ssl.BasicSocketTests) ... ok
test_unsupported_dtls (test.test_ssl.BasicSocketTests) ... ok
test_wrapped_unconnected (test.test_ssl.BasicSocketTests) ... ok
test_lib_reason (test.test_ssl.SSLErrorTests) ... ok
test_str (test.test_ssl.SSLErrorTests) ... ok
test_subclass (test.test_ssl.SSLErrorTests) ... ok
test_alpn_protocols (test.test_ssl.ThreadedTests) ...  server:  new connection from ('127.0.0.1', 43062)
 server: connection cipher is now ('ECDHE-RSA-AES256-GCM-SHA384', 'TLSv1.2', 256)
 client:  sending 'FOO\n'...
 server: selected protocol is now None
 client:  read 'foo\n'
 client:  sending 'FOO\n'...
 client:  read 'foo\n'
 client:  sending 'FOO\n'...
 client:  read 'foo\n'
 client:  closing connection.
 server:  new connection from ('127.0.0.1', 39782)
 server: connection cipher is now ('ECDHE-RSA-AES256-GCM-SHA384', 'TLSv1.2', 256)
 server: selected protocol is now None
 client:  sending 'FOO\n'...
 client:  read 'foo\n'
 client:  sending 'FOO\n'...
 client:  read 'foo\n'
 client:  sending 'FOO\n'...
 client:  read 'foo\n'
 client:  closing connection.
 server:  new connection from ('127.0.0.1', 58670)
 server: connection cipher is now ('ECDHE-RSA-AES256-GCM-SHA384', 'TLSv1.2', 256)
 server: selected protocol is now None
 client:  sending 'FOO\n'...
 client:  read 'foo\n'
 client:  sending 'FOO\n'...
 client:  read 'foo\n'
 client:  sending 'FOO\n'...
 client:  read 'foo\n'
 client:  closing connection.
 server:  new connection from ('127.0.0.1', 36422)
 server: connection cipher is now ('ECDHE-RSA-AES256-GCM-SHA384', 'TLSv1.2', 256)
 server: selected protocol is now None
 client:  sending 'FOO\n'...
 client:  read 'foo\n'
 client:  sending 'FOO\n'...
 client:  read 'foo\n'
 client:  sending 'FOO\n'...
 client:  read 'foo\n'
 client:  closing connection.
ok
test_asyncore_server (test.test_ssl.ThreadedTests)
Check the example asyncore integration. ... 
 server:  new connection from 127.0.0.1:52684
 client:  sending 'FOO\n'...
 server:  read 'FOO\n' from client
 client:  read 'foo\n'
 client:  closing connection.
 client:  connection closed.
 cleanup: stopping server.
 cleanup: joining server thread.
 server:  read 'over\n' from client
 server:  closed connection <ssl.SSLSocket object at 0x7f496513acf8>
 server:  read '' from client
 cleanup: successfully joined.
ok
test_check_hostname (test.test_ssl.ThreadedTests) ... 
 server:  new connection from ('127.0.0.1', 55764)
 server: connection cipher is now ('ECDHE-RSA-AES256-SHA', 'TLSv1.0', 256)
 server: selected protocol is now None
 server:  new connection from ('127.0.0.1', 33316)
 server: connection cipher is now ('ECDHE-RSA-AES256-SHA', 'TLSv1.0', 256)
 server: selected protocol is now None
ok
test_compression (test.test_ssl.ThreadedTests) ...  server:  new connection from ('127.0.0.1', 48990)
 server: connection cipher is now ('ECDHE-RSA-AES256-SHA', 'TLSv1.0', 256)
 server: selected protocol is now None
 client:  sending 'FOO\n'...
 client:  read 'foo\n'
 client:  sending 'FOO\n'...
 client:  read 'foo\n'
 client:  sending 'FOO\n'...
 client:  read 'foo\n'
 client:  closing connection.
 got compression: None
ok
test_compression_disabled (test.test_ssl.ThreadedTests) ...  server:  new connection from ('127.0.0.1', 46844)
 server: connection cipher is now ('ECDHE-RSA-AES256-SHA', 'TLSv1.0', 256)
 server: selected protocol is now None
 client:  sending 'FOO\n'...
 client:  read 'foo\n'
 client:  sending 'FOO\n'...
 client:  read 'foo\n'
 client:  sending 'FOO\n'...
 client:  read 'foo\n'
 client:  closing connection.
ok
test_crl_check (test.test_ssl.ThreadedTests) ... 
 server:  new connection from ('127.0.0.1', 42002)
 server: connection cipher is now ('ECDHE-RSA-AES256-SHA', 'TLSv1.0', 256)
 server: selected protocol is now None
 server:  new connection from ('127.0.0.1', 46184)

 server:  bad connection attempt from ('127.0.0.1', 46184):
Traceback (most recent call last):
   File "/tmp/B.s9fqCB/BUILD/Python-2.7.15/Lib/test/test_ssl.py", line 1663, in wrap_conn
    self.sock, server_side=True)
   File "/tmp/B.s9fqCB/BUILD/Python-2.7.15/Lib/ssl.py", line 369, in wrap_socket
    _context=self)
   File "/tmp/B.s9fqCB/BUILD/Python-2.7.15/Lib/ssl.py", line 617, in __init__
    self.do_handshake()
   File "/tmp/B.s9fqCB/BUILD/Python-2.7.15/Lib/ssl.py", line 846, in do_handshake
    self._sslobj.do_handshake()
 SSLError: [SSL: TLSV1_ALERT_UNKNOWN_CA] tlsv1 alert unknown ca (_ssl.c:726)
 server:  new connection from ('127.0.0.1', 39066)
 server: connection cipher is now ('ECDHE-RSA-AES256-SHA', 'TLSv1.0', 256)
 server: selected protocol is now None
ok
test_default_ciphers (test.test_ssl.ThreadedTests) ... FAIL
test_default_ecdh_curve (test.test_ssl.ThreadedTests) ...  server:  new connection from ('127.0.0.1', 44516)
 server: connection cipher is now ('TLS_AES_256_GCM_SHA384', 'TLSv1.3', 256)
 server: selected protocol is now None
FAIL
test_dh_params (test.test_ssl.ThreadedTests) ...  server:  new connection from ('127.0.0.1', 48810)
 server: connection cipher is now ('DHE-RSA-AES256-SHA', 'SSLv3', 256)
 server: selected protocol is now None
 client:  sending 'FOO\n'...
 client:  read 'foo\n'
 client:  sending 'FOO\n'...
 client:  read 'foo\n'
 client:  sending 'FOO\n'...
 client:  read 'foo\n'
 client:  closing connection.
ok
test_do_handshake_enotconn (test.test_ssl.ThreadedTests) ... ok
test_echo (test.test_ssl.ThreadedTests)
Basic test of an SSL client connecting to a server ... 
 server:  new connection from ('127.0.0.1', 55954)
 client:  sending 'FOO\n'...
 server: connection cipher is now ('TLS_AES_256_GCM_SHA384', 'TLSv1.3', 256)
 server: selected protocol is now None
 client:  read 'foo\n'
 client:  sending 'FOO\n'...
 client:  read 'foo\n'
 client:  sending 'FOO\n'...
 client:  read 'foo\n'
 client:  closing connection.
 server:  new connection from ('127.0.0.1', 59768)
 server: connection cipher is now ('ECDHE-RSA-AES256-SHA', 'TLSv1.0', 256)
 server: selected protocol is now None
 client:  sending 'FOO\n'...
 client:  read 'foo\n'
 client:  sending 'FOO\n'...
 client:  read 'foo\n'
 client:  sending 'FOO\n'...
 client:  read 'foo\n'
 client:  closing connection.
 server:  new connection from ('127.0.0.1', 34478)
 server: connection cipher is now ('ECDHE-RSA-AES256-SHA', 'TLSv1.0', 256)
 server: selected protocol is now None
 client:  sending 'FOO\n'...
 client:  read 'foo\n'
 client:  sending 'FOO\n'...
 client:  read 'foo\n'
 client:  sending 'FOO\n'...
 client:  read 'foo\n'
 client:  closing connection.
 server:  new connection from ('127.0.0.1', 32842)
 server: connection cipher is now ('ECDHE-RSA-AES256-GCM-SHA384', 'TLSv1.2', 256)
 server: selected protocol is now None
 client:  sending 'FOO\n'...
 client:  read 'foo\n'
 client:  sending 'FOO\n'...
 client:  read 'foo\n'
 client:  sending 'FOO\n'...
 client:  read 'foo\n'
 client:  closing connection.
ok
test_getpeercert (test.test_ssl.ThreadedTests) ... Exception in thread Thread-1476:
Traceback (most recent call last):
  File "/tmp/B.s9fqCB/BUILD/Python-2.7.15/Lib/threading.py", line 801, in __bootstrap_inner
    self.run()
  File "/tmp/B.s9fqCB/BUILD/Python-2.7.15/Lib/test/test_ssl.py", line 1723, in run
    msg = self.read()
  File "/tmp/B.s9fqCB/BUILD/Python-2.7.15/Lib/test/test_ssl.py", line 1700, in read
    return self.sslconn.read()
  File "/tmp/B.s9fqCB/BUILD/Python-2.7.15/Lib/ssl.py", line 659, in read
    v = self._sslobj.read(len)
error: [Errno 104] Connection reset by peer


{'issuer': ((('countryName', u'XY'),),
            (('localityName', u'Castle Anthrax'),),
            (('organizationName', u'Python Software Foundation'),),
            (('commonName', u'localhost'),)),
 'notAfter': 'Oct  5 23:01:56 2020 GMT',
 'notBefore': u'Oct  8 23:01:56 2010 GMT',
 'serialNumber': u'D7C7381919AFC24E',
 'subject': ((('countryName', u'XY'),),
             (('localityName', u'Castle Anthrax'),),
             (('organizationName', u'Python Software Foundation'),),
             (('commonName', u'localhost'),)),
 'subjectAltName': (('DNS', 'localhost'),),
 'version': 3L}
Connection cipher is ('TLS_AES_256_GCM_SHA384', 'TLSv1.3', 256).
ok
test_getpeercert_enotconn (test.test_ssl.ThreadedTests) ... ok
test_handshake_timeout (test.test_ssl.ThreadedTests) ... ok
test_npn_protocols (test.test_ssl.ThreadedTests) ... skipped 'NPN support needed for this test'
test_protocol_sslv2 (test.test_ssl.ThreadedTests)
Connecting to an SSLv2 server with various client options ... skipped 'OpenSSL is compiled without SSLv2 support'
test_protocol_sslv23 (test.test_ssl.ThreadedTests)
Connecting to an SSLv23 server with various client options ... 
 PROTOCOL_TLS->PROTOCOL_TLS CERT_NONE
 PROTOCOL_TLSv1->PROTOCOL_TLS CERT_NONE
 PROTOCOL_TLS->PROTOCOL_TLS CERT_OPTIONAL
 PROTOCOL_TLSv1->PROTOCOL_TLS CERT_OPTIONAL
 PROTOCOL_TLS->PROTOCOL_TLS CERT_REQUIRED
 PROTOCOL_TLSv1->PROTOCOL_TLS CERT_REQUIRED
 PROTOCOL_TLS->PROTOCOL_TLS CERT_NONE
 {PROTOCOL_TLSv1->PROTOCOL_TLS} CERT_NONE
ok
test_protocol_sslv3 (test.test_ssl.ThreadedTests)
Connecting to an SSLv3 server with various client options ... skipped 'OpenSSL is compiled without SSLv3 support'
test_protocol_tlsv1 (test.test_ssl.ThreadedTests)
Connecting to a TLSv1 server with various client options ... 
 PROTOCOL_TLSv1->PROTOCOL_TLSv1 CERT_NONE
 PROTOCOL_TLSv1->PROTOCOL_TLSv1 CERT_OPTIONAL
 PROTOCOL_TLSv1->PROTOCOL_TLSv1 CERT_REQUIRED
 {PROTOCOL_TLS->PROTOCOL_TLSv1} CERT_NONE
ok
test_protocol_tlsv1_1 (test.test_ssl.ThreadedTests)
Connecting to a TLSv1.1 server with various client options. ... 
 PROTOCOL_TLSv1_1->PROTOCOL_TLSv1_1 CERT_NONE
 {PROTOCOL_TLS->PROTOCOL_TLSv1_1} CERT_NONE
 PROTOCOL_TLSv1_1->PROTOCOL_TLS CERT_NONE
 {PROTOCOL_TLSv1->PROTOCOL_TLSv1_1} CERT_NONE
 {PROTOCOL_TLSv1_1->PROTOCOL_TLSv1} CERT_NONE
ok
test_protocol_tlsv1_2 (test.test_ssl.ThreadedTests)
Connecting to a TLSv1.2 server with various client options. ... 
 PROTOCOL_TLSv1_2->PROTOCOL_TLSv1_2 CERT_NONE
 {PROTOCOL_TLS->PROTOCOL_TLSv1_2} CERT_NONE
 PROTOCOL_TLSv1_2->PROTOCOL_TLS CERT_NONE
 {PROTOCOL_TLSv1->PROTOCOL_TLSv1_2} CERT_NONE
 {PROTOCOL_TLSv1_2->PROTOCOL_TLSv1} CERT_NONE
 {PROTOCOL_TLSv1_1->PROTOCOL_TLSv1_2} CERT_NONE
 {PROTOCOL_TLSv1_2->PROTOCOL_TLSv1_1} CERT_NONE
ok
test_read_write_after_close_raises_valuerror (test.test_ssl.ThreadedTests) ... ok
test_recv_send (test.test_ssl.ThreadedTests)
Test recv(), send() and friends. ... 
 server:  new connection from ('127.0.0.1', 54390)
 server: connection cipher is now ('ECDHE-RSA-AES256-SHA', 'TLSv1.0', 256)
 server: selected protocol is now None
ok
test_recv_zero (test.test_ssl.ThreadedTests) ...  server:  new connection from ('127.0.0.1', 39242)
 server: connection cipher is now ('TLS_AES_256_GCM_SHA384', 'TLSv1.3', 256)
 server: selected protocol is now None
ok
test_rude_shutdown (test.test_ssl.ThreadedTests)
A brutal shutdown of an SSL server should raise an OSError ... ok
test_selected_alpn_protocol (test.test_ssl.ThreadedTests) ...  server:  new connection from ('127.0.0.1', 51458)
 server: connection cipher is now ('ECDHE-RSA-AES256-SHA', 'TLSv1.0', 256)
 server: selected protocol is now None
 client:  sending 'FOO\n'...
 client:  read 'foo\n'
 client:  sending 'FOO\n'...
 client:  read 'foo\n'
 client:  sending 'FOO\n'...
 client:  read 'foo\n'
 client:  closing connection.
ok
test_selected_alpn_protocol_if_server_uses_alpn (test.test_ssl.ThreadedTests) ...  server:  new connection from ('127.0.0.1', 50200)
 server: connection cipher is now ('ECDHE-RSA-AES256-SHA', 'TLSv1.0', 256)
 server: selected protocol is now None
 client:  sending 'FOO\n'...
 client:  read 'foo\n'
 client:  sending 'FOO\n'...
 client:  read 'foo\n'
 client:  sending 'FOO\n'...
 client:  read 'foo\n'
 client:  closing connection.
ok
test_selected_npn_protocol (test.test_ssl.ThreadedTests) ...  server:  new connection from ('127.0.0.1', 36736)
 server: connection cipher is now ('ECDHE-RSA-AES256-SHA', 'TLSv1.0', 256)
 server: selected protocol is now None
 client:  sending 'FOO\n'...
 client:  read 'foo\n'
 client:  sending 'FOO\n'...
 client:  read 'foo\n'
 client:  sending 'FOO\n'...
 client:  read 'foo\n'
 client:  closing connection.
ok
test_server_accept (test.test_ssl.ThreadedTests) ... ok
test_sni_callback (test.test_ssl.ThreadedTests) ...  server:  new connection from ('127.0.0.1', 55978)
 server: connection cipher is now ('ECDHE-RSA-AES256-SHA', 'TLSv1.0', 256)
 server: selected protocol is now None
 server:  new connection from ('127.0.0.1', 33346)
 server: connection cipher is now ('ECDHE-RSA-AES256-SHA', 'TLSv1.0', 256)
 server: selected protocol is now None
 server:  new connection from ('127.0.0.1', 44492)
 server: connection cipher is now ('ECDHE-RSA-AES256-SHA', 'TLSv1.0', 256)
 server: selected protocol is now None
ok
test_sni_callback_alert (test.test_ssl.ThreadedTests) ... ok
test_sni_callback_raising (test.test_ssl.ThreadedTests) ... ok
test_sni_callback_wrong_return_type (test.test_ssl.ThreadedTests) ... ok
test_socketserver (test.test_ssl.ThreadedTests)
Using a SocketServer to create and manage SSL connections. ... 
 server (('127.0.0.1', 45137):45137 ('TLS_AES_256_GCM_SHA384', 'TLSv1.3', 256)):
   [14/Sep/2018 07:33:24] "GET /keycert.pem HTTP/1.1" 200 -
 client: read 1783 bytes from remote server '<HTTPSServerThread <HTTPSServer localhost:45137>>'
stopping HTTPS server
joining HTTPS thread
ok
test_starttls (test.test_ssl.ThreadedTests)
Switching from clear text to encrypted and back again. ... 
 client:  sending 'msg 1'...
 server:  new connection from ('127.0.0.1', 50268)
 server: read 'msg 1' (unencrypted), sending back 'msg 1' (unencrypted)...
 client:  read 'msg 1' from server
 client:  sending 'MSG 2'...
 server: read 'MSG 2' (unencrypted), sending back 'msg 2' (unencrypted)...
 client:  read 'msg 2' from server
 client:  sending 'STARTTLS'...
 server: read STARTTLS from client, sending OK...
 client:  read 'ok' from server, starting TLS...
 server: connection cipher is now ('ECDHE-RSA-AES256-SHA', 'TLSv1.0', 256)
 server: selected protocol is now None
 client:  sending 'MSG 3'...
 server: read 'MSG 3' (encrypted), sending back 'msg 3' (encrypted)...
 client:  read 'msg 3' from server
 client:  sending 'msg 4'...
 server: read 'msg 4' (encrypted), sending back 'msg 4' (encrypted)...
 client:  read 'msg 4' from server
 client:  sending 'ENDTLS'...
 server: read ENDTLS from client, sending OK...
 client:  read 'ok' from server, ending TLS...
 server: connection is now unencrypted...
 client:  sending 'msg 5'...
 server: read 'msg 5' (unencrypted), sending back 'msg 5' (unencrypted)...
 client:  read 'msg 5' from server
 client:  sending 'msg 6'...
 server: read 'msg 6' (unencrypted), sending back 'msg 6' (unencrypted)...
 client:  read 'msg 6' from server
 client:  closing connection.
 server: client closed connection
ok
test_tls1_3 (test.test_ssl.ThreadedTests) ... ERROR
test_tls_unique_channel_binding (test.test_ssl.ThreadedTests)
Test tls-unique channel binding. ... 
 server:  new connection from ('127.0.0.1', 41846)
 server: connection cipher is now ('ECDHE-RSA-AES256-SHA', 'TLSv1.0', 256)
 server: selected protocol is now None
 got channel binding data: '\xb4\xca\x81\xc5}Z\x83\x14X\x0e\xee:'
 server:  new connection from ('127.0.0.1', 41848)
 server: connection cipher is now ('ECDHE-RSA-AES256-SHA', 'TLSv1.0', 256)
 server: selected protocol is now None
 got another channel binding data: '\xa4\xacb\xaa\x9bDL\xa4\x12\xc0Z\xa2'
ok
test_version_basic (test.test_ssl.ThreadedTests) ... ok
test_wrong_cert (test.test_ssl.ThreadedTests)
Connecting when the server rejects the client's certificate ... test test_ssl failed -- multiple errors occurred

SSLError is SSLError(1, u'[SSL: TLSV1_ALERT_UNKNOWN_CA] tlsv1 alert unknown ca (_ssl.c:726)')
ok

======================================================================
ERROR: test_tls1_3 (test.test_ssl.ThreadedTests)
----------------------------------------------------------------------
Traceback (most recent call last):
  File "/tmp/B.s9fqCB/BUILD/Python-2.7.15/Lib/test/test_ssl.py", line 2808, in test_tls1_3
    with context.wrap_socket(socket.socket()) as s:
AttributeError: __exit__

======================================================================
FAIL: test_options (test.test_ssl.ContextTests)
----------------------------------------------------------------------
Traceback (most recent call last):
  File "/tmp/B.s9fqCB/BUILD/Python-2.7.15/Lib/test/test_ssl.py", line 780, in test_options
    self.assertEqual(default, ctx.options)
AssertionError: 2181169236 != 2182217812L

======================================================================
FAIL: test_default_ciphers (test.test_ssl.ThreadedTests)
----------------------------------------------------------------------
Traceback (most recent call last):
  File "/tmp/B.s9fqCB/BUILD/Python-2.7.15/Lib/test/test_ssl.py", line 2780, in test_default_ciphers
    s.connect((HOST, server.port))
AssertionError: SSLError not raised

======================================================================
FAIL: test_default_ecdh_curve (test.test_ssl.ThreadedTests)
----------------------------------------------------------------------
Traceback (most recent call last):
  File "/tmp/B.s9fqCB/BUILD/Python-2.7.15/Lib/test/test_ssl.py", line 2831, in test_default_ecdh_curve
    self.assertIn("ECDH", s.cipher()[0])
AssertionError: 'ECDH' not found in 'TLS_AES_256_GCM_SHA384'

----------------------------------------------------------------------
Ran 95 tests in 1.878s

FAILED (failures=3, errors=1, skipped=7)
1 test failed again:
    test_ssl

Total duration: 10 min 12 sec
Tests result: FAILURE
make: *** [Makefile:880: test] Error 2
error: Bad exit status from /tmp/B.s9fqCB/BUILD/tmp/rpm-tmp.24445 (%build)


RPM build errors:
    Bad exit status from /tmp/B.s9fqCB/BUILD/tmp/rpm-tmp.24445 (%build)
ended at: Fri Sep 14 07:33:24 2018, done in 0:21:53.214610
error: No files produced.
mesg: ttyname failed: Inappropriate ioctl for device
+ chmod -R u+rwX /tmp/B.s9fqCB/BUILD
+ rm -rf /tmp/B.s9fqCB/tmp /tmp/B.s9fqCB/BUILD
mesg: ttyname failed: Inappropriate ioctl for device
+ rm -rf /tmp/B.s9fqCB
Begin-PLD-Builder-Info
Build-Time: user:819.27s sys:312.55s real:1319.08s (faults io:149 non-io:10775503)

End-PLD-Builder-Info
[Back to list of logs] [View rpm -qa of builder]