FailedOk

th/SRPMS[OK]
th/x32[OK]
th/i686[OK]
th/x86_64[OK]

ac/SRPMS[OK]
ac/i386[OK]
ac/i586[OK]
ac/i686[OK]
ac/alpha[OK]
ac/amd64[OK]
ac/athlon[OK]
ac/ppc[OK]
ac/sparc[OK]
ac/sparc64[OK]

Advanced Search
main()
Powered by PLD Linux
(c) 2002-2018 PLD Team
$Revision: 1.37 $
Powered by electricity.
Your IP: 54.80.83.123

python-flask-debugtoolbar-lineprofilerpanel 54900aeb-6bce-4856-a6d2-766bbfc06c3d

Status:Failed
Source URL:ftp://buildlogs.pld-linux.org/th/x86_64/FAIL/python-flask-debugtoolbar-lineprofilerpanel,54900aeb-6bce-4856-a6d2-766bbfc06c3d.bz2
text/plain URL:View!
full text:View!
rpm -qa of builder:View!
Date:2018/07/04 09:55:16
Runtime:0:00:02.208349

Toc:

  • error 1
  • rpm: error: Failed build dependencies:
  • error 2
  • rpm: error: Failed build dependencies:
  • prep
  • Executing(%prep): /bin/sh -e /tmp/B.ImrkVW/BUILD/tmp/rpm-tmp.21202
  • build
  • Executing(%build): /bin/sh -e /tmp/B.ImrkVW/BUILD/tmp/rpm-tmp.21202
  • error 3
  • ERROR: panels (unittest.loader._FailedTest)
  • error 4
  • ImportError: Failed to import test module: panels
  • error 5
  • ModuleNotFoundError: No module named 'traitlets'
  • error 6
  • error: Test failed: <unittest.runner.TextTestResult run=1 errors=1 failures=0>
  • error 7
  • error: Bad exit status from /tmp/B.ImrkVW/BUILD/tmp/rpm-tmp.21202 (%build)
  • error 8
  • RPM build errors:
  • error 9
  • error: No files produced.

Content:

checking if we should skip the build
started at: Wed Jul  4 09:54:57 2018
killing old processes on a builder
mesg: ttyname failed: Inappropriate ioctl for device
sending signal 9 to pid -1
Killed
cleaning up /tmp
mesg: ttyname failed: Inappropriate ioctl for device
fetching https://srcbuilder.pld-linux.org/th//srpms/54900aeb-6bce-4856-a6d2-766bbfc06c3d/python-flask-debugtoolbar-lineprofilerpanel-1.0.2-7.src.rpm
fetched 17791 bytes, 53.8 K/s
installing srpm: python-flask-debugtoolbar-lineprofilerpanel-1.0.2-7.src.rpm
mesg: ttyname failed: Inappropriate ioctl for device
+ install -d /tmp/B.ImrkVW/BUILD /tmp/B.ImrkVW/RPMS
+ LC_ALL=en_US.UTF-8
+ rpm -qp --changelog python-flask-debugtoolbar-lineprofilerpanel-1.0.2-7.src.rpm
* Wed Jul 04 2018 PLD Linux Team <feedback@pld-linux.org>
- For complete changelog see: http://git.pld-linux.org/?p=packages/python-flask-debugtoolbar-lineprofilerpanel.git;a=log;h=auto/th/python-flask-debugtoolbar-lineprofilerpanel-1.0.2-7
* Tue Jul 03 2018 Arkadiusz Miƛkiewicz <arekm@maven.pl> d5a6975
- release 7 (by relup.sh) + rpm -Uhv --nodeps --define '_topdir /tmp/B.ImrkVW' --define '_specdir %{_topdir}' --define '_sourcedir %{_specdir}' --define '_rpmdir %{_topdir}/RPMS' --define '_builddir %{_topdir}/BUILD' python-flask-debugtoolbar-lineprofilerpanel-1.0.2-7.src.rpm Preparing... ################################################## python-flask-debugtoolbar-li################################################## + rm -f python-flask-debugtoolbar-lineprofilerpanel-1.0.2-7.src.rpm mesg: ttyname failed: Inappropriate ioctl for device + install -m 700 -d /tmp/B.ImrkVW/BUILD/tmp mesg: ttyname failed: Inappropriate ioctl for device + TMPDIR=/tmp/B.ImrkVW/BUILD/tmp + exec nice -n 0 rpmbuild -bp --short-circuit --nodeps --define '_topdir /tmp/B.ImrkVW' --define '_specdir %{_topdir}' --define '_sourcedir %{_specdir}' --define '_rpmdir %{_topdir}/RPMS' --define '_builddir %{_topdir}/BUILD' --target x86_64-pld-linux --define 'prep exit 0' /tmp/B.ImrkVW/python-flask-debugtoolbar-lineprofilerpanel.spec Building target platforms: x86_64-pld-linux checking BuildConflict-ing packages no BuildConflicts found checking BR rpm: error: Failed build dependencies: rpm: python3-flask-debugtoolbar is needed by python-flask-debugtoolbar-lineprofilerpanel-1.0.2-7.src rpm: python3-line_profiler is needed by python-flask-debugtoolbar-lineprofilerpanel-1.0.2-7.src rpm: Building target platforms: x86_64-pld-linux updating poldek cache... ready is up to date Retrieving th::packages.ndir.md... th is up to date Retrieving th::packages.ndir.md... th is up to date Retrieving th-ready::packages.ndir.md... th-ready is up to date Retrieving th-ready::packages.ndir.md... th-ready is up to date Retrieving th-test::packages.ndir.md... Retrieving th-test::packages.ndir.diff.toc.gz... ..............................done Retrieving diff::packages.ndir.2018.07.04-07.04.02.gz... Retrieving diff::packages.ndir.dscr.2018.07.04-07.04.02.gz... Loading [pndir]th-test... Applying packages.ndir.2018.07.04-07.04.02.gz... Writing /root/.poldek-cache/[...]/packages.ndir.gz... Retrieving th-test::packages.ndir.md... Retrieving th-test::packages.ndir.diff.toc.gz... ..............................done Retrieving diff::packages.ndir.2018.07.04-07.25.01.gz... ..............................done Retrieving diff::packages.ndir.dscr.2018.07.04-07.25.01.gz... Loading [pndir]th-test... Applying packages.ndir.2018.07.04-07.25.01.gz... Retrieving diff::packages.ndir.2018.07.04-07.26.01.gz... ..............................done Retrieving diff::packages.ndir.dscr.2018.07.04-07.26.01.gz... Applying packages.ndir.2018.07.04-07.26.01.gz... Writing /root/.poldek-cache/[...]/packages.ndir.gz... checking conflicting packages in BRed packages poldek: Loading [pndir]ready... poldek: Loading [pndir]th-test... poldek: Loading [pndir]th-test... poldek: Loading [pndir]th-ready... poldek: Loading [pndir]th-ready... poldek: Loading [pndir]th... poldek: Loading [pndir]th... poldek: 30887 packages read poldek: Removed 3917 duplicate packages from available set poldek: Processing dependencies... poldek: There are 2 packages to install: poldek: I python3-flask-debugtoolbar-0.9.0-6.noarch poldek: I python3-line_profiler-2.1-1.x86_64 poldek: This operation will use 1.1MB of disk space. poldek: Need to get 303.4KB of archives. poldek: Executing pm-command.sh --upgrade -vh --test --root / --define _check_dirname_deps 1... poldek: Preparing... ################################################## no conflicts found checking BR rpm: error: Failed build dependencies: rpm: python3-flask-debugtoolbar is needed by python-flask-debugtoolbar-lineprofilerpanel-1.0.2-7.src rpm: python3-line_profiler is needed by python-flask-debugtoolbar-lineprofilerpanel-1.0.2-7.src rpm: Building target platforms: x86_64-pld-linux installing BR: python3\-line\_profiler python3\-flask\-debugtoolbar + poldek --noask --caplookup -Q -v '--ignore=hhvm-*' '--ignore=php4-*' '--ignore=php52-*' '--ignore=php54-*' '--ignore=php55-*' '--ignore=php56-*' '--ignore=php70-*' '--ignore=php71-*' '--ignore=php72-*' --upgrade python3-line_profiler python3-flask-debugtoolbar Loading [pndir]ready... Loading [pndir]th-test... Loading [pndir]th-test... Loading [pndir]th-ready... Loading [pndir]th-ready... Loading [pndir]th... Loading [pndir]th... 30887 packages read Removed 3917 duplicate packages from available set Processing dependencies... There are 2 packages to install: I python3-flask-debugtoolbar-0.9.0-6.noarch I python3-line_profiler-2.1-1.x86_64 This operation will use 1.1MB of disk space. Need to get 303.4KB of archives. Executing pm-command.sh --upgrade -vh --root / --define _check_dirname_deps 1... Preparing... ################################################## python3-line_profiler ################################################## python3-flask-debugtoolbar ################################################## building RPM using: set -ex; : build-id: 54900aeb-6bce-4856-a6d2-766bbfc06c3d; TMPDIR=/tmp/B.ImrkVW/BUILD/tmp exec nice -n 0 rpmbuild -bb --define '_smp_mflags -j9' --define '_make_opts -Otarget' --define '_pld_builder 1' --define '_topdir /tmp/B.ImrkVW' --define '_specdir %{_topdir}' --define '_sourcedir %{_specdir}' --define '_rpmdir %{_topdir}/RPMS' --define '_builddir %{_topdir}/BUILD' --target x86_64-pld-linux /tmp/B.ImrkVW/python-flask-debugtoolbar-lineprofilerpanel.spec mesg: ttyname failed: Inappropriate ioctl for device + : build-id: 54900aeb-6bce-4856-a6d2-766bbfc06c3d + TMPDIR=/tmp/B.ImrkVW/BUILD/tmp + exec nice -n 0 rpmbuild -bb --define '_smp_mflags -j9' --define '_make_opts -Otarget' --define '_pld_builder 1' --define '_topdir /tmp/B.ImrkVW' --define '_specdir %{_topdir}' --define '_sourcedir %{_specdir}' --define '_rpmdir %{_topdir}/RPMS' --define '_builddir %{_topdir}/BUILD' --target x86_64-pld-linux /tmp/B.ImrkVW/python-flask-debugtoolbar-lineprofilerpanel.spec Building target platforms: x86_64-pld-linux Executing(%prep): /bin/sh -e /tmp/B.ImrkVW/BUILD/tmp/rpm-tmp.21202 + umask 022 + cd /tmp/B.ImrkVW/BUILD + cd /tmp/B.ImrkVW/BUILD + rm -rf Flask-DebugToolbar-LineProfilerPanel-1.0.2 + /usr/bin/gzip -dc /tmp/B.ImrkVW/Flask-DebugToolbar-LineProfilerPanel-1.0.2.tar.gz + /bin/tar -xf - + STATUS=0 + '[' 0 -ne 0 ']' + cd Flask-DebugToolbar-LineProfilerPanel-1.0.2 + /bin/id -u + '[' 1000 '=' 0 ']' + /bin/id -u + '[' 1000 '=' 0 ']' + /bin/chmod -Rf a+rX,u+w,g-w,o-w . + sed -i 's/line-profiler>=1.0b3/line_profiler>=1.0/g' setup.py + exit 0 Executing(%build): /bin/sh -e /tmp/B.ImrkVW/BUILD/tmp/rpm-tmp.21202 TMP=/home/users/builder/tmp HOME=/home/users/builder PATH=/home/users/builder/GNUstep/Tools:/usr/local/bin:/usr/bin:/bin:/home/users/builder/bin TMPDIR=/tmp/B.ImrkVW/BUILD/tmp + umask 022 + cd /tmp/B.ImrkVW/BUILD + cd Flask-DebugToolbar-LineProfilerPanel-1.0.2 + LDFLAGS='-Wl,--as-needed -Wl,--no-copy-dt-needed-entries -Wl,-z,relro -Wl,-z,combreloc ' + export LDFLAGS + CFLAGS=' -O2 -fwrapv -pipe -Wformat -Werror=format-security -gdwarf-4 -fno-debug-types-section -fvar-tracking-assignments -g2 -Wp,-D_FORTIFY_SOURCE=2 -fstack-protector-strong --param=ssp-buffer-size=4 -fPIC -march=x86-64 -gdwarf-4 -fno-debug-types-section -fvar-tracking-assignments -g2 ' + export CFLAGS + CXXFLAGS=' -O2 -fwrapv -pipe -Wformat -Werror=format-security -gdwarf-4 -fno-debug-types-section -fvar-tracking-assignments -g2 -Wp,-D_FORTIFY_SOURCE=2 -fstack-protector-strong --param=ssp-buffer-size=4 -fPIC -march=x86-64 -gdwarf-4 -fno-debug-types-section -fvar-tracking-assignments -g2 ' + export CXXFLAGS + CC=x86_64-pld-linux-gcc + export CC + CXX=x86_64-pld-linux-g++ + export CXX + /usr/bin/python2 setup.py build '--build-base=build-2' test running build running build_py creating build-2 creating build-2/lib creating build-2/lib/flask_debugtoolbar_lineprofilerpanel copying flask_debugtoolbar_lineprofilerpanel/__init__.py -> build-2/lib/flask_debugtoolbar_lineprofilerpanel copying flask_debugtoolbar_lineprofilerpanel/panels.py -> build-2/lib/flask_debugtoolbar_lineprofilerpanel copying flask_debugtoolbar_lineprofilerpanel/profile.py -> build-2/lib/flask_debugtoolbar_lineprofilerpanel running egg_info writing requirements to Flask_DebugToolbar_LineProfilerPanel.egg-info/requires.txt writing Flask_DebugToolbar_LineProfilerPanel.egg-info/PKG-INFO writing top-level names to Flask_DebugToolbar_LineProfilerPanel.egg-info/top_level.txt writing dependency_links to Flask_DebugToolbar_LineProfilerPanel.egg-info/dependency_links.txt reading manifest file 'Flask_DebugToolbar_LineProfilerPanel.egg-info/SOURCES.txt' reading manifest template 'MANIFEST.in' writing manifest file 'Flask_DebugToolbar_LineProfilerPanel.egg-info/SOURCES.txt' creating build-2/lib/flask_debugtoolbar_lineprofilerpanel/templates copying flask_debugtoolbar_lineprofilerpanel/templates/content.html -> build-2/lib/flask_debugtoolbar_lineprofilerpanel/templates running test running build_ext ---------------------------------------------------------------------- Ran 0 tests in 0.000s OK + LDFLAGS='-Wl,--as-needed -Wl,--no-copy-dt-needed-entries -Wl,-z,relro -Wl,-z,combreloc ' + export LDFLAGS + CFLAGS=' -O2 -fwrapv -pipe -Wformat -Werror=format-security -gdwarf-4 -fno-debug-types-section -fvar-tracking-assignments -g2 -Wp,-D_FORTIFY_SOURCE=2 -fstack-protector-strong --param=ssp-buffer-size=4 -fPIC -march=x86-64 -gdwarf-4 -fno-debug-types-section -fvar-tracking-assignments -g2 ' + export CFLAGS + CXXFLAGS=' -O2 -fwrapv -pipe -Wformat -Werror=format-security -gdwarf-4 -fno-debug-types-section -fvar-tracking-assignments -g2 -Wp,-D_FORTIFY_SOURCE=2 -fstack-protector-strong --param=ssp-buffer-size=4 -fPIC -march=x86-64 -gdwarf-4 -fno-debug-types-section -fvar-tracking-assignments -g2 ' + export CXXFLAGS + CC=x86_64-pld-linux-gcc + export CC + CXX=x86_64-pld-linux-g++ + export CXX + /usr/bin/python3 setup.py build '--build-base=build-3' test running build running build_py creating build-3 creating build-3/lib creating build-3/lib/flask_debugtoolbar_lineprofilerpanel copying flask_debugtoolbar_lineprofilerpanel/__init__.py -> build-3/lib/flask_debugtoolbar_lineprofilerpanel copying flask_debugtoolbar_lineprofilerpanel/panels.py -> build-3/lib/flask_debugtoolbar_lineprofilerpanel copying flask_debugtoolbar_lineprofilerpanel/profile.py -> build-3/lib/flask_debugtoolbar_lineprofilerpanel running egg_info writing Flask_DebugToolbar_LineProfilerPanel.egg-info/PKG-INFO writing dependency_links to Flask_DebugToolbar_LineProfilerPanel.egg-info/dependency_links.txt writing requirements to Flask_DebugToolbar_LineProfilerPanel.egg-info/requires.txt writing top-level names to Flask_DebugToolbar_LineProfilerPanel.egg-info/top_level.txt reading manifest file 'Flask_DebugToolbar_LineProfilerPanel.egg-info/SOURCES.txt' reading manifest template 'MANIFEST.in' writing manifest file 'Flask_DebugToolbar_LineProfilerPanel.egg-info/SOURCES.txt' creating build-3/lib/flask_debugtoolbar_lineprofilerpanel/templates copying flask_debugtoolbar_lineprofilerpanel/templates/content.html -> build-3/lib/flask_debugtoolbar_lineprofilerpanel/templates running test running build_ext panels (unittest.loader._FailedTest) ... ERROR ====================================================================== ERROR: panels (unittest.loader._FailedTest) ---------------------------------------------------------------------- ImportError: Failed to import test module: panels Traceback (most recent call last): File "/usr/lib64/python3.7/unittest/loader.py", line 154, in loadTestsFromName module = __import__(module_name) File "/tmp/B.ImrkVW/BUILD/Flask-DebugToolbar-LineProfilerPanel-1.0.2/flask_debugtoolbar_lineprofilerpanel/panels.py", line 1, in <module> import line_profiler File "/usr/lib64/python3.7/site-packages/line_profiler.py", line 20, in <module> from IPython.core.magic import (Magics, magics_class, line_magic) File "/usr/share/python3.7/site-packages/IPython/__init__.py", line 48, in <module> from .core.application import Application File "/usr/share/python3.7/site-packages/IPython/core/application.py", line 23, in <module> from traitlets.config.application import Application, catch_config_error ModuleNotFoundError: No module named 'traitlets' ---------------------------------------------------------------------- Ran 1 test in 0.000s FAILED (errors=1) Test failed: <unittest.runner.TextTestResult run=1 errors=1 failures=0> error: Test failed: <unittest.runner.TextTestResult run=1 errors=1 failures=0> error: Bad exit status from /tmp/B.ImrkVW/BUILD/tmp/rpm-tmp.21202 (%build) RPM build errors: Bad exit status from /tmp/B.ImrkVW/BUILD/tmp/rpm-tmp.21202 (%build) ended at: Wed Jul 4 09:55:16 2018, done in 0:00:02.208349 error: No files produced. mesg: ttyname failed: Inappropriate ioctl for device + chmod -R u+rwX /tmp/B.ImrkVW/BUILD + rm -rf /tmp/B.ImrkVW/tmp /tmp/B.ImrkVW/BUILD mesg: ttyname failed: Inappropriate ioctl for device + rm -rf /tmp/B.ImrkVW Begin-PLD-Builder-Info Build-Time: user:11.19s sys:1.67s real:19.73s (faults io:0 non-io:450936) End-PLD-Builder-Info
[Back to list of logs] [View rpm -qa of builder]