FailedOk

th/SRPMS[OK]
th/x32[OK]
th/i686[OK]
th/x86_64[OK]

ac/SRPMS[OK]
ac/i386[OK]
ac/i586[OK]
ac/i686[OK]
ac/alpha[OK]
ac/amd64[OK]
ac/athlon[OK]
ac/ppc[OK]
ac/sparc[OK]
ac/sparc64[OK]

Advanced Search
main()
Powered by PLD Linux
(c) 2002-2018 PLD Team
$Revision: 1.37 $
Powered by overclock.
Your IP: 54.198.52.82

python-fs 082490d1-e54c-4595-afc8-54f3fa60fef7

Status:Failed
Source URL:ftp://buildlogs.pld-linux.org/th/x86_64/FAIL/python-fs,082490d1-e54c-4595-afc8-54f3fa60fef7.bz2
text/plain URL:View!
full text:View!
rpm -qa of builder:View!
Date:2018/07/03 18:17:32
Runtime:0:01:10.878554

Toc:

  • error 1
  • rpm: error: Failed build dependencies:
  • error 2
  • rpm: error: Failed build dependencies:
  • prep
  • Executing(%prep): /bin/sh -e /tmp/B.uxufNp/BUILD/tmp/rpm-tmp.83374
  • build
  • Executing(%build): /bin/sh -e /tmp/B.uxufNp/BUILD/tmp/rpm-tmp.83374
  • error 3
  • FAIL: test_decode_linux (tests.test_ftp_parse.TestFTPParse)
  • error 4
  • AssertionError: Lists differ: [{u'access': {u'group': u'0', ... != [{u'access': {u'group': u'0', ...
  • error 5
  • FAIL: test_parse_time (tests.test_ftp_parse.TestFTPParse)
  • error 6
  • AssertionError: 1530756000.0 != 1499220000.0
  • error 7
  • error: Test failed: <unittest.runner.TextTestResult run=1080 errors=0 failures=2>
  • error 8
  • error: Bad exit status from /tmp/B.uxufNp/BUILD/tmp/rpm-tmp.83374 (%build)
  • error 9
  • RPM build errors:
  • error 10
  • error: No files produced.

Content:

checking if we should skip the build
started at: Tue Jul  3 18:16:06 2018
killing old processes on a builder
mesg: ttyname failed: Inappropriate ioctl for device
sending signal 9 to pid -1
Killed
cleaning up /tmp
mesg: ttyname failed: Inappropriate ioctl for device
fetching https://srcbuilder.pld-linux.org/th//srpms/082490d1-e54c-4595-afc8-54f3fa60fef7/python-fs-2.0.2-2.src.rpm
fetched 98316 bytes, 229.3 K/s
installing srpm: python-fs-2.0.2-2.src.rpm
mesg: ttyname failed: Inappropriate ioctl for device
+ install -d /tmp/B.uxufNp/BUILD /tmp/B.uxufNp/RPMS
+ LC_ALL=en_US.UTF-8
+ rpm -qp --changelog python-fs-2.0.2-2.src.rpm
* Tue Jul 03 2018 PLD Linux Team <feedback@pld-linux.org>
- For complete changelog see: http://git.pld-linux.org/?p=packages/python-fs.git;a=log;h=auto/th/python-fs-2.0.2-2
* Tue Jul 03 2018 Arkadiusz Miƛkiewicz <arekm@maven.pl> da995db
- release 2 (by relup.sh) + rpm -Uhv --nodeps --define '_topdir /tmp/B.uxufNp' --define '_specdir %{_topdir}' --define '_sourcedir %{_specdir}' --define '_rpmdir %{_topdir}/RPMS' --define '_builddir %{_topdir}/BUILD' python-fs-2.0.2-2.src.rpm Preparing... ################################################## python-fs ################################################## + rm -f python-fs-2.0.2-2.src.rpm mesg: ttyname failed: Inappropriate ioctl for device + install -m 700 -d /tmp/B.uxufNp/BUILD/tmp mesg: ttyname failed: Inappropriate ioctl for device + TMPDIR=/tmp/B.uxufNp/BUILD/tmp + exec nice -n 0 rpmbuild -bp --short-circuit --nodeps --define '_topdir /tmp/B.uxufNp' --define '_specdir %{_topdir}' --define '_sourcedir %{_specdir}' --define '_rpmdir %{_topdir}/RPMS' --define '_builddir %{_topdir}/BUILD' --target x86_64-pld-linux --define 'prep exit 0' /tmp/B.uxufNp/python-fs.spec Building target platforms: x86_64-pld-linux checking BuildConflict-ing packages no BuildConflicts found checking BR rpm: error: Failed build dependencies: rpm: python-pyftpdlib is needed by python-fs-2.0.2-2.src rpm: python3-pyftpdlib is needed by python-fs-2.0.2-2.src rpm: Building target platforms: x86_64-pld-linux updating poldek cache... ready is up to date Retrieving th::packages.ndir.md... th is up to date Retrieving th::packages.ndir.md... th is up to date Retrieving th-ready::packages.ndir.md... th-ready is up to date Retrieving th-ready::packages.ndir.md... th-ready is up to date Retrieving th-test::packages.ndir.md... Retrieving th-test::packages.ndir.diff.toc.gz... ..............................done Retrieving diff::packages.ndir.2018.07.03-16.15.02.gz... ..............................done Retrieving diff::packages.ndir.dscr.2018.07.03-16.15.02.gz... Loading [pndir]th-test... Applying packages.ndir.2018.07.03-16.15.02.gz... Writing /root/.poldek-cache/[...]/packages.ndir.gz... Retrieving th-test::packages.ndir.md... th-test is up to date checking conflicting packages in BRed packages poldek: Loading [pndir]ready... poldek: Loading [pndir]th-test... poldek: Loading [pndir]th-test... poldek: Loading [pndir]th-ready... poldek: Loading [pndir]th-ready... poldek: Loading [pndir]th... poldek: Loading [pndir]th... poldek: 30578 packages read poldek: Removed 3617 duplicate packages from available set poldek: Processing dependencies... poldek: There are 2 packages to install: poldek: I python-pyftpdlib-1.5.1-2.noarch python3-pyftpdlib-1.5.1-2.noarch poldek: This operation will use 1.1MB of disk space. poldek: Need to get 246.5KB of archives. poldek: Executing pm-command.sh --upgrade -vh --test --root / --define _check_dirname_deps 1... poldek: Preparing... ################################################## no conflicts found checking BR rpm: error: Failed build dependencies: rpm: python-pyftpdlib is needed by python-fs-2.0.2-2.src rpm: python3-pyftpdlib is needed by python-fs-2.0.2-2.src rpm: Building target platforms: x86_64-pld-linux installing BR: python\-pyftpdlib python3\-pyftpdlib + poldek --noask --caplookup -Q -v '--ignore=hhvm-*' '--ignore=php4-*' '--ignore=php52-*' '--ignore=php54-*' '--ignore=php55-*' '--ignore=php56-*' '--ignore=php70-*' '--ignore=php71-*' '--ignore=php72-*' --upgrade python-pyftpdlib python3-pyftpdlib Loading [pndir]ready... Loading [pndir]th-test... Loading [pndir]th-test... Loading [pndir]th-ready... Loading [pndir]th-ready... Loading [pndir]th... Loading [pndir]th... 30578 packages read Removed 3617 duplicate packages from available set Processing dependencies... There are 2 packages to install: I python-pyftpdlib-1.5.1-2.noarch python3-pyftpdlib-1.5.1-2.noarch This operation will use 1.1MB of disk space. Need to get 246.5KB of archives. Executing pm-command.sh --upgrade -vh --root / --define _check_dirname_deps 1... Preparing... ################################################## python3-pyftpdlib ################################################## python-pyftpdlib ################################################## building RPM using: set -ex; : build-id: 082490d1-e54c-4595-afc8-54f3fa60fef7; TMPDIR=/tmp/B.uxufNp/BUILD/tmp exec nice -n 0 rpmbuild -bb --define '_smp_mflags -j9' --define '_make_opts -Otarget' --define '_pld_builder 1' --define '_topdir /tmp/B.uxufNp' --define '_specdir %{_topdir}' --define '_sourcedir %{_specdir}' --define '_rpmdir %{_topdir}/RPMS' --define '_builddir %{_topdir}/BUILD' --target x86_64-pld-linux /tmp/B.uxufNp/python-fs.spec mesg: ttyname failed: Inappropriate ioctl for device + : build-id: 082490d1-e54c-4595-afc8-54f3fa60fef7 + TMPDIR=/tmp/B.uxufNp/BUILD/tmp + exec nice -n 0 rpmbuild -bb --define '_smp_mflags -j9' --define '_make_opts -Otarget' --define '_pld_builder 1' --define '_topdir /tmp/B.uxufNp' --define '_specdir %{_topdir}' --define '_sourcedir %{_specdir}' --define '_rpmdir %{_topdir}/RPMS' --define '_builddir %{_topdir}/BUILD' --target x86_64-pld-linux /tmp/B.uxufNp/python-fs.spec Building target platforms: x86_64-pld-linux Executing(%prep): /bin/sh -e /tmp/B.uxufNp/BUILD/tmp/rpm-tmp.83374 + umask 022 + cd /tmp/B.uxufNp/BUILD + cd /tmp/B.uxufNp/BUILD + rm -rf fs-2.0.2 + /usr/bin/gzip -dc /tmp/B.uxufNp/fs-2.0.2.tar.gz + /bin/tar -xf - + STATUS=0 + '[' 0 -ne 0 ']' + cd fs-2.0.2 + /bin/id -u + '[' 1000 '=' 0 ']' + /bin/id -u + '[' 1000 '=' 0 ']' + /bin/chmod -Rf a+rX,u+w,g-w,o-w . + echo 'Patch #0 (python-fs-py3-requires.patch):' Patch #0 (python-fs-py3-requires.patch): + '[' -f /tmp/B.uxufNp/python-fs-py3-requires.patch ']' + /bin/cat /tmp/B.uxufNp/python-fs-py3-requires.patch + /usr/bin/patch -s -p1 + exit 0 Executing(%build): /bin/sh -e /tmp/B.uxufNp/BUILD/tmp/rpm-tmp.83374 TMP=/home/users/builder/tmp HOME=/home/users/builder PATH=/home/users/builder/GNUstep/Tools:/usr/local/bin:/usr/bin:/bin:/home/users/builder/bin TMPDIR=/tmp/B.uxufNp/BUILD/tmp + umask 022 + cd /tmp/B.uxufNp/BUILD + cd fs-2.0.2 + pwd + export 'PYTHONPATH=/tmp/B.uxufNp/BUILD/fs-2.0.2' 'LC_ALL=C.UTF-8' + LDFLAGS='-Wl,--as-needed -Wl,--no-copy-dt-needed-entries -Wl,-z,relro -Wl,-z,combreloc ' + export LDFLAGS + CFLAGS=' -O2 -fwrapv -pipe -Wformat -Werror=format-security -gdwarf-4 -fno-debug-types-section -fvar-tracking-assignments -g2 -Wp,-D_FORTIFY_SOURCE=2 -fstack-protector-strong --param=ssp-buffer-size=4 -fPIC -march=x86-64 -gdwarf-4 -fno-debug-types-section -fvar-tracking-assignments -g2 ' + export CFLAGS + CXXFLAGS=' -O2 -fwrapv -pipe -Wformat -Werror=format-security -gdwarf-4 -fno-debug-types-section -fvar-tracking-assignments -g2 -Wp,-D_FORTIFY_SOURCE=2 -fstack-protector-strong --param=ssp-buffer-size=4 -fPIC -march=x86-64 -gdwarf-4 -fno-debug-types-section -fvar-tracking-assignments -g2 ' + export CXXFLAGS + CC=x86_64-pld-linux-gcc + export CC + CXX=x86_64-pld-linux-g++ + export CXX + /usr/bin/python2 setup.py build '--build-base=build-2' test running build running build_py creating build-2 creating build-2/lib creating build-2/lib/fs copying fs/__init__.py -> build-2/lib/fs copying fs/_ftp_parse.py -> build-2/lib/fs copying fs/_repr.py -> build-2/lib/fs copying fs/_version.py -> build-2/lib/fs copying fs/appfs.py -> build-2/lib/fs copying fs/base.py -> build-2/lib/fs copying fs/compress.py -> build-2/lib/fs copying fs/constants.py -> build-2/lib/fs copying fs/copy.py -> build-2/lib/fs copying fs/enums.py -> build-2/lib/fs copying fs/error_tools.py -> build-2/lib/fs copying fs/errors.py -> build-2/lib/fs copying fs/filesize.py -> build-2/lib/fs copying fs/ftpfs.py -> build-2/lib/fs copying fs/info.py -> build-2/lib/fs copying fs/iotools.py -> build-2/lib/fs copying fs/lrucache.py -> build-2/lib/fs copying fs/memoryfs.py -> build-2/lib/fs copying fs/mode.py -> build-2/lib/fs copying fs/mountfs.py -> build-2/lib/fs copying fs/move.py -> build-2/lib/fs copying fs/multifs.py -> build-2/lib/fs copying fs/opener.py -> build-2/lib/fs copying fs/osfs.py -> build-2/lib/fs copying fs/path.py -> build-2/lib/fs copying fs/permissions.py -> build-2/lib/fs copying fs/subfs.py -> build-2/lib/fs copying fs/tarfs.py -> build-2/lib/fs copying fs/tempfs.py -> build-2/lib/fs copying fs/test.py -> build-2/lib/fs copying fs/time.py -> build-2/lib/fs copying fs/tools.py -> build-2/lib/fs copying fs/tree.py -> build-2/lib/fs copying fs/walk.py -> build-2/lib/fs copying fs/wildcard.py -> build-2/lib/fs copying fs/wrap.py -> build-2/lib/fs copying fs/wrapfs.py -> build-2/lib/fs copying fs/zipfs.py -> build-2/lib/fs running test running egg_info writing requirements to fs.egg-info/requires.txt writing fs.egg-info/PKG-INFO writing top-level names to fs.egg-info/top_level.txt writing dependency_links to fs.egg-info/dependency_links.txt reading manifest file 'fs.egg-info/SOURCES.txt' writing manifest file 'fs.egg-info/SOURCES.txt' running build_ext test_user_data (tests.test_appfs.TestAppFS) Test UserDataFS. ... ok test_validatepath (tests.test_base.TestBase) Test validatepath method. ... ok test_copy_dir (tests.test_copy.TestCopy) ... ok test_copy_fs (tests.test_copy.TestCopy) ... ok test_str (tests.test_errors.TestErrors) ... ok test_unsupported (tests.test_errors.TestErrors) ... ok test_decode_linux (tests.test_ftp_parse.TestFTPParse) ... FAIL test_parse (tests.test_ftp_parse.TestFTPParse) ... ok test_parse_line (tests.test_ftp_parse.TestFTPParse) ... ok test_parse_time (tests.test_ftp_parse.TestFTPParse) ... FAIL test_manager (tests.test_ftpfs.TestFTPErrors) ... ok test_appendbytes (tests.test_ftpfs.TestFTPFS) ... ok test_appendtext (tests.test_ftpfs.TestFTPFS) ... ok test_basic (tests.test_ftpfs.TestFTPFS) ... ok test_bin_files (tests.test_ftpfs.TestFTPFS) ... ok test_close (tests.test_ftpfs.TestFTPFS) ... ok test_connection_error (tests.test_ftpfs.TestFTPFS) ... ok test_copy (tests.test_ftpfs.TestFTPFS) ... ok test_copy_dir_mem (tests.test_ftpfs.TestFTPFS) ... ok test_copy_dir_temp (tests.test_ftpfs.TestFTPFS) ... ok test_copy_file (tests.test_ftpfs.TestFTPFS) ... ok test_copy_structure (tests.test_ftpfs.TestFTPFS) ... ok test_copydir (tests.test_ftpfs.TestFTPFS) ... ok test_create (tests.test_ftpfs.TestFTPFS) ... ok test_desc (tests.test_ftpfs.TestFTPFS) ... ok test_exists (tests.test_ftpfs.TestFTPFS) ... ok test_features (tests.test_ftpfs.TestFTPFS) ... ok test_files (tests.test_ftpfs.TestFTPFS) ... ok test_filterdir (tests.test_ftpfs.TestFTPFS) ... ok test_ftp_url (tests.test_ftpfs.TestFTPFS) ... ok test_getbytes (tests.test_ftpfs.TestFTPFS) ... ok test_getinfo (tests.test_ftpfs.TestFTPFS) ... ok test_getmeta (tests.test_ftpfs.TestFTPFS) ... ok test_getsize (tests.test_ftpfs.TestFTPFS) ... ok test_getsyspath (tests.test_ftpfs.TestFTPFS) ... ok test_gettext (tests.test_ftpfs.TestFTPFS) ... ok test_geturl (tests.test_ftpfs.TestFTPFS) ... ok test_invalid_chars (tests.test_ftpfs.TestFTPFS) ... ok test_isdir (tests.test_ftpfs.TestFTPFS) ... ok test_isempty (tests.test_ftpfs.TestFTPFS) ... ok test_isfile (tests.test_ftpfs.TestFTPFS) ... ok test_listdir (tests.test_ftpfs.TestFTPFS) ... ok test_makedir (tests.test_ftpfs.TestFTPFS) ... ok test_makedirs (tests.test_ftpfs.TestFTPFS) ... ok test_match (tests.test_ftpfs.TestFTPFS) ... ok test_move (tests.test_ftpfs.TestFTPFS) ... ok test_move_dir_mem (tests.test_ftpfs.TestFTPFS) ... ok test_move_dir_temp (tests.test_ftpfs.TestFTPFS) ... ok test_move_file_mem (tests.test_ftpfs.TestFTPFS) ... ok test_move_file_same_fs (tests.test_ftpfs.TestFTPFS) ... ok test_move_file_temp (tests.test_ftpfs.TestFTPFS) ... ok test_move_same_fs (tests.test_ftpfs.TestFTPFS) ... ok test_movedir (tests.test_ftpfs.TestFTPFS) ... ok test_open (tests.test_ftpfs.TestFTPFS) ... ok test_open_files (tests.test_ftpfs.TestFTPFS) ... ok test_openbin (tests.test_ftpfs.TestFTPFS) ... ok test_openbin_rw (tests.test_ftpfs.TestFTPFS) ... ok test_opendir (tests.test_ftpfs.TestFTPFS) ... ok test_remove (tests.test_ftpfs.TestFTPFS) ... ok test_removedir (tests.test_ftpfs.TestFTPFS) ... ok test_removetree (tests.test_ftpfs.TestFTPFS) ... ok test_scandir (tests.test_ftpfs.TestFTPFS) ... ok test_setbinfile (tests.test_ftpfs.TestFTPFS) ... ok test_setbytes (tests.test_ftpfs.TestFTPFS) ... ok test_setfile (tests.test_ftpfs.TestFTPFS) ... ok test_setinfo (tests.test_ftpfs.TestFTPFS) ... ok test_settext (tests.test_ftpfs.TestFTPFS) ... ok test_settimes (tests.test_ftpfs.TestFTPFS) ... ok test_touch (tests.test_ftpfs.TestFTPFS) ... ok test_tree (tests.test_ftpfs.TestFTPFS) ... ok test_opener (tests.test_ftpfs.TestFTPFSClass) ... ok test_parse_ftp_time (tests.test_ftpfs.TestFTPFSClass) ... ok test_parse_mlsx (tests.test_ftpfs.TestFTPFSClass) ... ok test_appendbytes (tests.test_ftpfs.TestFTPFSNoMLSD) ... ok test_appendtext (tests.test_ftpfs.TestFTPFSNoMLSD) ... ok test_basic (tests.test_ftpfs.TestFTPFSNoMLSD) ... ok test_bin_files (tests.test_ftpfs.TestFTPFSNoMLSD) ... ok test_close (tests.test_ftpfs.TestFTPFSNoMLSD) ... ok test_connection_error (tests.test_ftpfs.TestFTPFSNoMLSD) ... ok test_copy (tests.test_ftpfs.TestFTPFSNoMLSD) ... ok test_copy_dir_mem (tests.test_ftpfs.TestFTPFSNoMLSD) ... ok test_copy_dir_temp (tests.test_ftpfs.TestFTPFSNoMLSD) ... ok test_copy_file (tests.test_ftpfs.TestFTPFSNoMLSD) ... ok test_copy_structure (tests.test_ftpfs.TestFTPFSNoMLSD) ... ok test_copydir (tests.test_ftpfs.TestFTPFSNoMLSD) ... ok test_create (tests.test_ftpfs.TestFTPFSNoMLSD) ... ok test_desc (tests.test_ftpfs.TestFTPFSNoMLSD) ... ok test_exists (tests.test_ftpfs.TestFTPFSNoMLSD) ... ok test_features (tests.test_ftpfs.TestFTPFSNoMLSD) ... ok test_files (tests.test_ftpfs.TestFTPFSNoMLSD) ... ok test_filterdir (tests.test_ftpfs.TestFTPFSNoMLSD) ... ok test_ftp_url (tests.test_ftpfs.TestFTPFSNoMLSD) ... ok test_getbytes (tests.test_ftpfs.TestFTPFSNoMLSD) ... ok test_getinfo (tests.test_ftpfs.TestFTPFSNoMLSD) ... ok test_getmeta (tests.test_ftpfs.TestFTPFSNoMLSD) ... ok test_getsize (tests.test_ftpfs.TestFTPFSNoMLSD) ... ok test_getsyspath (tests.test_ftpfs.TestFTPFSNoMLSD) ... ok test_gettext (tests.test_ftpfs.TestFTPFSNoMLSD) ... ok test_geturl (tests.test_ftpfs.TestFTPFSNoMLSD) ... ok test_invalid_chars (tests.test_ftpfs.TestFTPFSNoMLSD) ... ok test_isdir (tests.test_ftpfs.TestFTPFSNoMLSD) ... ok test_isempty (tests.test_ftpfs.TestFTPFSNoMLSD) ... ok test_isfile (tests.test_ftpfs.TestFTPFSNoMLSD) ... ok test_listdir (tests.test_ftpfs.TestFTPFSNoMLSD) ... ok test_makedir (tests.test_ftpfs.TestFTPFSNoMLSD) ... ok test_makedirs (tests.test_ftpfs.TestFTPFSNoMLSD) ... ok test_match (tests.test_ftpfs.TestFTPFSNoMLSD) ... ok test_move (tests.test_ftpfs.TestFTPFSNoMLSD) ... ok test_move_dir_mem (tests.test_ftpfs.TestFTPFSNoMLSD) ... ok test_move_dir_temp (tests.test_ftpfs.TestFTPFSNoMLSD) ... ok test_move_file_mem (tests.test_ftpfs.TestFTPFSNoMLSD) ... ok test_move_file_same_fs (tests.test_ftpfs.TestFTPFSNoMLSD) ... ok test_move_file_temp (tests.test_ftpfs.TestFTPFSNoMLSD) ... ok test_move_same_fs (tests.test_ftpfs.TestFTPFSNoMLSD) ... ok test_movedir (tests.test_ftpfs.TestFTPFSNoMLSD) ... ok test_open (tests.test_ftpfs.TestFTPFSNoMLSD) ... ok test_open_files (tests.test_ftpfs.TestFTPFSNoMLSD) ... ok test_openbin (tests.test_ftpfs.TestFTPFSNoMLSD) ... ok test_openbin_rw (tests.test_ftpfs.TestFTPFSNoMLSD) ... ok test_opendir (tests.test_ftpfs.TestFTPFSNoMLSD) ... ok test_remove (tests.test_ftpfs.TestFTPFSNoMLSD) ... ok test_removedir (tests.test_ftpfs.TestFTPFSNoMLSD) ... ok test_removetree (tests.test_ftpfs.TestFTPFSNoMLSD) ... ok test_scandir (tests.test_ftpfs.TestFTPFSNoMLSD) ... ok test_setbinfile (tests.test_ftpfs.TestFTPFSNoMLSD) ... ok test_setbytes (tests.test_ftpfs.TestFTPFSNoMLSD) ... ok test_setfile (tests.test_ftpfs.TestFTPFSNoMLSD) ... ok test_setinfo (tests.test_ftpfs.TestFTPFSNoMLSD) ... ok test_settext (tests.test_ftpfs.TestFTPFSNoMLSD) ... ok test_settimes (tests.test_ftpfs.TestFTPFSNoMLSD) ... ok test_touch (tests.test_ftpfs.TestFTPFSNoMLSD) ... ok test_tree (tests.test_ftpfs.TestFTPFSNoMLSD) ... ok test_access (tests.test_info.TestInfo) ... ok test_basic (tests.test_info.TestInfo) ... ok test_copy (tests.test_info.TestInfo) ... ok test_details (tests.test_info.TestInfo) ... ok test_empty (tests.test_info.TestInfo) Test missing info. ... ok test_has_namespace (tests.test_info.TestInfo) ... ok test_isatty (tests.test_iotools.TestIOTools) ... ok test_line_iterator (tests.test_iotools.TestIOTools) ... ok test_make_stream (tests.test_iotools.TestIOTools) Test make_stream ... ok test_make_stream_reader (tests.test_iotools.TestIOTools) ... ok test_make_stream_reader_writer (tests.test_iotools.TestIOTools) ... ok test_make_stream_writer (tests.test_iotools.TestIOTools) ... ok test_readall (tests.test_iotools.TestIOTools) ... ok test_readinto (tests.test_iotools.TestIOTools) ... ok test_readinto1 (tests.test_iotools.TestIOTools) ... ok test_readlines (tests.test_iotools.TestIOTools) ... ok test_seekable (tests.test_iotools.TestIOTools) ... ok test_writelines (tests.test_iotools.TestIOTools) ... ok test_lrucache (tests.test_lrucache.TestLRUCache) ... ok test_appendbytes (tests.test_memoryfs.TestMemoryFS) ... ok test_appendtext (tests.test_memoryfs.TestMemoryFS) ... ok test_basic (tests.test_memoryfs.TestMemoryFS) ... ok test_bin_files (tests.test_memoryfs.TestMemoryFS) ... ok test_close (tests.test_memoryfs.TestMemoryFS) ... ok test_copy (tests.test_memoryfs.TestMemoryFS) ... ok test_copy_dir_mem (tests.test_memoryfs.TestMemoryFS) ... ok test_copy_dir_temp (tests.test_memoryfs.TestMemoryFS) ... ok test_copy_file (tests.test_memoryfs.TestMemoryFS) ... ok test_copy_structure (tests.test_memoryfs.TestMemoryFS) ... ok test_copydir (tests.test_memoryfs.TestMemoryFS) ... ok test_create (tests.test_memoryfs.TestMemoryFS) ... ok test_desc (tests.test_memoryfs.TestMemoryFS) ... ok test_exists (tests.test_memoryfs.TestMemoryFS) ... ok test_files (tests.test_memoryfs.TestMemoryFS) ... ok test_filterdir (tests.test_memoryfs.TestMemoryFS) ... ok test_getbytes (tests.test_memoryfs.TestMemoryFS) ... ok test_getinfo (tests.test_memoryfs.TestMemoryFS) ... ok test_getmeta (tests.test_memoryfs.TestMemoryFS) ... ok test_getsize (tests.test_memoryfs.TestMemoryFS) ... ok test_getsyspath (tests.test_memoryfs.TestMemoryFS) ... ok test_gettext (tests.test_memoryfs.TestMemoryFS) ... ok test_geturl (tests.test_memoryfs.TestMemoryFS) ... ok test_invalid_chars (tests.test_memoryfs.TestMemoryFS) ... ok test_isdir (tests.test_memoryfs.TestMemoryFS) ... ok test_isempty (tests.test_memoryfs.TestMemoryFS) ... ok test_isfile (tests.test_memoryfs.TestMemoryFS) ... ok test_listdir (tests.test_memoryfs.TestMemoryFS) ... ok test_makedir (tests.test_memoryfs.TestMemoryFS) ... ok test_makedirs (tests.test_memoryfs.TestMemoryFS) ... ok test_match (tests.test_memoryfs.TestMemoryFS) ... ok test_move (tests.test_memoryfs.TestMemoryFS) ... ok test_move_dir_mem (tests.test_memoryfs.TestMemoryFS) ... ok test_move_dir_temp (tests.test_memoryfs.TestMemoryFS) ... ok test_move_file_mem (tests.test_memoryfs.TestMemoryFS) ... ok test_move_file_same_fs (tests.test_memoryfs.TestMemoryFS) ... ok test_move_file_temp (tests.test_memoryfs.TestMemoryFS) ... ok test_move_same_fs (tests.test_memoryfs.TestMemoryFS) ... ok test_movedir (tests.test_memoryfs.TestMemoryFS) ... ok test_open (tests.test_memoryfs.TestMemoryFS) ... ok test_open_files (tests.test_memoryfs.TestMemoryFS) ... ok test_openbin (tests.test_memoryfs.TestMemoryFS) ... ok test_openbin_rw (tests.test_memoryfs.TestMemoryFS) ... ok test_opendir (tests.test_memoryfs.TestMemoryFS) ... ok test_remove (tests.test_memoryfs.TestMemoryFS) ... ok test_removedir (tests.test_memoryfs.TestMemoryFS) ... ok test_removetree (tests.test_memoryfs.TestMemoryFS) ... ok test_scandir (tests.test_memoryfs.TestMemoryFS) ... ok test_setbinfile (tests.test_memoryfs.TestMemoryFS) ... ok test_setbytes (tests.test_memoryfs.TestMemoryFS) ... ok test_setfile (tests.test_memoryfs.TestMemoryFS) ... ok test_setinfo (tests.test_memoryfs.TestMemoryFS) ... ok test_settext (tests.test_memoryfs.TestMemoryFS) ... ok test_settimes (tests.test_memoryfs.TestMemoryFS) ... ok test_touch (tests.test_memoryfs.TestMemoryFS) ... ok test_tree (tests.test_memoryfs.TestMemoryFS) ... ok test_checks (tests.test_mode.TestMode) ... ok test_mode_object (tests.test_mode.TestMode) ... ok test_appendbytes (tests.test_mountfs.TestMountFS) ... ok test_appendtext (tests.test_mountfs.TestMountFS) ... ok test_basic (tests.test_mountfs.TestMountFS) ... ok test_bin_files (tests.test_mountfs.TestMountFS) ... ok test_close (tests.test_mountfs.TestMountFS) ... ok test_copy (tests.test_mountfs.TestMountFS) ... ok test_copy_dir_mem (tests.test_mountfs.TestMountFS) ... ok test_copy_dir_temp (tests.test_mountfs.TestMountFS) ... ok test_copy_file (tests.test_mountfs.TestMountFS) ... ok test_copy_structure (tests.test_mountfs.TestMountFS) ... ok test_copydir (tests.test_mountfs.TestMountFS) ... ok test_create (tests.test_mountfs.TestMountFS) ... ok test_desc (tests.test_mountfs.TestMountFS) ... ok test_exists (tests.test_mountfs.TestMountFS) ... ok test_files (tests.test_mountfs.TestMountFS) ... ok test_filterdir (tests.test_mountfs.TestMountFS) ... ok test_getbytes (tests.test_mountfs.TestMountFS) ... ok test_getinfo (tests.test_mountfs.TestMountFS) ... ok test_getmeta (tests.test_mountfs.TestMountFS) ... ok test_getsize (tests.test_mountfs.TestMountFS) ... ok test_getsyspath (tests.test_mountfs.TestMountFS) ... ok test_gettext (tests.test_mountfs.TestMountFS) ... ok test_geturl (tests.test_mountfs.TestMountFS) ... ok test_invalid_chars (tests.test_mountfs.TestMountFS) ... ok test_isdir (tests.test_mountfs.TestMountFS) ... ok test_isempty (tests.test_mountfs.TestMountFS) ... ok test_isfile (tests.test_mountfs.TestMountFS) ... ok test_listdir (tests.test_mountfs.TestMountFS) ... ok test_makedir (tests.test_mountfs.TestMountFS) ... ok test_makedirs (tests.test_mountfs.TestMountFS) ... ok test_match (tests.test_mountfs.TestMountFS) ... ok test_move (tests.test_mountfs.TestMountFS) ... ok test_move_dir_mem (tests.test_mountfs.TestMountFS) ... ok test_move_dir_temp (tests.test_mountfs.TestMountFS) ... ok test_move_file_mem (tests.test_mountfs.TestMountFS) ... ok test_move_file_same_fs (tests.test_mountfs.TestMountFS) ... ok test_move_file_temp (tests.test_mountfs.TestMountFS) ... ok test_move_same_fs (tests.test_mountfs.TestMountFS) ... ok test_movedir (tests.test_mountfs.TestMountFS) ... ok test_open (tests.test_mountfs.TestMountFS) ... ok test_open_files (tests.test_mountfs.TestMountFS) ... ok test_openbin (tests.test_mountfs.TestMountFS) ... ok test_openbin_rw (tests.test_mountfs.TestMountFS) ... ok test_opendir (tests.test_mountfs.TestMountFS) ... ok test_remove (tests.test_mountfs.TestMountFS) ... ok test_removedir (tests.test_mountfs.TestMountFS) ... ok test_removetree (tests.test_mountfs.TestMountFS) ... ok test_scandir (tests.test_mountfs.TestMountFS) ... ok test_setbinfile (tests.test_mountfs.TestMountFS) ... ok test_setbytes (tests.test_mountfs.TestMountFS) ... ok test_setfile (tests.test_mountfs.TestMountFS) ... ok test_setinfo (tests.test_mountfs.TestMountFS) ... ok test_settext (tests.test_mountfs.TestMountFS) ... ok test_settimes (tests.test_mountfs.TestMountFS) ... ok test_touch (tests.test_mountfs.TestMountFS) ... ok test_tree (tests.test_mountfs.TestMountFS) ... ok test_auto_close (tests.test_mountfs.TestMountFSBehaviours) Test MountFS auto close is working ... ok test_desc (tests.test_mountfs.TestMountFSBehaviours) ... ok test_empty (tests.test_mountfs.TestMountFSBehaviours) Test MountFS with nothing mounted. ... ok test_listdir (tests.test_mountfs.TestMountFSBehaviours) ... ok test_mount_self (tests.test_mountfs.TestMountFSBehaviours) ... ok test_no_auto_close (tests.test_mountfs.TestMountFSBehaviours) Test MountFS auto close can be disabled ... ok test_copy_dir (tests.test_move.TestMove) ... ok test_move_fs (tests.test_move.TestMove) ... ok test_appendbytes (tests.test_multifs.TestMultiFS) ... ok test_appendtext (tests.test_multifs.TestMultiFS) ... ok test_auto_close (tests.test_multifs.TestMultiFS) Test MultiFS auto close is working ... ok test_basic (tests.test_multifs.TestMultiFS) ... ok test_bin_files (tests.test_multifs.TestMultiFS) ... ok test_close (tests.test_multifs.TestMultiFS) ... ok test_copy (tests.test_multifs.TestMultiFS) ... ok test_copy_dir_mem (tests.test_multifs.TestMultiFS) ... ok test_copy_dir_temp (tests.test_multifs.TestMultiFS) ... ok test_copy_file (tests.test_multifs.TestMultiFS) ... ok test_copy_structure (tests.test_multifs.TestMultiFS) ... ok test_copydir (tests.test_multifs.TestMultiFS) ... ok test_create (tests.test_multifs.TestMultiFS) ... ok test_desc (tests.test_multifs.TestMultiFS) ... ok test_exists (tests.test_multifs.TestMultiFS) ... ok test_files (tests.test_multifs.TestMultiFS) ... ok test_filterdir (tests.test_multifs.TestMultiFS) ... ok test_get_fs (tests.test_multifs.TestMultiFS) ... ok test_getbytes (tests.test_multifs.TestMultiFS) ... ok test_getinfo (tests.test_multifs.TestMultiFS) ... ok test_getmeta (tests.test_multifs.TestMultiFS) ... ok test_getsize (tests.test_multifs.TestMultiFS) ... ok test_getsyspath (tests.test_multifs.TestMultiFS) ... ok test_gettext (tests.test_multifs.TestMultiFS) ... ok test_geturl (tests.test_multifs.TestMultiFS) ... ok test_invalid_chars (tests.test_multifs.TestMultiFS) ... ok test_isdir (tests.test_multifs.TestMultiFS) ... ok test_isempty (tests.test_multifs.TestMultiFS) ... ok test_isfile (tests.test_multifs.TestMultiFS) ... ok test_listdir (tests.test_multifs.TestMultiFS) ... ok test_makedir (tests.test_multifs.TestMultiFS) ... ok test_makedirs (tests.test_multifs.TestMultiFS) ... ok test_match (tests.test_multifs.TestMultiFS) ... ok test_move (tests.test_multifs.TestMultiFS) ... ok test_move_dir_mem (tests.test_multifs.TestMultiFS) ... ok test_move_dir_temp (tests.test_multifs.TestMultiFS) ... ok test_move_file_mem (tests.test_multifs.TestMultiFS) ... ok test_move_file_same_fs (tests.test_multifs.TestMultiFS) ... ok test_move_file_temp (tests.test_multifs.TestMultiFS) ... ok test_move_same_fs (tests.test_multifs.TestMultiFS) ... ok test_movedir (tests.test_multifs.TestMultiFS) ... ok test_no_auto_close (tests.test_multifs.TestMultiFS) Test MultiFS auto close can be disabled ... ok test_no_writable (tests.test_multifs.TestMultiFS) ... ok test_open (tests.test_multifs.TestMultiFS) ... ok test_open_files (tests.test_multifs.TestMultiFS) ... ok test_openbin (tests.test_multifs.TestMultiFS) ... ok test_openbin_rw (tests.test_multifs.TestMultiFS) ... ok test_opendir (tests.test_multifs.TestMultiFS) ... ok test_priority (tests.test_multifs.TestMultiFS) Test priority order is working ... ok test_remove (tests.test_multifs.TestMultiFS) ... ok test_removedir (tests.test_multifs.TestMultiFS) ... ok test_removetree (tests.test_multifs.TestMultiFS) ... ok test_scandir (tests.test_multifs.TestMultiFS) ... ok test_setbinfile (tests.test_multifs.TestMultiFS) ... ok test_setbytes (tests.test_multifs.TestMultiFS) ... ok test_setfile (tests.test_multifs.TestMultiFS) ... ok test_setinfo (tests.test_multifs.TestMultiFS) ... ok test_settext (tests.test_multifs.TestMultiFS) ... ok test_settimes (tests.test_multifs.TestMultiFS) ... ok test_touch (tests.test_multifs.TestMultiFS) ... ok test_tree (tests.test_multifs.TestMultiFS) ... ok test_validate_path (tests.test_multifs.TestMultiFS) ... ok test_which (tests.test_multifs.TestMultiFS) ... ok test_manage_fs_error (tests.test_opener.TestManageFS) ... ok test_manage_fs_obj (tests.test_opener.TestManageFS) ... ok test_manage_fs_url (tests.test_opener.TestManageFS) ... ok test_repr (tests.test_opener.TestOpeners) ... ok test_parse_credentials (tests.test_opener.TestParse) ... ok test_parse_not_url (tests.test_opener.TestParse) ... ok test_parse_path (tests.test_opener.TestParse) ... ok test_parse_simple (tests.test_opener.TestParse) ... ok test_empty (tests.test_opener.TestRegistry) ... ok test_open_fs (tests.test_opener.TestRegistry) ... ok test_open_memfs (tests.test_opener.TestRegistry) ... ok test_open_osfs (tests.test_opener.TestRegistry) ... ok test_open_tarfs (tests.test_opener.TestRegistry) ... ok test_open_zipfs (tests.test_opener.TestRegistry) ... ok test_appendbytes (tests.test_osfs.TestOSFS) ... ok test_appendtext (tests.test_osfs.TestOSFS) ... ok test_basic (tests.test_osfs.TestOSFS) ... ok test_bin_files (tests.test_osfs.TestOSFS) ... ok test_close (tests.test_osfs.TestOSFS) ... ok test_copy (tests.test_osfs.TestOSFS) ... ok test_copy_dir_mem (tests.test_osfs.TestOSFS) ... ok test_copy_dir_temp (tests.test_osfs.TestOSFS) ... ok test_copy_file (tests.test_osfs.TestOSFS) ... ok test_copy_structure (tests.test_osfs.TestOSFS) ... ok test_copydir (tests.test_osfs.TestOSFS) ... ok test_create (tests.test_osfs.TestOSFS) Test create=True ... ok test_desc (tests.test_osfs.TestOSFS) ... ok test_exists (tests.test_osfs.TestOSFS) ... ok test_files (tests.test_osfs.TestOSFS) ... ok test_filterdir (tests.test_osfs.TestOSFS) ... ok test_getbytes (tests.test_osfs.TestOSFS) ... ok test_getinfo (tests.test_osfs.TestOSFS) ... ok test_getmeta (tests.test_osfs.TestOSFS) ... ok test_getsize (tests.test_osfs.TestOSFS) ... ok test_getsyspath (tests.test_osfs.TestOSFS) ... ok test_gettext (tests.test_osfs.TestOSFS) ... ok test_geturl (tests.test_osfs.TestOSFS) ... ok test_invalid_chars (tests.test_osfs.TestOSFS) ... ok test_isdir (tests.test_osfs.TestOSFS) ... ok test_isempty (tests.test_osfs.TestOSFS) ... ok test_isfile (tests.test_osfs.TestOSFS) ... ok test_listdir (tests.test_osfs.TestOSFS) ... ok test_makedir (tests.test_osfs.TestOSFS) ... ok test_makedirs (tests.test_osfs.TestOSFS) ... ok test_match (tests.test_osfs.TestOSFS) ... ok test_move (tests.test_osfs.TestOSFS) ... ok test_move_dir_mem (tests.test_osfs.TestOSFS) ... ok test_move_dir_temp (tests.test_osfs.TestOSFS) ... ok test_move_file_mem (tests.test_osfs.TestOSFS) ... ok test_move_file_same_fs (tests.test_osfs.TestOSFS) ... ok test_move_file_temp (tests.test_osfs.TestOSFS) ... ok test_move_same_fs (tests.test_osfs.TestOSFS) ... ok test_movedir (tests.test_osfs.TestOSFS) ... ok test_not_exists (tests.test_osfs.TestOSFS) ... ok test_open (tests.test_osfs.TestOSFS) ... ok test_open_files (tests.test_osfs.TestOSFS) ... ok test_openbin (tests.test_osfs.TestOSFS) ... ok test_openbin_rw (tests.test_osfs.TestOSFS) ... ok test_opendir (tests.test_osfs.TestOSFS) ... ok test_remove (tests.test_osfs.TestOSFS) ... ok test_removedir (tests.test_osfs.TestOSFS) ... ok test_removetree (tests.test_osfs.TestOSFS) ... ok test_scandir (tests.test_osfs.TestOSFS) ... ok test_setbinfile (tests.test_osfs.TestOSFS) ... ok test_setbytes (tests.test_osfs.TestOSFS) ... ok test_setfile (tests.test_osfs.TestOSFS) ... ok test_setinfo (tests.test_osfs.TestOSFS) ... ok test_settext (tests.test_osfs.TestOSFS) ... ok test_settimes (tests.test_osfs.TestOSFS) ... ok test_touch (tests.test_osfs.TestOSFS) ... ok test_tree (tests.test_osfs.TestOSFS) ... ok test_unicode_paths (tests.test_osfs.TestOSFS) ... ok test_abspath (tests.test_path.TestPathFunctions) ... ok test_basename (tests.test_path.TestPathFunctions) ... ok test_combine (tests.test_path.TestPathFunctions) ... ok test_dirname (tests.test_path.TestPathFunctions) ... ok test_forcedir (tests.test_path.TestPathFunctions) ... ok test_frombase (tests.test_path.TestPathFunctions) ... ok test_isabs (tests.test_path.TestPathFunctions) ... ok test_isbase (tests.test_path.TestPathFunctions) ... ok test_isdotfile (tests.test_path.TestPathFunctions) ... ok test_isparent (tests.test_path.TestPathFunctions) ... ok test_issamedir (tests.test_path.TestPathFunctions) ... ok test_iswildcard (tests.test_path.TestPathFunctions) ... ok test_iteratepath (tests.test_path.TestPathFunctions) ... ok test_normpath (tests.test_path.TestPathFunctions) ... ok test_pathjoin (tests.test_path.TestPathFunctions) ... ok test_pathsplit (tests.test_path.TestPathFunctions) ... ok test_realtivefrom (tests.test_path.TestPathFunctions) ... ok test_recursepath (tests.test_path.TestPathFunctions) ... ok test_relpath (tests.test_path.TestPathFunctions) ... ok test_splitext (tests.test_path.TestPathFunctions) ... ok test_as_str (tests.test_permissions.TestPermissions) ... ok test_check (tests.test_permissions.TestPermissions) ... ok test_constructor (tests.test_permissions.TestPermissions) ... ok test_copy (tests.test_permissions.TestPermissions) ... ok test_create (tests.test_permissions.TestPermissions) ... ok test_equality (tests.test_permissions.TestPermissions) ... ok test_iter (tests.test_permissions.TestPermissions) ... ok test_make_mode (tests.test_permissions.TestPermissions) ... ok test_mode (tests.test_permissions.TestPermissions) ... ok test_mode_set (tests.test_permissions.TestPermissions) ... ok test_parse (tests.test_permissions.TestPermissions) ... ok test_properties (tests.test_permissions.TestPermissions) ... ok test_repr (tests.test_permissions.TestPermissions) ... ok test_serialize (tests.test_permissions.TestPermissions) ... ok test_appendbytes (tests.test_subfs.TestOSFS) ... ok test_appendtext (tests.test_subfs.TestOSFS) ... ok test_basic (tests.test_subfs.TestOSFS) ... ok test_bin_files (tests.test_subfs.TestOSFS) ... ok test_close (tests.test_subfs.TestOSFS) ... ok test_copy (tests.test_subfs.TestOSFS) ... ok test_copy_dir_mem (tests.test_subfs.TestOSFS) ... ok test_copy_dir_temp (tests.test_subfs.TestOSFS) ... ok test_copy_file (tests.test_subfs.TestOSFS) ... ok test_copy_structure (tests.test_subfs.TestOSFS) ... ok test_copydir (tests.test_subfs.TestOSFS) ... ok test_create (tests.test_subfs.TestOSFS) Test create=True ... ok test_desc (tests.test_subfs.TestOSFS) ... ok test_exists (tests.test_subfs.TestOSFS) ... ok test_files (tests.test_subfs.TestOSFS) ... ok test_filterdir (tests.test_subfs.TestOSFS) ... ok test_getbytes (tests.test_subfs.TestOSFS) ... ok test_getinfo (tests.test_subfs.TestOSFS) ... ok test_getmeta (tests.test_subfs.TestOSFS) ... ok test_getsize (tests.test_subfs.TestOSFS) ... ok test_getsyspath (tests.test_subfs.TestOSFS) ... ok test_gettext (tests.test_subfs.TestOSFS) ... ok test_geturl (tests.test_subfs.TestOSFS) ... ok test_invalid_chars (tests.test_subfs.TestOSFS) ... ok test_isdir (tests.test_subfs.TestOSFS) ... ok test_isempty (tests.test_subfs.TestOSFS) ... ok test_isfile (tests.test_subfs.TestOSFS) ... ok test_listdir (tests.test_subfs.TestOSFS) ... ok test_makedir (tests.test_subfs.TestOSFS) ... ok test_makedirs (tests.test_subfs.TestOSFS) ... ok test_match (tests.test_subfs.TestOSFS) ... ok test_move (tests.test_subfs.TestOSFS) ... ok test_move_dir_mem (tests.test_subfs.TestOSFS) ... ok test_move_dir_temp (tests.test_subfs.TestOSFS) ... ok test_move_file_mem (tests.test_subfs.TestOSFS) ... ok test_move_file_same_fs (tests.test_subfs.TestOSFS) ... ok test_move_file_temp (tests.test_subfs.TestOSFS) ... ok test_move_same_fs (tests.test_subfs.TestOSFS) ... ok test_movedir (tests.test_subfs.TestOSFS) ... ok test_not_exists (tests.test_subfs.TestOSFS) ... ok test_open (tests.test_subfs.TestOSFS) ... ok test_open_files (tests.test_subfs.TestOSFS) ... ok test_openbin (tests.test_subfs.TestOSFS) ... ok test_openbin_rw (tests.test_subfs.TestOSFS) ... ok test_opendir (tests.test_subfs.TestOSFS) ... ok test_remove (tests.test_subfs.TestOSFS) ... ok test_removedir (tests.test_subfs.TestOSFS) ... ok test_removetree (tests.test_subfs.TestOSFS) ... ok test_scandir (tests.test_subfs.TestOSFS) ... ok test_setbinfile (tests.test_subfs.TestOSFS) ... ok test_setbytes (tests.test_subfs.TestOSFS) ... ok test_setfile (tests.test_subfs.TestOSFS) ... ok test_setinfo (tests.test_subfs.TestOSFS) ... ok test_settext (tests.test_subfs.TestOSFS) ... ok test_settimes (tests.test_subfs.TestOSFS) ... ok test_touch (tests.test_subfs.TestOSFS) ... ok test_tree (tests.test_subfs.TestOSFS) ... ok test_unicode_paths (tests.test_subfs.TestOSFS) ... ok test_appendbytes (tests.test_subfs.TestSubFS) ... ok test_appendtext (tests.test_subfs.TestSubFS) ... ok test_basic (tests.test_subfs.TestSubFS) ... ok test_bin_files (tests.test_subfs.TestSubFS) ... ok test_close (tests.test_subfs.TestSubFS) ... ok test_copy (tests.test_subfs.TestSubFS) ... ok test_copy_dir_mem (tests.test_subfs.TestSubFS) ... ok test_copy_dir_temp (tests.test_subfs.TestSubFS) ... ok test_copy_file (tests.test_subfs.TestSubFS) ... ok test_copy_structure (tests.test_subfs.TestSubFS) ... ok test_copydir (tests.test_subfs.TestSubFS) ... ok test_create (tests.test_subfs.TestSubFS) Test create=True ... ok test_desc (tests.test_subfs.TestSubFS) ... ok test_exists (tests.test_subfs.TestSubFS) ... ok test_files (tests.test_subfs.TestSubFS) ... ok test_filterdir (tests.test_subfs.TestSubFS) ... ok test_getbytes (tests.test_subfs.TestSubFS) ... ok test_getinfo (tests.test_subfs.TestSubFS) ... ok test_getmeta (tests.test_subfs.TestSubFS) ... ok test_getsize (tests.test_subfs.TestSubFS) ... ok test_getsyspath (tests.test_subfs.TestSubFS) ... ok test_gettext (tests.test_subfs.TestSubFS) ... ok test_geturl (tests.test_subfs.TestSubFS) ... ok test_invalid_chars (tests.test_subfs.TestSubFS) ... ok test_isdir (tests.test_subfs.TestSubFS) ... ok test_isempty (tests.test_subfs.TestSubFS) ... ok test_isfile (tests.test_subfs.TestSubFS) ... ok test_listdir (tests.test_subfs.TestSubFS) ... ok test_makedir (tests.test_subfs.TestSubFS) ... ok test_makedirs (tests.test_subfs.TestSubFS) ... ok test_match (tests.test_subfs.TestSubFS) ... ok test_move (tests.test_subfs.TestSubFS) ... ok test_move_dir_mem (tests.test_subfs.TestSubFS) ... ok test_move_dir_temp (tests.test_subfs.TestSubFS) ... ok test_move_file_mem (tests.test_subfs.TestSubFS) ... ok test_move_file_same_fs (tests.test_subfs.TestSubFS) ... ok test_move_file_temp (tests.test_subfs.TestSubFS) ... ok test_move_same_fs (tests.test_subfs.TestSubFS) ... ok test_movedir (tests.test_subfs.TestSubFS) ... ok test_not_exists (tests.test_subfs.TestSubFS) ... ok test_open (tests.test_subfs.TestSubFS) ... ok test_open_files (tests.test_subfs.TestSubFS) ... ok test_openbin (tests.test_subfs.TestSubFS) ... ok test_openbin_rw (tests.test_subfs.TestSubFS) ... ok test_opendir (tests.test_subfs.TestSubFS) ... ok test_remove (tests.test_subfs.TestSubFS) ... ok test_removedir (tests.test_subfs.TestSubFS) ... ok test_removetree (tests.test_subfs.TestSubFS) ... ok test_scandir (tests.test_subfs.TestSubFS) ... ok test_setbinfile (tests.test_subfs.TestSubFS) ... ok test_setbytes (tests.test_subfs.TestSubFS) ... ok test_setfile (tests.test_subfs.TestSubFS) ... ok test_setinfo (tests.test_subfs.TestSubFS) ... ok test_settext (tests.test_subfs.TestSubFS) ... ok test_settimes (tests.test_subfs.TestSubFS) ... ok test_touch (tests.test_subfs.TestSubFS) ... ok test_tree (tests.test_subfs.TestSubFS) ... ok test_unicode_paths (tests.test_subfs.TestSubFS) ... ok test_getinfo (tests.test_tarfs.TestReadTarFS) ... ok test_gets (tests.test_tarfs.TestReadTarFS) ... ok test_implied_dir (tests.test_tarfs.TestReadTarFS) ... ok test_listdir (tests.test_tarfs.TestReadTarFS) ... ok test_open (tests.test_tarfs.TestReadTarFS) ... ok test_read_from_filename (tests.test_tarfs.TestReadTarFS) ... ok test_read_from_fileobject (tests.test_tarfs.TestReadTarFS) ... ok test_readonly (tests.test_tarfs.TestReadTarFS) ... ok test_repr (tests.test_tarfs.TestReadTarFS) ... ok test_str (tests.test_tarfs.TestReadTarFS) ... ok test_walk_files (tests.test_tarfs.TestReadTarFS) ... ok test_getinfo (tests.test_tarfs.TestReadTarFSMem) ... ok test_gets (tests.test_tarfs.TestReadTarFSMem) ... ok test_implied_dir (tests.test_tarfs.TestReadTarFSMem) ... ok test_listdir (tests.test_tarfs.TestReadTarFSMem) ... ok test_open (tests.test_tarfs.TestReadTarFSMem) ... ok test_read_from_filename (tests.test_tarfs.TestReadTarFSMem) ... ok test_read_from_fileobject (tests.test_tarfs.TestReadTarFSMem) ... ok test_readonly (tests.test_tarfs.TestReadTarFSMem) ... ok test_repr (tests.test_tarfs.TestReadTarFSMem) ... ok test_str (tests.test_tarfs.TestReadTarFSMem) ... ok test_walk_files (tests.test_tarfs.TestReadTarFSMem) ... ok test_appendbytes (tests.test_tarfs.TestWriteBZippedTarFS) ... ok test_appendtext (tests.test_tarfs.TestWriteBZippedTarFS) ... ok test_basic (tests.test_tarfs.TestWriteBZippedTarFS) ... ok test_bin_files (tests.test_tarfs.TestWriteBZippedTarFS) ... ok test_close (tests.test_tarfs.TestWriteBZippedTarFS) ... ok test_copy (tests.test_tarfs.TestWriteBZippedTarFS) ... ok test_copy_dir_mem (tests.test_tarfs.TestWriteBZippedTarFS) ... ok test_copy_dir_temp (tests.test_tarfs.TestWriteBZippedTarFS) ... ok test_copy_file (tests.test_tarfs.TestWriteBZippedTarFS) ... ok test_copy_structure (tests.test_tarfs.TestWriteBZippedTarFS) ... ok test_copydir (tests.test_tarfs.TestWriteBZippedTarFS) ... ok test_create (tests.test_tarfs.TestWriteBZippedTarFS) ... ok test_desc (tests.test_tarfs.TestWriteBZippedTarFS) ... ok test_exists (tests.test_tarfs.TestWriteBZippedTarFS) ... ok test_files (tests.test_tarfs.TestWriteBZippedTarFS) ... ok test_filterdir (tests.test_tarfs.TestWriteBZippedTarFS) ... ok test_getbytes (tests.test_tarfs.TestWriteBZippedTarFS) ... ok test_getinfo (tests.test_tarfs.TestWriteBZippedTarFS) ... ok test_getmeta (tests.test_tarfs.TestWriteBZippedTarFS) ... ok test_getsize (tests.test_tarfs.TestWriteBZippedTarFS) ... ok test_getsyspath (tests.test_tarfs.TestWriteBZippedTarFS) ... ok test_gettext (tests.test_tarfs.TestWriteBZippedTarFS) ... ok test_geturl (tests.test_tarfs.TestWriteBZippedTarFS) ... ok test_invalid_chars (tests.test_tarfs.TestWriteBZippedTarFS) ... ok test_isdir (tests.test_tarfs.TestWriteBZippedTarFS) ... ok test_isempty (tests.test_tarfs.TestWriteBZippedTarFS) ... ok test_isfile (tests.test_tarfs.TestWriteBZippedTarFS) ... ok test_listdir (tests.test_tarfs.TestWriteBZippedTarFS) ... ok test_makedir (tests.test_tarfs.TestWriteBZippedTarFS) ... ok test_makedirs (tests.test_tarfs.TestWriteBZippedTarFS) ... ok test_match (tests.test_tarfs.TestWriteBZippedTarFS) ... ok test_move (tests.test_tarfs.TestWriteBZippedTarFS) ... ok test_move_dir_mem (tests.test_tarfs.TestWriteBZippedTarFS) ... ok test_move_dir_temp (tests.test_tarfs.TestWriteBZippedTarFS) ... ok test_move_file_mem (tests.test_tarfs.TestWriteBZippedTarFS) ... ok test_move_file_same_fs (tests.test_tarfs.TestWriteBZippedTarFS) ... ok test_move_file_temp (tests.test_tarfs.TestWriteBZippedTarFS) ... ok test_move_same_fs (tests.test_tarfs.TestWriteBZippedTarFS) ... ok test_movedir (tests.test_tarfs.TestWriteBZippedTarFS) ... ok test_open (tests.test_tarfs.TestWriteBZippedTarFS) ... ok test_open_files (tests.test_tarfs.TestWriteBZippedTarFS) ... ok test_openbin (tests.test_tarfs.TestWriteBZippedTarFS) ... ok test_openbin_rw (tests.test_tarfs.TestWriteBZippedTarFS) ... ok test_opendir (tests.test_tarfs.TestWriteBZippedTarFS) ... ok test_remove (tests.test_tarfs.TestWriteBZippedTarFS) ... ok test_removedir (tests.test_tarfs.TestWriteBZippedTarFS) ... ok test_removetree (tests.test_tarfs.TestWriteBZippedTarFS) ... ok test_scandir (tests.test_tarfs.TestWriteBZippedTarFS) ... ok test_setbinfile (tests.test_tarfs.TestWriteBZippedTarFS) ... ok test_setbytes (tests.test_tarfs.TestWriteBZippedTarFS) ... ok test_setfile (tests.test_tarfs.TestWriteBZippedTarFS) ... ok test_setinfo (tests.test_tarfs.TestWriteBZippedTarFS) ... ok test_settext (tests.test_tarfs.TestWriteBZippedTarFS) ... ok test_settimes (tests.test_tarfs.TestWriteBZippedTarFS) ... ok test_touch (tests.test_tarfs.TestWriteBZippedTarFS) ... ok test_tree (tests.test_tarfs.TestWriteBZippedTarFS) ... ok test_appendbytes (tests.test_tarfs.TestWriteGZippedTarFS) ... ok test_appendtext (tests.test_tarfs.TestWriteGZippedTarFS) ... ok test_basic (tests.test_tarfs.TestWriteGZippedTarFS) ... ok test_bin_files (tests.test_tarfs.TestWriteGZippedTarFS) ... ok test_close (tests.test_tarfs.TestWriteGZippedTarFS) ... ok test_copy (tests.test_tarfs.TestWriteGZippedTarFS) ... ok test_copy_dir_mem (tests.test_tarfs.TestWriteGZippedTarFS) ... ok test_copy_dir_temp (tests.test_tarfs.TestWriteGZippedTarFS) ... ok test_copy_file (tests.test_tarfs.TestWriteGZippedTarFS) ... ok test_copy_structure (tests.test_tarfs.TestWriteGZippedTarFS) ... ok test_copydir (tests.test_tarfs.TestWriteGZippedTarFS) ... ok test_create (tests.test_tarfs.TestWriteGZippedTarFS) ... ok test_desc (tests.test_tarfs.TestWriteGZippedTarFS) ... ok test_exists (tests.test_tarfs.TestWriteGZippedTarFS) ... ok test_files (tests.test_tarfs.TestWriteGZippedTarFS) ... ok test_filterdir (tests.test_tarfs.TestWriteGZippedTarFS) ... ok test_getbytes (tests.test_tarfs.TestWriteGZippedTarFS) ... ok test_getinfo (tests.test_tarfs.TestWriteGZippedTarFS) ... ok test_getmeta (tests.test_tarfs.TestWriteGZippedTarFS) ... ok test_getsize (tests.test_tarfs.TestWriteGZippedTarFS) ... ok test_getsyspath (tests.test_tarfs.TestWriteGZippedTarFS) ... ok test_gettext (tests.test_tarfs.TestWriteGZippedTarFS) ... ok test_geturl (tests.test_tarfs.TestWriteGZippedTarFS) ... ok test_invalid_chars (tests.test_tarfs.TestWriteGZippedTarFS) ... ok test_isdir (tests.test_tarfs.TestWriteGZippedTarFS) ... ok test_isempty (tests.test_tarfs.TestWriteGZippedTarFS) ... ok test_isfile (tests.test_tarfs.TestWriteGZippedTarFS) ... ok test_listdir (tests.test_tarfs.TestWriteGZippedTarFS) ... ok test_makedir (tests.test_tarfs.TestWriteGZippedTarFS) ... ok test_makedirs (tests.test_tarfs.TestWriteGZippedTarFS) ... ok test_match (tests.test_tarfs.TestWriteGZippedTarFS) ... ok test_move (tests.test_tarfs.TestWriteGZippedTarFS) ... ok test_move_dir_mem (tests.test_tarfs.TestWriteGZippedTarFS) ... ok test_move_dir_temp (tests.test_tarfs.TestWriteGZippedTarFS) ... ok test_move_file_mem (tests.test_tarfs.TestWriteGZippedTarFS) ... ok test_move_file_same_fs (tests.test_tarfs.TestWriteGZippedTarFS) ... ok test_move_file_temp (tests.test_tarfs.TestWriteGZippedTarFS) ... ok test_move_same_fs (tests.test_tarfs.TestWriteGZippedTarFS) ... ok test_movedir (tests.test_tarfs.TestWriteGZippedTarFS) ... ok test_open (tests.test_tarfs.TestWriteGZippedTarFS) ... ok test_open_files (tests.test_tarfs.TestWriteGZippedTarFS) ... ok test_openbin (tests.test_tarfs.TestWriteGZippedTarFS) ... ok test_openbin_rw (tests.test_tarfs.TestWriteGZippedTarFS) ... ok test_opendir (tests.test_tarfs.TestWriteGZippedTarFS) ... ok test_remove (tests.test_tarfs.TestWriteGZippedTarFS) ... ok test_removedir (tests.test_tarfs.TestWriteGZippedTarFS) ... ok test_removetree (tests.test_tarfs.TestWriteGZippedTarFS) ... ok test_scandir (tests.test_tarfs.TestWriteGZippedTarFS) ... ok test_setbinfile (tests.test_tarfs.TestWriteGZippedTarFS) ... ok test_setbytes (tests.test_tarfs.TestWriteGZippedTarFS) ... ok test_setfile (tests.test_tarfs.TestWriteGZippedTarFS) ... ok test_setinfo (tests.test_tarfs.TestWriteGZippedTarFS) ... ok test_settext (tests.test_tarfs.TestWriteGZippedTarFS) ... ok test_settimes (tests.test_tarfs.TestWriteGZippedTarFS) ... ok test_touch (tests.test_tarfs.TestWriteGZippedTarFS) ... ok test_tree (tests.test_tarfs.TestWriteGZippedTarFS) ... ok test_appendbytes (tests.test_tarfs.TestWriteTarFS) ... ok test_appendtext (tests.test_tarfs.TestWriteTarFS) ... ok test_basic (tests.test_tarfs.TestWriteTarFS) ... ok test_bin_files (tests.test_tarfs.TestWriteTarFS) ... ok test_close (tests.test_tarfs.TestWriteTarFS) ... ok test_copy (tests.test_tarfs.TestWriteTarFS) ... ok test_copy_dir_mem (tests.test_tarfs.TestWriteTarFS) ... ok test_copy_dir_temp (tests.test_tarfs.TestWriteTarFS) ... ok test_copy_file (tests.test_tarfs.TestWriteTarFS) ... ok test_copy_structure (tests.test_tarfs.TestWriteTarFS) ... ok test_copydir (tests.test_tarfs.TestWriteTarFS) ... ok test_create (tests.test_tarfs.TestWriteTarFS) ... ok test_desc (tests.test_tarfs.TestWriteTarFS) ... ok test_exists (tests.test_tarfs.TestWriteTarFS) ... ok test_files (tests.test_tarfs.TestWriteTarFS) ... ok test_filterdir (tests.test_tarfs.TestWriteTarFS) ... ok test_getbytes (tests.test_tarfs.TestWriteTarFS) ... ok test_getinfo (tests.test_tarfs.TestWriteTarFS) ... ok test_getmeta (tests.test_tarfs.TestWriteTarFS) ... ok test_getsize (tests.test_tarfs.TestWriteTarFS) ... ok test_getsyspath (tests.test_tarfs.TestWriteTarFS) ... ok test_gettext (tests.test_tarfs.TestWriteTarFS) ... ok test_geturl (tests.test_tarfs.TestWriteTarFS) ... ok test_invalid_chars (tests.test_tarfs.TestWriteTarFS) ... ok test_isdir (tests.test_tarfs.TestWriteTarFS) ... ok test_isempty (tests.test_tarfs.TestWriteTarFS) ... ok test_isfile (tests.test_tarfs.TestWriteTarFS) ... ok test_listdir (tests.test_tarfs.TestWriteTarFS) ... ok test_makedir (tests.test_tarfs.TestWriteTarFS) ... ok test_makedirs (tests.test_tarfs.TestWriteTarFS) ... ok test_match (tests.test_tarfs.TestWriteTarFS) ... ok test_move (tests.test_tarfs.TestWriteTarFS) ... ok test_move_dir_mem (tests.test_tarfs.TestWriteTarFS) ... ok test_move_dir_temp (tests.test_tarfs.TestWriteTarFS) ... ok test_move_file_mem (tests.test_tarfs.TestWriteTarFS) ... ok test_move_file_same_fs (tests.test_tarfs.TestWriteTarFS) ... ok test_move_file_temp (tests.test_tarfs.TestWriteTarFS) ... ok test_move_same_fs (tests.test_tarfs.TestWriteTarFS) ... ok test_movedir (tests.test_tarfs.TestWriteTarFS) ... ok test_open (tests.test_tarfs.TestWriteTarFS) ... ok test_open_files (tests.test_tarfs.TestWriteTarFS) ... ok test_openbin (tests.test_tarfs.TestWriteTarFS) ... ok test_openbin_rw (tests.test_tarfs.TestWriteTarFS) ... ok test_opendir (tests.test_tarfs.TestWriteTarFS) ... ok test_remove (tests.test_tarfs.TestWriteTarFS) ... ok test_removedir (tests.test_tarfs.TestWriteTarFS) ... ok test_removetree (tests.test_tarfs.TestWriteTarFS) ... ok test_scandir (tests.test_tarfs.TestWriteTarFS) ... ok test_setbinfile (tests.test_tarfs.TestWriteTarFS) ... ok test_setbytes (tests.test_tarfs.TestWriteTarFS) ... ok test_setfile (tests.test_tarfs.TestWriteTarFS) ... ok test_setinfo (tests.test_tarfs.TestWriteTarFS) ... ok test_settext (tests.test_tarfs.TestWriteTarFS) ... ok test_settimes (tests.test_tarfs.TestWriteTarFS) ... ok test_touch (tests.test_tarfs.TestWriteTarFS) ... ok test_tree (tests.test_tarfs.TestWriteTarFS) ... ok test_appendbytes (tests.test_tarfs.TestWriteTarFSToFileobj) ... ok test_appendtext (tests.test_tarfs.TestWriteTarFSToFileobj) ... ok test_basic (tests.test_tarfs.TestWriteTarFSToFileobj) ... ok test_bin_files (tests.test_tarfs.TestWriteTarFSToFileobj) ... ok test_close (tests.test_tarfs.TestWriteTarFSToFileobj) ... ok test_copy (tests.test_tarfs.TestWriteTarFSToFileobj) ... ok test_copy_dir_mem (tests.test_tarfs.TestWriteTarFSToFileobj) ... ok test_copy_dir_temp (tests.test_tarfs.TestWriteTarFSToFileobj) ... ok test_copy_file (tests.test_tarfs.TestWriteTarFSToFileobj) ... ok test_copy_structure (tests.test_tarfs.TestWriteTarFSToFileobj) ... ok test_copydir (tests.test_tarfs.TestWriteTarFSToFileobj) ... ok test_create (tests.test_tarfs.TestWriteTarFSToFileobj) ... ok test_desc (tests.test_tarfs.TestWriteTarFSToFileobj) ... ok test_exists (tests.test_tarfs.TestWriteTarFSToFileobj) ... ok test_files (tests.test_tarfs.TestWriteTarFSToFileobj) ... ok test_filterdir (tests.test_tarfs.TestWriteTarFSToFileobj) ... ok test_getbytes (tests.test_tarfs.TestWriteTarFSToFileobj) ... ok test_getinfo (tests.test_tarfs.TestWriteTarFSToFileobj) ... ok test_getmeta (tests.test_tarfs.TestWriteTarFSToFileobj) ... ok test_getsize (tests.test_tarfs.TestWriteTarFSToFileobj) ... ok test_getsyspath (tests.test_tarfs.TestWriteTarFSToFileobj) ... ok test_gettext (tests.test_tarfs.TestWriteTarFSToFileobj) ... ok test_geturl (tests.test_tarfs.TestWriteTarFSToFileobj) ... ok test_invalid_chars (tests.test_tarfs.TestWriteTarFSToFileobj) ... ok test_isdir (tests.test_tarfs.TestWriteTarFSToFileobj) ... ok test_isempty (tests.test_tarfs.TestWriteTarFSToFileobj) ... ok test_isfile (tests.test_tarfs.TestWriteTarFSToFileobj) ... ok test_listdir (tests.test_tarfs.TestWriteTarFSToFileobj) ... ok test_makedir (tests.test_tarfs.TestWriteTarFSToFileobj) ... ok test_makedirs (tests.test_tarfs.TestWriteTarFSToFileobj) ... ok test_match (tests.test_tarfs.TestWriteTarFSToFileobj) ... ok test_move (tests.test_tarfs.TestWriteTarFSToFileobj) ... ok test_move_dir_mem (tests.test_tarfs.TestWriteTarFSToFileobj) ... ok test_move_dir_temp (tests.test_tarfs.TestWriteTarFSToFileobj) ... ok test_move_file_mem (tests.test_tarfs.TestWriteTarFSToFileobj) ... ok test_move_file_same_fs (tests.test_tarfs.TestWriteTarFSToFileobj) ... ok test_move_file_temp (tests.test_tarfs.TestWriteTarFSToFileobj) ... ok test_move_same_fs (tests.test_tarfs.TestWriteTarFSToFileobj) ... ok test_movedir (tests.test_tarfs.TestWriteTarFSToFileobj) ... ok test_open (tests.test_tarfs.TestWriteTarFSToFileobj) ... ok test_open_files (tests.test_tarfs.TestWriteTarFSToFileobj) ... ok test_openbin (tests.test_tarfs.TestWriteTarFSToFileobj) ... ok test_openbin_rw (tests.test_tarfs.TestWriteTarFSToFileobj) ... ok test_opendir (tests.test_tarfs.TestWriteTarFSToFileobj) ... ok test_remove (tests.test_tarfs.TestWriteTarFSToFileobj) ... ok test_removedir (tests.test_tarfs.TestWriteTarFSToFileobj) ... ok test_removetree (tests.test_tarfs.TestWriteTarFSToFileobj) ... ok test_scandir (tests.test_tarfs.TestWriteTarFSToFileobj) ... ok test_setbinfile (tests.test_tarfs.TestWriteTarFSToFileobj) ... ok test_setbytes (tests.test_tarfs.TestWriteTarFSToFileobj) ... ok test_setfile (tests.test_tarfs.TestWriteTarFSToFileobj) ... ok test_setinfo (tests.test_tarfs.TestWriteTarFSToFileobj) ... ok test_settext (tests.test_tarfs.TestWriteTarFSToFileobj) ... ok test_settimes (tests.test_tarfs.TestWriteTarFSToFileobj) ... ok test_touch (tests.test_tarfs.TestWriteTarFSToFileobj) ... ok test_tree (tests.test_tarfs.TestWriteTarFSToFileobj) ... ok test_appendbytes (tests.test_tarfs.TestWriteXZippedTarFS) ... SKIP: Python2 does not support LZMA test_appendtext (tests.test_tarfs.TestWriteXZippedTarFS) ... SKIP: Python2 does not support LZMA test_basic (tests.test_tarfs.TestWriteXZippedTarFS) ... SKIP: Python2 does not support LZMA test_bin_files (tests.test_tarfs.TestWriteXZippedTarFS) ... SKIP: Python2 does not support LZMA test_close (tests.test_tarfs.TestWriteXZippedTarFS) ... SKIP: Python2 does not support LZMA test_copy (tests.test_tarfs.TestWriteXZippedTarFS) ... SKIP: Python2 does not support LZMA test_copy_dir_mem (tests.test_tarfs.TestWriteXZippedTarFS) ... SKIP: Python2 does not support LZMA test_copy_dir_temp (tests.test_tarfs.TestWriteXZippedTarFS) ... SKIP: Python2 does not support LZMA test_copy_file (tests.test_tarfs.TestWriteXZippedTarFS) ... SKIP: Python2 does not support LZMA test_copy_structure (tests.test_tarfs.TestWriteXZippedTarFS) ... SKIP: Python2 does not support LZMA test_copydir (tests.test_tarfs.TestWriteXZippedTarFS) ... SKIP: Python2 does not support LZMA test_create (tests.test_tarfs.TestWriteXZippedTarFS) ... SKIP: Python2 does not support LZMA test_desc (tests.test_tarfs.TestWriteXZippedTarFS) ... SKIP: Python2 does not support LZMA test_exists (tests.test_tarfs.TestWriteXZippedTarFS) ... SKIP: Python2 does not support LZMA test_files (tests.test_tarfs.TestWriteXZippedTarFS) ... SKIP: Python2 does not support LZMA test_filterdir (tests.test_tarfs.TestWriteXZippedTarFS) ... SKIP: Python2 does not support LZMA test_getbytes (tests.test_tarfs.TestWriteXZippedTarFS) ... SKIP: Python2 does not support LZMA test_getinfo (tests.test_tarfs.TestWriteXZippedTarFS) ... SKIP: Python2 does not support LZMA test_getmeta (tests.test_tarfs.TestWriteXZippedTarFS) ... SKIP: Python2 does not support LZMA test_getsize (tests.test_tarfs.TestWriteXZippedTarFS) ... SKIP: Python2 does not support LZMA test_getsyspath (tests.test_tarfs.TestWriteXZippedTarFS) ... SKIP: Python2 does not support LZMA test_gettext (tests.test_tarfs.TestWriteXZippedTarFS) ... SKIP: Python2 does not support LZMA test_geturl (tests.test_tarfs.TestWriteXZippedTarFS) ... SKIP: Python2 does not support LZMA test_invalid_chars (tests.test_tarfs.TestWriteXZippedTarFS) ... SKIP: Python2 does not support LZMA test_isdir (tests.test_tarfs.TestWriteXZippedTarFS) ... SKIP: Python2 does not support LZMA test_isempty (tests.test_tarfs.TestWriteXZippedTarFS) ... SKIP: Python2 does not support LZMA test_isfile (tests.test_tarfs.TestWriteXZippedTarFS) ... SKIP: Python2 does not support LZMA test_listdir (tests.test_tarfs.TestWriteXZippedTarFS) ... SKIP: Python2 does not support LZMA test_makedir (tests.test_tarfs.TestWriteXZippedTarFS) ... SKIP: Python2 does not support LZMA test_makedirs (tests.test_tarfs.TestWriteXZippedTarFS) ... SKIP: Python2 does not support LZMA test_match (tests.test_tarfs.TestWriteXZippedTarFS) ... SKIP: Python2 does not support LZMA test_move (tests.test_tarfs.TestWriteXZippedTarFS) ... SKIP: Python2 does not support LZMA test_move_dir_mem (tests.test_tarfs.TestWriteXZippedTarFS) ... SKIP: Python2 does not support LZMA test_move_dir_temp (tests.test_tarfs.TestWriteXZippedTarFS) ... SKIP: Python2 does not support LZMA test_move_file_mem (tests.test_tarfs.TestWriteXZippedTarFS) ... SKIP: Python2 does not support LZMA test_move_file_same_fs (tests.test_tarfs.TestWriteXZippedTarFS) ... SKIP: Python2 does not support LZMA test_move_file_temp (tests.test_tarfs.TestWriteXZippedTarFS) ... SKIP: Python2 does not support LZMA test_move_same_fs (tests.test_tarfs.TestWriteXZippedTarFS) ... SKIP: Python2 does not support LZMA test_movedir (tests.test_tarfs.TestWriteXZippedTarFS) ... SKIP: Python2 does not support LZMA test_open (tests.test_tarfs.TestWriteXZippedTarFS) ... SKIP: Python2 does not support LZMA test_open_files (tests.test_tarfs.TestWriteXZippedTarFS) ... SKIP: Python2 does not support LZMA test_openbin (tests.test_tarfs.TestWriteXZippedTarFS) ... SKIP: Python2 does not support LZMA test_openbin_rw (tests.test_tarfs.TestWriteXZippedTarFS) ... SKIP: Python2 does not support LZMA test_opendir (tests.test_tarfs.TestWriteXZippedTarFS) ... SKIP: Python2 does not support LZMA test_remove (tests.test_tarfs.TestWriteXZippedTarFS) ... SKIP: Python2 does not support LZMA test_removedir (tests.test_tarfs.TestWriteXZippedTarFS) ... SKIP: Python2 does not support LZMA test_removetree (tests.test_tarfs.TestWriteXZippedTarFS) ... SKIP: Python2 does not support LZMA test_scandir (tests.test_tarfs.TestWriteXZippedTarFS) ... SKIP: Python2 does not support LZMA test_setbinfile (tests.test_tarfs.TestWriteXZippedTarFS) ... SKIP: Python2 does not support LZMA test_setbytes (tests.test_tarfs.TestWriteXZippedTarFS) ... SKIP: Python2 does not support LZMA test_setfile (tests.test_tarfs.TestWriteXZippedTarFS) ... SKIP: Python2 does not support LZMA test_setinfo (tests.test_tarfs.TestWriteXZippedTarFS) ... SKIP: Python2 does not support LZMA test_settext (tests.test_tarfs.TestWriteXZippedTarFS) ... SKIP: Python2 does not support LZMA test_settimes (tests.test_tarfs.TestWriteXZippedTarFS) ... SKIP: Python2 does not support LZMA test_touch (tests.test_tarfs.TestWriteXZippedTarFS) ... SKIP: Python2 does not support LZMA test_tree (tests.test_tarfs.TestWriteXZippedTarFS) ... SKIP: Python2 does not support LZMA test_appendbytes (tests.test_tempfs.TestOSFS) ... ok test_appendtext (tests.test_tempfs.TestOSFS) ... ok test_basic (tests.test_tempfs.TestOSFS) ... ok test_bin_files (tests.test_tempfs.TestOSFS) ... ok test_close (tests.test_tempfs.TestOSFS) ... ok test_copy (tests.test_tempfs.TestOSFS) ... ok test_copy_dir_mem (tests.test_tempfs.TestOSFS) ... ok test_copy_dir_temp (tests.test_tempfs.TestOSFS) ... ok test_copy_file (tests.test_tempfs.TestOSFS) ... ok test_copy_structure (tests.test_tempfs.TestOSFS) ... ok test_copydir (tests.test_tempfs.TestOSFS) ... ok test_create (tests.test_tempfs.TestOSFS) Test create=True ... ok test_desc (tests.test_tempfs.TestOSFS) ... ok test_exists (tests.test_tempfs.TestOSFS) ... ok test_files (tests.test_tempfs.TestOSFS) ... ok test_filterdir (tests.test_tempfs.TestOSFS) ... ok test_getbytes (tests.test_tempfs.TestOSFS) ... ok test_getinfo (tests.test_tempfs.TestOSFS) ... ok test_getmeta (tests.test_tempfs.TestOSFS) ... ok test_getsize (tests.test_tempfs.TestOSFS) ... ok test_getsyspath (tests.test_tempfs.TestOSFS) ... ok test_gettext (tests.test_tempfs.TestOSFS) ... ok test_geturl (tests.test_tempfs.TestOSFS) ... ok test_invalid_chars (tests.test_tempfs.TestOSFS) ... ok test_isdir (tests.test_tempfs.TestOSFS) ... ok test_isempty (tests.test_tempfs.TestOSFS) ... ok test_isfile (tests.test_tempfs.TestOSFS) ... ok test_listdir (tests.test_tempfs.TestOSFS) ... ok test_makedir (tests.test_tempfs.TestOSFS) ... ok test_makedirs (tests.test_tempfs.TestOSFS) ... ok test_match (tests.test_tempfs.TestOSFS) ... ok test_move (tests.test_tempfs.TestOSFS) ... ok test_move_dir_mem (tests.test_tempfs.TestOSFS) ... ok test_move_dir_temp (tests.test_tempfs.TestOSFS) ... ok test_move_file_mem (tests.test_tempfs.TestOSFS) ... ok test_move_file_same_fs (tests.test_tempfs.TestOSFS) ... ok test_move_file_temp (tests.test_tempfs.TestOSFS) ... ok test_move_same_fs (tests.test_tempfs.TestOSFS) ... ok test_movedir (tests.test_tempfs.TestOSFS) ... ok test_not_exists (tests.test_tempfs.TestOSFS) ... ok test_open (tests.test_tempfs.TestOSFS) ... ok test_open_files (tests.test_tempfs.TestOSFS) ... ok test_openbin (tests.test_tempfs.TestOSFS) ... ok test_openbin_rw (tests.test_tempfs.TestOSFS) ... ok test_opendir (tests.test_tempfs.TestOSFS) ... ok test_remove (tests.test_tempfs.TestOSFS) ... ok test_removedir (tests.test_tempfs.TestOSFS) ... ok test_removetree (tests.test_tempfs.TestOSFS) ... ok test_scandir (tests.test_tempfs.TestOSFS) ... ok test_setbinfile (tests.test_tempfs.TestOSFS) ... ok test_setbytes (tests.test_tempfs.TestOSFS) ... ok test_setfile (tests.test_tempfs.TestOSFS) ... ok test_setinfo (tests.test_tempfs.TestOSFS) ... ok test_settext (tests.test_tempfs.TestOSFS) ... ok test_settimes (tests.test_tempfs.TestOSFS) ... ok test_touch (tests.test_tempfs.TestOSFS) ... ok test_tree (tests.test_tempfs.TestOSFS) ... ok test_unicode_paths (tests.test_tempfs.TestOSFS) ... ok test_appendbytes (tests.test_tempfs.TestTempFS) ... ok test_appendtext (tests.test_tempfs.TestTempFS) ... ok test_basic (tests.test_tempfs.TestTempFS) ... ok test_bin_files (tests.test_tempfs.TestTempFS) ... ok test_clean (tests.test_tempfs.TestTempFS) ... ok test_clean_error (tests.test_tempfs.TestTempFS) ... ok test_close (tests.test_tempfs.TestTempFS) ... ok test_copy (tests.test_tempfs.TestTempFS) ... ok test_copy_dir_mem (tests.test_tempfs.TestTempFS) ... ok test_copy_dir_temp (tests.test_tempfs.TestTempFS) ... ok test_copy_file (tests.test_tempfs.TestTempFS) ... ok test_copy_structure (tests.test_tempfs.TestTempFS) ... ok test_copydir (tests.test_tempfs.TestTempFS) ... ok test_create (tests.test_tempfs.TestTempFS) Test create=True ... ok test_desc (tests.test_tempfs.TestTempFS) ... ok test_exists (tests.test_tempfs.TestTempFS) ... ok test_files (tests.test_tempfs.TestTempFS) ... ok test_filterdir (tests.test_tempfs.TestTempFS) ... ok test_getbytes (tests.test_tempfs.TestTempFS) ... ok test_getinfo (tests.test_tempfs.TestTempFS) ... ok test_getmeta (tests.test_tempfs.TestTempFS) ... ok test_getsize (tests.test_tempfs.TestTempFS) ... ok test_getsyspath (tests.test_tempfs.TestTempFS) ... ok test_gettext (tests.test_tempfs.TestTempFS) ... ok test_geturl (tests.test_tempfs.TestTempFS) ... ok test_invalid_chars (tests.test_tempfs.TestTempFS) ... ok test_isdir (tests.test_tempfs.TestTempFS) ... ok test_isempty (tests.test_tempfs.TestTempFS) ... ok test_isfile (tests.test_tempfs.TestTempFS) ... ok test_listdir (tests.test_tempfs.TestTempFS) ... ok test_makedir (tests.test_tempfs.TestTempFS) ... ok test_makedirs (tests.test_tempfs.TestTempFS) ... ok test_match (tests.test_tempfs.TestTempFS) ... ok test_move (tests.test_tempfs.TestTempFS) ... ok test_move_dir_mem (tests.test_tempfs.TestTempFS) ... ok test_move_dir_temp (tests.test_tempfs.TestTempFS) ... ok test_move_file_mem (tests.test_tempfs.TestTempFS) ... ok test_move_file_same_fs (tests.test_tempfs.TestTempFS) ... ok test_move_file_temp (tests.test_tempfs.TestTempFS) ... ok test_move_same_fs (tests.test_tempfs.TestTempFS) ... ok test_movedir (tests.test_tempfs.TestTempFS) ... ok test_not_exists (tests.test_tempfs.TestTempFS) ... ok test_open (tests.test_tempfs.TestTempFS) ... ok test_open_files (tests.test_tempfs.TestTempFS) ... ok test_openbin (tests.test_tempfs.TestTempFS) ... ok test_openbin_rw (tests.test_tempfs.TestTempFS) ... ok test_opendir (tests.test_tempfs.TestTempFS) ... ok test_remove (tests.test_tempfs.TestTempFS) ... ok test_removedir (tests.test_tempfs.TestTempFS) ... ok test_removetree (tests.test_tempfs.TestTempFS) ... ok test_scandir (tests.test_tempfs.TestTempFS) ... ok test_setbinfile (tests.test_tempfs.TestTempFS) ... ok test_setbytes (tests.test_tempfs.TestTempFS) ... ok test_setfile (tests.test_tempfs.TestTempFS) ... ok test_setinfo (tests.test_tempfs.TestTempFS) ... ok test_settext (tests.test_tempfs.TestTempFS) ... ok test_settimes (tests.test_tempfs.TestTempFS) ... ok test_touch (tests.test_tempfs.TestTempFS) ... ok test_tree (tests.test_tempfs.TestTempFS) ... ok test_unicode_paths (tests.test_tempfs.TestTempFS) ... ok test_datetime_to_epoch (tests.test_time.TestEpoch) ... ok test_epoch_to_datetime (tests.test_time.TestEpoch) ... ok test_remove_empty (tests.test_tools.TestTools) ... ok test_validate_open_mode (tests.test_tools.TestTools) ... ok test_validate_openbin_mode (tests.test_tools.TestTools) ... ok test_error (tests.test_tree.TestInfo) ... ok test_tree (tests.test_tree.TestInfo) ... ok test_tree_bytes_no_dirs_first (tests.test_tree.TestInfo) ... ok test_tree_encoding (tests.test_tree.TestInfo) ... ok test_broken (tests.test_walk.TestWalk) ... ok test_invalid (tests.test_walk.TestWalk) ... ok test_repr (tests.test_walk.TestWalk) ... ok test_walk (tests.test_walk.TestWalk) ... ok test_walk_dirs (tests.test_walk.TestWalk) ... ok test_walk_files (tests.test_walk.TestWalk) ... ok test_walk_info (tests.test_walk.TestWalk) ... ok test_create (tests.test_walk.TestWalker) ... ok test_repr (tests.test_walk.TestWalker) ... ok test_not_implemented (tests.test_walk.TestWalkerBase) ... ok test_get_matcher (tests.test_wildcard.TestFNMatch) ... ok test_match_any (tests.test_wildcard.TestFNMatch) ... ok test_wildcard (tests.test_wildcard.TestFNMatch) ... ok test_cachedir (tests.test_wrap.TestWrap) ... ok test_readonly (tests.test_wrap.TestWrap) ... ok test_encode (tests.test_wrapfs.TestWrapFS) ... ok test_repr (tests.test_wrapfs.TestWrapFS) ... ok test_str (tests.test_wrapfs.TestWrapFS) ... ok test_implied (tests.test_zipfs.TestDirsZipFS) Test zipfs creates intermediate directories. ... ok test_getinfo (tests.test_zipfs.TestReadZipFS) ... ok test_gets (tests.test_zipfs.TestReadZipFS) ... ok test_implied_dir (tests.test_zipfs.TestReadZipFS) ... ok test_listdir (tests.test_zipfs.TestReadZipFS) ... ok test_open (tests.test_zipfs.TestReadZipFS) ... ok test_readonly (tests.test_zipfs.TestReadZipFS) ... ok test_repr (tests.test_zipfs.TestReadZipFS) ... ok test_str (tests.test_zipfs.TestReadZipFS) ... ok test_walk_files (tests.test_zipfs.TestReadZipFS) ... ok test_getinfo (tests.test_zipfs.TestReadZipFSMem) ... ok test_gets (tests.test_zipfs.TestReadZipFSMem) ... ok test_implied_dir (tests.test_zipfs.TestReadZipFSMem) ... ok test_listdir (tests.test_zipfs.TestReadZipFSMem) ... ok test_open (tests.test_zipfs.TestReadZipFSMem) ... ok test_readonly (tests.test_zipfs.TestReadZipFSMem) ... ok test_repr (tests.test_zipfs.TestReadZipFSMem) ... ok test_str (tests.test_zipfs.TestReadZipFSMem) ... ok test_walk_files (tests.test_zipfs.TestReadZipFSMem) ... ok test_appendbytes (tests.test_zipfs.TestWriteZipFS) ... ok test_appendtext (tests.test_zipfs.TestWriteZipFS) ... ok test_basic (tests.test_zipfs.TestWriteZipFS) ... ok test_bin_files (tests.test_zipfs.TestWriteZipFS) ... ok test_close (tests.test_zipfs.TestWriteZipFS) ... ok test_copy (tests.test_zipfs.TestWriteZipFS) ... ok test_copy_dir_mem (tests.test_zipfs.TestWriteZipFS) ... ok test_copy_dir_temp (tests.test_zipfs.TestWriteZipFS) ... ok test_copy_file (tests.test_zipfs.TestWriteZipFS) ... ok test_copy_structure (tests.test_zipfs.TestWriteZipFS) ... ok test_copydir (tests.test_zipfs.TestWriteZipFS) ... ok test_create (tests.test_zipfs.TestWriteZipFS) ... ok test_desc (tests.test_zipfs.TestWriteZipFS) ... ok test_exists (tests.test_zipfs.TestWriteZipFS) ... ok test_files (tests.test_zipfs.TestWriteZipFS) ... ok test_filterdir (tests.test_zipfs.TestWriteZipFS) ... ok test_getbytes (tests.test_zipfs.TestWriteZipFS) ... ok test_getinfo (tests.test_zipfs.TestWriteZipFS) ... ok test_getmeta (tests.test_zipfs.TestWriteZipFS) ... ok test_getsize (tests.test_zipfs.TestWriteZipFS) ... ok test_getsyspath (tests.test_zipfs.TestWriteZipFS) ... ok test_gettext (tests.test_zipfs.TestWriteZipFS) ... ok test_geturl (tests.test_zipfs.TestWriteZipFS) ... ok test_invalid_chars (tests.test_zipfs.TestWriteZipFS) ... ok test_isdir (tests.test_zipfs.TestWriteZipFS) ... ok test_isempty (tests.test_zipfs.TestWriteZipFS) ... ok test_isfile (tests.test_zipfs.TestWriteZipFS) ... ok test_listdir (tests.test_zipfs.TestWriteZipFS) ... ok test_makedir (tests.test_zipfs.TestWriteZipFS) ... ok test_makedirs (tests.test_zipfs.TestWriteZipFS) ... ok test_match (tests.test_zipfs.TestWriteZipFS) ... ok test_move (tests.test_zipfs.TestWriteZipFS) ... ok test_move_dir_mem (tests.test_zipfs.TestWriteZipFS) ... ok test_move_dir_temp (tests.test_zipfs.TestWriteZipFS) ... ok test_move_file_mem (tests.test_zipfs.TestWriteZipFS) ... ok test_move_file_same_fs (tests.test_zipfs.TestWriteZipFS) ... ok test_move_file_temp (tests.test_zipfs.TestWriteZipFS) ... ok test_move_same_fs (tests.test_zipfs.TestWriteZipFS) ... ok test_movedir (tests.test_zipfs.TestWriteZipFS) ... ok test_open (tests.test_zipfs.TestWriteZipFS) ... ok test_open_files (tests.test_zipfs.TestWriteZipFS) ... ok test_openbin (tests.test_zipfs.TestWriteZipFS) ... ok test_openbin_rw (tests.test_zipfs.TestWriteZipFS) ... ok test_opendir (tests.test_zipfs.TestWriteZipFS) ... ok test_remove (tests.test_zipfs.TestWriteZipFS) ... ok test_removedir (tests.test_zipfs.TestWriteZipFS) ... ok test_removetree (tests.test_zipfs.TestWriteZipFS) ... ok test_scandir (tests.test_zipfs.TestWriteZipFS) ... ok test_setbinfile (tests.test_zipfs.TestWriteZipFS) ... ok test_setbytes (tests.test_zipfs.TestWriteZipFS) ... ok test_setfile (tests.test_zipfs.TestWriteZipFS) ... ok test_setinfo (tests.test_zipfs.TestWriteZipFS) ... ok test_settext (tests.test_zipfs.TestWriteZipFS) ... ok test_settimes (tests.test_zipfs.TestWriteZipFS) ... ok test_touch (tests.test_zipfs.TestWriteZipFS) ... ok test_tree (tests.test_zipfs.TestWriteZipFS) ... ok ====================================================================== FAIL: test_decode_linux (tests.test_ftp_parse.TestFTPParse) ---------------------------------------------------------------------- Traceback (most recent call last): File "/tmp/B.uxufNp/BUILD/fs-2.0.2/tests/test_ftp_parse.py", line 104, in test_decode_linux self.assertEqual(parsed, expected) AssertionError: Lists differ: [{u'access': {u'group': u'0', ... != [{u'access': {u'group': u'0', ... First differing element 1: {u'access': {u'group': u'0', u'user': u'0', u'permissions': [u'g_r', u'g_x', u'o_r', u'o_x', u'u_r', u'u_w', u'u_x']}, u'ftp': {u'ls': u'drwxr-xr-x 10 0 0 4096 Aug 03 09:21 debian-archive'}, u'details': {u'type': 1, u'modified': 1533288060.0, u'size': 4096}, u'basic': {u'is_dir': True, u'name': u'debian-archive'}} {u'access': {u'group': u'0', u'user': u'0', u'permissions': [u'g_r', u'g_x', u'o_r', u'o_x', u'u_r', u'u_w', u'u_x']}, u'ftp': {u'ls': u'drwxr-xr-x 10 0 0 4096 Aug 03 09:21 debian-archive'}, u'details': {u'type': 1, u'modified': 1501752060.0, u'size': 4096}, u'basic': {u'is_dir': True, u'name': u'debian-archive'}} Diff is 3157 characters long. Set self.maxDiff to None to see it. ====================================================================== FAIL: test_parse_time (tests.test_ftp_parse.TestFTPParse) ---------------------------------------------------------------------- Traceback (most recent call last): File "/tmp/B.uxufNp/BUILD/fs-2.0.2/tests/test_ftp_parse.py", line 21, in test_parse_time 1499220000.0 AssertionError: 1530756000.0 != 1499220000.0 ---------------------------------------------------------------------- Ran 1080 tests in 68.974s FAILED (failures=2, skipped=56) Test failed: <unittest.runner.TextTestResult run=1080 errors=0 failures=2> error: Test failed: <unittest.runner.TextTestResult run=1080 errors=0 failures=2> error: Bad exit status from /tmp/B.uxufNp/BUILD/tmp/rpm-tmp.83374 (%build) RPM build errors: Bad exit status from /tmp/B.uxufNp/BUILD/tmp/rpm-tmp.83374 (%build) ended at: Tue Jul 3 18:17:32 2018, done in 0:01:10.878554 error: No files produced. mesg: ttyname failed: Inappropriate ioctl for device + chmod -R u+rwX /tmp/B.uxufNp/BUILD + rm -rf /tmp/B.uxufNp/tmp /tmp/B.uxufNp/BUILD mesg: ttyname failed: Inappropriate ioctl for device + rm -rf /tmp/B.uxufNp Begin-PLD-Builder-Info Build-Time: user:69.84s sys:10.32s real:86.20s (faults io:0 non-io:1506537) End-PLD-Builder-Info
[Back to list of logs] [View rpm -qa of builder]