FailedOk

th/SRPMS[OK]
th/x32[OK]
th/i686[OK]
th/x86_64[OK]

ac/SRPMS[OK]
ac/i386[OK]
ac/i586[OK]
ac/i686[OK]
ac/alpha[OK]
ac/amd64[OK]
ac/athlon[OK]
ac/ppc[OK]
ac/sparc[OK]
ac/sparc64[OK]

Advanced Search
main()
Powered by PLD Linux
(c) 2002-2018 PLD Team
$Revision: 1.37 $
Powered by Real Operating System.
Your IP: 54.221.75.115

python-pylint-django 2c170c95-eefd-4d20-bc01-1095146de7c1

Status:Failed
Source URL:ftp://buildlogs.pld-linux.org/th/x86_64/FAIL/python-pylint-django,2c170c95-eefd-4d20-bc01-1095146de7c1.bz2
text/plain URL:View!
full text:View!
rpm -qa of builder:View!
Date:2018/07/03 18:30:47
Runtime:0:00:02.423168

Toc:

  • error 1
  • rpm: error: Failed build dependencies:
  • error 2
  • rpm: error: Failed build dependencies:
  • prep
  • Executing(%prep): /bin/sh -e /tmp/B.t8CuB_/BUILD/tmp/rpm-tmp.16484
  • build
  • Executing(%build): /bin/sh -e /tmp/B.t8CuB_/BUILD/tmp/rpm-tmp.16484
  • error 3
  • ERROR: pylint_django (unittest.loader._FailedTest)
  • error 4
  • ImportError: Failed to import test module: pylint_django
  • error 5
  • ImportError: cannot import name 'UnknownMessage' from 'pylint.utils' (/usr/share/python3.7/site-packages/pylint/utils.py)
  • error 6
  • error: Test failed: <unittest.runner.TextTestResult run=1 errors=1 failures=0>
  • error 7
  • error: Bad exit status from /tmp/B.t8CuB_/BUILD/tmp/rpm-tmp.16484 (%build)
  • error 8
  • RPM build errors:
  • error 9
  • error: No files produced.

Content:

checking if we should skip the build
started at: Tue Jul  3 18:30:27 2018
killing old processes on a builder
mesg: ttyname failed: Inappropriate ioctl for device
sending signal 9 to pid -1
Killed
cleaning up /tmp
mesg: ttyname failed: Inappropriate ioctl for device
fetching https://srcbuilder.pld-linux.org/th//srpms/2c170c95-eefd-4d20-bc01-1095146de7c1/python-pylint-django-0.7.1-4.src.rpm
fetched 23281 bytes, 62.8 K/s
installing srpm: python-pylint-django-0.7.1-4.src.rpm
mesg: ttyname failed: Inappropriate ioctl for device
+ install -d /tmp/B.t8CuB_/BUILD /tmp/B.t8CuB_/RPMS
+ LC_ALL=en_US.UTF-8
+ rpm -qp --changelog python-pylint-django-0.7.1-4.src.rpm
* Tue Jul 03 2018 PLD Linux Team <feedback@pld-linux.org>
- For complete changelog see: http://git.pld-linux.org/?p=packages/python-pylint-django.git;a=log;h=auto/th/python-pylint-django-0.7.1-4
* Tue Jul 03 2018 Arkadiusz Miƛkiewicz <arekm@maven.pl> 29e33ca
- release 4 (by relup.sh) + rpm -Uhv --nodeps --define '_topdir /tmp/B.t8CuB_' --define '_specdir %{_topdir}' --define '_sourcedir %{_specdir}' --define '_rpmdir %{_topdir}/RPMS' --define '_builddir %{_topdir}/BUILD' python-pylint-django-0.7.1-4.src.rpm Preparing... ################################################## python-pylint-django ################################################## + rm -f python-pylint-django-0.7.1-4.src.rpm mesg: ttyname failed: Inappropriate ioctl for device + install -m 700 -d /tmp/B.t8CuB_/BUILD/tmp mesg: ttyname failed: Inappropriate ioctl for device + TMPDIR=/tmp/B.t8CuB_/BUILD/tmp + exec nice -n 0 rpmbuild -bp --short-circuit --nodeps --define '_topdir /tmp/B.t8CuB_' --define '_specdir %{_topdir}' --define '_sourcedir %{_specdir}' --define '_rpmdir %{_topdir}/RPMS' --define '_builddir %{_topdir}/BUILD' --target x86_64-pld-linux --define 'prep exit 0' /tmp/B.t8CuB_/python-pylint-django.spec Building target platforms: x86_64-pld-linux checking BuildConflict-ing packages no BuildConflicts found checking BR rpm: error: Failed build dependencies: rpm: python-pylint-plugin-utils is needed by python-pylint-django-0.7.1-4.src rpm: python3-pylint-plugin-utils is needed by python-pylint-django-0.7.1-4.src rpm: Building target platforms: x86_64-pld-linux updating poldek cache... ready is up to date Retrieving th::packages.ndir.md... th is up to date Retrieving th::packages.ndir.md... th is up to date Retrieving th-ready::packages.ndir.md... th-ready is up to date Retrieving th-ready::packages.ndir.md... th-ready is up to date Retrieving th-test::packages.ndir.md... Retrieving th-test::packages.ndir.diff.toc.gz... ..............................done Retrieving diff::packages.ndir.2018.07.03-16.16.01.gz... ..............................done Retrieving diff::packages.ndir.dscr.2018.07.03-16.16.01.gz... Loading [pndir]th-test... Applying packages.ndir.2018.07.03-16.16.01.gz... Retrieving diff::packages.ndir.2018.07.03-16.19.02.gz... ..............................done Retrieving diff::packages.ndir.dscr.2018.07.03-16.19.02.gz... Applying packages.ndir.2018.07.03-16.19.02.gz... Retrieving diff::packages.ndir.2018.07.03-16.20.01.gz... Retrieving diff::packages.ndir.dscr.2018.07.03-16.20.01.gz... Applying packages.ndir.2018.07.03-16.20.01.gz... Retrieving diff::packages.ndir.2018.07.03-16.24.01.gz... ..............................done Retrieving diff::packages.ndir.dscr.2018.07.03-16.24.01.gz... Applying packages.ndir.2018.07.03-16.24.01.gz... Writing /root/.poldek-cache/[...]/packages.ndir.gz... Retrieving th-test::packages.ndir.md... th-test is up to date checking conflicting packages in BRed packages poldek: Loading [pndir]ready... poldek: Loading [pndir]th-test... poldek: Loading [pndir]th-test... poldek: Loading [pndir]th-ready... poldek: Loading [pndir]th-ready... poldek: Loading [pndir]th... poldek: Loading [pndir]th... poldek: 30608 packages read poldek: Removed 3647 duplicate packages from available set poldek: Processing dependencies... poldek: python3-pylint-plugin-utils-0.2.3-3.noarch marks python3-pylint-1.8.2-2.noarch (cap python3egg(pylint)) poldek: There are 3 packages to install (1 marked by dependencies): poldek: I python-pylint-plugin-utils-0.2.3-3.noarch poldek: I python3-pylint-plugin-utils-0.2.3-3.noarch poldek: D python3-pylint-1.8.2-2.noarch poldek: This operation will use 3.1MB of disk space. poldek: Need to get 627.6KB of archives. poldek: Executing pm-command.sh --upgrade -vh --test --root / --define _check_dirname_deps 1... poldek: Preparing... ################################################## no conflicts found checking BR rpm: error: Failed build dependencies: rpm: python-pylint-plugin-utils is needed by python-pylint-django-0.7.1-4.src rpm: python3-pylint-plugin-utils is needed by python-pylint-django-0.7.1-4.src rpm: Building target platforms: x86_64-pld-linux installing BR: python3\-pylint\-plugin\-utils python\-pylint\-plugin\-utils + poldek --noask --caplookup -Q -v '--ignore=hhvm-*' '--ignore=php4-*' '--ignore=php52-*' '--ignore=php54-*' '--ignore=php55-*' '--ignore=php56-*' '--ignore=php70-*' '--ignore=php71-*' '--ignore=php72-*' --upgrade python3-pylint-plugin-utils python-pylint-plugin-utils Loading [pndir]ready... Loading [pndir]th-test... Loading [pndir]th-test... Loading [pndir]th-ready... Loading [pndir]th-ready... Loading [pndir]th... Loading [pndir]th... 30608 packages read Removed 3647 duplicate packages from available set Processing dependencies... python3-pylint-plugin-utils-0.2.3-3.noarch marks python3-pylint-1.8.2-2.noarch (cap python3egg(pylint)) There are 3 packages to install (1 marked by dependencies): I python-pylint-plugin-utils-0.2.3-3.noarch I python3-pylint-plugin-utils-0.2.3-3.noarch D python3-pylint-1.8.2-2.noarch This operation will use 3.1MB of disk space. Need to get 627.6KB of archives. Executing pm-command.sh --upgrade -vh --root / --define _check_dirname_deps 1... Preparing... ################################################## python3-pylint ################################################## python-pylint-plugin-utils ################################################## python3-pylint-plugin-utils ################################################## building RPM using: set -ex; : build-id: 2c170c95-eefd-4d20-bc01-1095146de7c1; TMPDIR=/tmp/B.t8CuB_/BUILD/tmp exec nice -n 0 rpmbuild -bb --define '_smp_mflags -j9' --define '_make_opts -Otarget' --define '_pld_builder 1' --define '_topdir /tmp/B.t8CuB_' --define '_specdir %{_topdir}' --define '_sourcedir %{_specdir}' --define '_rpmdir %{_topdir}/RPMS' --define '_builddir %{_topdir}/BUILD' --target x86_64-pld-linux /tmp/B.t8CuB_/python-pylint-django.spec mesg: ttyname failed: Inappropriate ioctl for device + : build-id: 2c170c95-eefd-4d20-bc01-1095146de7c1 + TMPDIR=/tmp/B.t8CuB_/BUILD/tmp + exec nice -n 0 rpmbuild -bb --define '_smp_mflags -j9' --define '_make_opts -Otarget' --define '_pld_builder 1' --define '_topdir /tmp/B.t8CuB_' --define '_specdir %{_topdir}' --define '_sourcedir %{_specdir}' --define '_rpmdir %{_topdir}/RPMS' --define '_builddir %{_topdir}/BUILD' --target x86_64-pld-linux /tmp/B.t8CuB_/python-pylint-django.spec Building target platforms: x86_64-pld-linux Executing(%prep): /bin/sh -e /tmp/B.t8CuB_/BUILD/tmp/rpm-tmp.16484 + umask 022 + cd /tmp/B.t8CuB_/BUILD + cd /tmp/B.t8CuB_/BUILD + rm -rf pylint-django-0.7.1 + /usr/bin/gzip -dc /tmp/B.t8CuB_/pylint-django-0.7.1.tar.gz + /bin/tar -xf - + STATUS=0 + '[' 0 -ne 0 ']' + cd pylint-django-0.7.1 + /bin/id -u + '[' 1000 '=' 0 ']' + /bin/id -u + '[' 1000 '=' 0 ']' + /bin/chmod -Rf a+rX,u+w,g-w,o-w . + exit 0 Executing(%build): /bin/sh -e /tmp/B.t8CuB_/BUILD/tmp/rpm-tmp.16484 TMP=/home/users/builder/tmp HOME=/home/users/builder PATH=/home/users/builder/GNUstep/Tools:/usr/local/bin:/usr/bin:/bin:/home/users/builder/bin TMPDIR=/tmp/B.t8CuB_/BUILD/tmp + umask 022 + cd /tmp/B.t8CuB_/BUILD + cd pylint-django-0.7.1 + LDFLAGS='-Wl,--as-needed -Wl,--no-copy-dt-needed-entries -Wl,-z,relro -Wl,-z,combreloc ' + export LDFLAGS + CFLAGS=' -O2 -fwrapv -pipe -Wformat -Werror=format-security -gdwarf-4 -fno-debug-types-section -fvar-tracking-assignments -g2 -Wp,-D_FORTIFY_SOURCE=2 -fstack-protector-strong --param=ssp-buffer-size=4 -fPIC -march=x86-64 -gdwarf-4 -fno-debug-types-section -fvar-tracking-assignments -g2 ' + export CFLAGS + CXXFLAGS=' -O2 -fwrapv -pipe -Wformat -Werror=format-security -gdwarf-4 -fno-debug-types-section -fvar-tracking-assignments -g2 -Wp,-D_FORTIFY_SOURCE=2 -fstack-protector-strong --param=ssp-buffer-size=4 -fPIC -march=x86-64 -gdwarf-4 -fno-debug-types-section -fvar-tracking-assignments -g2 ' + export CXXFLAGS + CC=x86_64-pld-linux-gcc + export CC + CXX=x86_64-pld-linux-g++ + export CXX + /usr/bin/python2 setup.py build '--build-base=build-2' test running build running build_py creating build-2 creating build-2/lib creating build-2/lib/pylint_django copying pylint_django/__pkginfo__.py -> build-2/lib/pylint_django copying pylint_django/__init__.py -> build-2/lib/pylint_django copying pylint_django/compat.py -> build-2/lib/pylint_django copying pylint_django/plugin.py -> build-2/lib/pylint_django copying pylint_django/utils.py -> build-2/lib/pylint_django creating build-2/lib/pylint_django/checkers copying pylint_django/checkers/models.py -> build-2/lib/pylint_django/checkers copying pylint_django/checkers/__init__.py -> build-2/lib/pylint_django/checkers copying pylint_django/checkers/django_installed.py -> build-2/lib/pylint_django/checkers creating build-2/lib/pylint_django/augmentations copying pylint_django/augmentations/__init__.py -> build-2/lib/pylint_django/augmentations creating build-2/lib/pylint_django/transforms copying pylint_django/transforms/__init__.py -> build-2/lib/pylint_django/transforms copying pylint_django/transforms/fields.py -> build-2/lib/pylint_django/transforms copying pylint_django/transforms/foreignkey.py -> build-2/lib/pylint_django/transforms creating build-2/lib/pylint_django/transforms/transforms copying pylint_django/transforms/transforms/django_core_handlers_wsgi.py -> build-2/lib/pylint_django/transforms/transforms copying pylint_django/transforms/transforms/django_views_generic_base.py -> build-2/lib/pylint_django/transforms/transforms copying pylint_django/transforms/transforms/django_forms_fields.py -> build-2/lib/pylint_django/transforms/transforms copying pylint_django/transforms/transforms/django_db_models_fields.py -> build-2/lib/pylint_django/transforms/transforms copying pylint_django/transforms/transforms/django_utils_translation.py -> build-2/lib/pylint_django/transforms/transforms copying pylint_django/transforms/transforms/django_db_models.py -> build-2/lib/pylint_django/transforms/transforms copying pylint_django/transforms/transforms/django_db_models_fields_files.py -> build-2/lib/pylint_django/transforms/transforms copying pylint_django/transforms/transforms/django_forms.py -> build-2/lib/pylint_django/transforms/transforms running test running egg_info writing requirements to pylint_django.egg-info/requires.txt writing pylint_django.egg-info/PKG-INFO writing top-level names to pylint_django.egg-info/top_level.txt writing dependency_links to pylint_django.egg-info/dependency_links.txt reading manifest file 'pylint_django.egg-info/SOURCES.txt' reading manifest template 'MANIFEST.in' writing manifest file 'pylint_django.egg-info/SOURCES.txt' running build_ext ---------------------------------------------------------------------- Ran 0 tests in 0.000s OK + LDFLAGS='-Wl,--as-needed -Wl,--no-copy-dt-needed-entries -Wl,-z,relro -Wl,-z,combreloc ' + export LDFLAGS + CFLAGS=' -O2 -fwrapv -pipe -Wformat -Werror=format-security -gdwarf-4 -fno-debug-types-section -fvar-tracking-assignments -g2 -Wp,-D_FORTIFY_SOURCE=2 -fstack-protector-strong --param=ssp-buffer-size=4 -fPIC -march=x86-64 -gdwarf-4 -fno-debug-types-section -fvar-tracking-assignments -g2 ' + export CFLAGS + CXXFLAGS=' -O2 -fwrapv -pipe -Wformat -Werror=format-security -gdwarf-4 -fno-debug-types-section -fvar-tracking-assignments -g2 -Wp,-D_FORTIFY_SOURCE=2 -fstack-protector-strong --param=ssp-buffer-size=4 -fPIC -march=x86-64 -gdwarf-4 -fno-debug-types-section -fvar-tracking-assignments -g2 ' + export CXXFLAGS + CC=x86_64-pld-linux-gcc + export CC + CXX=x86_64-pld-linux-g++ + export CXX + /usr/bin/python3 setup.py build '--build-base=build-3' test Warning: 'classifiers' should be a list, got type 'tuple' running build running build_py creating build-3 creating build-3/lib creating build-3/lib/pylint_django copying pylint_django/__pkginfo__.py -> build-3/lib/pylint_django copying pylint_django/__init__.py -> build-3/lib/pylint_django copying pylint_django/compat.py -> build-3/lib/pylint_django copying pylint_django/plugin.py -> build-3/lib/pylint_django copying pylint_django/utils.py -> build-3/lib/pylint_django creating build-3/lib/pylint_django/checkers copying pylint_django/checkers/models.py -> build-3/lib/pylint_django/checkers copying pylint_django/checkers/__init__.py -> build-3/lib/pylint_django/checkers copying pylint_django/checkers/django_installed.py -> build-3/lib/pylint_django/checkers creating build-3/lib/pylint_django/augmentations copying pylint_django/augmentations/__init__.py -> build-3/lib/pylint_django/augmentations creating build-3/lib/pylint_django/transforms copying pylint_django/transforms/__init__.py -> build-3/lib/pylint_django/transforms copying pylint_django/transforms/fields.py -> build-3/lib/pylint_django/transforms copying pylint_django/transforms/foreignkey.py -> build-3/lib/pylint_django/transforms creating build-3/lib/pylint_django/transforms/transforms copying pylint_django/transforms/transforms/django_core_handlers_wsgi.py -> build-3/lib/pylint_django/transforms/transforms copying pylint_django/transforms/transforms/django_views_generic_base.py -> build-3/lib/pylint_django/transforms/transforms copying pylint_django/transforms/transforms/django_forms_fields.py -> build-3/lib/pylint_django/transforms/transforms copying pylint_django/transforms/transforms/django_db_models_fields.py -> build-3/lib/pylint_django/transforms/transforms copying pylint_django/transforms/transforms/django_utils_translation.py -> build-3/lib/pylint_django/transforms/transforms copying pylint_django/transforms/transforms/django_db_models.py -> build-3/lib/pylint_django/transforms/transforms copying pylint_django/transforms/transforms/django_db_models_fields_files.py -> build-3/lib/pylint_django/transforms/transforms copying pylint_django/transforms/transforms/django_forms.py -> build-3/lib/pylint_django/transforms/transforms running test running egg_info writing pylint_django.egg-info/PKG-INFO writing dependency_links to pylint_django.egg-info/dependency_links.txt writing requirements to pylint_django.egg-info/requires.txt writing top-level names to pylint_django.egg-info/top_level.txt reading manifest file 'pylint_django.egg-info/SOURCES.txt' reading manifest template 'MANIFEST.in' writing manifest file 'pylint_django.egg-info/SOURCES.txt' running build_ext pylint_django (unittest.loader._FailedTest) ... ERROR ====================================================================== ERROR: pylint_django (unittest.loader._FailedTest) ---------------------------------------------------------------------- ImportError: Failed to import test module: pylint_django Traceback (most recent call last): File "/usr/lib64/python3.7/unittest/loader.py", line 468, in _find_test_path package = self._get_module_from_name(name) File "/usr/lib64/python3.7/unittest/loader.py", line 375, in _get_module_from_name __import__(name) File "/tmp/B.t8CuB_/BUILD/pylint-django-0.7.1/pylint_django/__init__.py", line 3, in <module> from pylint_django import plugin File "/tmp/B.t8CuB_/BUILD/pylint-django-0.7.1/pylint_django/plugin.py", line 3, in <module> from pylint_django.augmentations import apply_augmentations File "/tmp/B.t8CuB_/BUILD/pylint-django-0.7.1/pylint_django/augmentations/__init__.py", line 15, in <module> from pylint_plugin_utils import augment_visit, suppress_message File "/usr/share/python3.7/site-packages/pylint_plugin_utils/__init__.py", line 2, in <module> from pylint.utils import UnknownMessage ImportError: cannot import name 'UnknownMessage' from 'pylint.utils' (/usr/share/python3.7/site-packages/pylint/utils.py) ---------------------------------------------------------------------- Ran 1 test in 0.000s FAILED (errors=1) Test failed: <unittest.runner.TextTestResult run=1 errors=1 failures=0> error: Test failed: <unittest.runner.TextTestResult run=1 errors=1 failures=0> error: Bad exit status from /tmp/B.t8CuB_/BUILD/tmp/rpm-tmp.16484 (%build) RPM build errors: Bad exit status from /tmp/B.t8CuB_/BUILD/tmp/rpm-tmp.16484 (%build) ended at: Tue Jul 3 18:30:47 2018, done in 0:00:02.423168 error: No files produced. mesg: ttyname failed: Inappropriate ioctl for device + chmod -R u+rwX /tmp/B.t8CuB_/BUILD + rm -rf /tmp/B.t8CuB_/tmp /tmp/B.t8CuB_/BUILD mesg: ttyname failed: Inappropriate ioctl for device + rm -rf /tmp/B.t8CuB_ Begin-PLD-Builder-Info Build-Time: user:10.40s sys:1.69s real:20.83s (faults io:3 non-io:442864) End-PLD-Builder-Info
[Back to list of logs] [View rpm -qa of builder]