FailedOk

th/SRPMS[OK]
th/x32[OK]
th/i686[OK]
th/x86_64[OK]

ac/SRPMS[OK]
ac/i386[OK]
ac/i586[OK]
ac/i686[OK]
ac/alpha[OK]
ac/amd64[OK]
ac/athlon[OK]
ac/ppc[OK]
ac/sparc[OK]
ac/sparc64[OK]

Advanced Search
main()
Powered by PLD Linux
(c) 2002-2018 PLD Team
$Revision: 1.37 $
Powered by synergy.
Your IP: 54.158.52.166

python-xdis 053b41dc-fc9d-4322-a8c2-3d0e97f102cf

Status:Failed
Source URL:ftp://buildlogs.pld-linux.org/th/x86_64/FAIL/python-xdis,053b41dc-fc9d-4322-a8c2-3d0e97f102cf.bz2
text/plain URL:View!
rpm -qa of builder:View!
Date:2018/07/03 17:50:35
Runtime:0:00:03.198232

Toc:

  • prep
  • Executing(%prep): /bin/sh -e /tmp/B.YI7e_n/BUILD/tmp/rpm-tmp.96784
  • build
  • Executing(%build): /bin/sh -e /tmp/B.YI7e_n/BUILD/tmp/rpm-tmp.96784
  • error 1
  • ERROR: test_big_linenos (test_dis.DisTests)
  • error 2
  • IndexError: tuple index out of range
  • error 3
  • ERROR: test_basic (test_load.TestLoad)
  • error 4
  • KeyError: b'B\r\r\n'
  • error 5
  • TypeError: ord() expected string of length 1, but int found
  • error 6
  • ERROR: test_basic (test_magic.TestOpcodes)
  • error 7
  • KeyError: b'B\r\r\n'
  • error 8
  • FAIL: test_basic (test_opcode.TestOpcodes)
  • error 9
  • AssertionError: 'Python version 3.7 is not something I know about' is not false
  • error 10
  • error: Test failed: <unittest.runner.TextTestResult run=8 errors=3 failures=1>
  • error 11
  • error: Bad exit status from /tmp/B.YI7e_n/BUILD/tmp/rpm-tmp.96784 (%build)
  • error 12
  • RPM build errors:
  • error 13
  • error: No files produced.

Content:

request from: arekm
checking if we should skip the build
started at: Tue Jul  3 17:50:29 2018
killing old processes on a builder
mesg: ttyname failed: Inappropriate ioctl for device
sending signal 9 to pid -1
Killed
cleaning up /tmp
mesg: ttyname failed: Inappropriate ioctl for device
fetching https://srcbuilder.pld-linux.org/th//srpms/053b41dc-fc9d-4322-a8c2-3d0e97f102cf/python-xdis-1.1.7-3.src.rpm
fetched 68624 bytes, 150.4 K/s
installing srpm: python-xdis-1.1.7-3.src.rpm
mesg: ttyname failed: Inappropriate ioctl for device
+ install -d /tmp/B.YI7e_n/BUILD /tmp/B.YI7e_n/RPMS
+ LC_ALL=en_US.UTF-8
+ rpm -qp --changelog python-xdis-1.1.7-3.src.rpm
* Tue Jul 03 2018 PLD Linux Team <feedback@pld-linux.org>
- For complete changelog see: http://git.pld-linux.org/?p=packages/python-xdis.git;a=log;h=master
* Tue Jul 03 2018 Arkadiusz Miƛkiewicz <arekm@maven.pl> 4e9442a
- release 3 (by relup.sh) + rpm -Uhv --nodeps --define '_topdir /tmp/B.YI7e_n' --define '_specdir %{_topdir}' --define '_sourcedir %{_specdir}' --define '_rpmdir %{_topdir}/RPMS' --define '_builddir %{_topdir}/BUILD' python-xdis-1.1.7-3.src.rpm Preparing... ################################################## python-xdis ################################################## + rm -f python-xdis-1.1.7-3.src.rpm mesg: ttyname failed: Inappropriate ioctl for device + install -m 700 -d /tmp/B.YI7e_n/BUILD/tmp mesg: ttyname failed: Inappropriate ioctl for device + TMPDIR=/tmp/B.YI7e_n/BUILD/tmp + exec nice -n 0 rpmbuild -bp --short-circuit --nodeps --define '_topdir /tmp/B.YI7e_n' --define '_specdir %{_topdir}' --define '_sourcedir %{_specdir}' --define '_rpmdir %{_topdir}/RPMS' --define '_builddir %{_topdir}/BUILD' --target x86_64-pld-linux --define 'prep exit 0' /tmp/B.YI7e_n/python-xdis.spec Building target platforms: x86_64-pld-linux checking BuildConflict-ing packages no BuildConflicts found checking BR rpm: Building target platforms: x86_64-pld-linux no BR needed building RPM using: set -ex; : build-id: 053b41dc-fc9d-4322-a8c2-3d0e97f102cf; TMPDIR=/tmp/B.YI7e_n/BUILD/tmp exec nice -n 0 rpmbuild -bb --define '_smp_mflags -j9' --define '_make_opts -Otarget' --define '_pld_builder 1' --define '_topdir /tmp/B.YI7e_n' --define '_specdir %{_topdir}' --define '_sourcedir %{_specdir}' --define '_rpmdir %{_topdir}/RPMS' --define '_builddir %{_topdir}/BUILD' --target x86_64-pld-linux /tmp/B.YI7e_n/python-xdis.spec mesg: ttyname failed: Inappropriate ioctl for device + : build-id: 053b41dc-fc9d-4322-a8c2-3d0e97f102cf + TMPDIR=/tmp/B.YI7e_n/BUILD/tmp + exec nice -n 0 rpmbuild -bb --define '_smp_mflags -j9' --define '_make_opts -Otarget' --define '_pld_builder 1' --define '_topdir /tmp/B.YI7e_n' --define '_specdir %{_topdir}' --define '_sourcedir %{_specdir}' --define '_rpmdir %{_topdir}/RPMS' --define '_builddir %{_topdir}/BUILD' --target x86_64-pld-linux /tmp/B.YI7e_n/python-xdis.spec Building target platforms: x86_64-pld-linux Executing(%prep): /bin/sh -e /tmp/B.YI7e_n/BUILD/tmp/rpm-tmp.96784 + umask 022 + cd /tmp/B.YI7e_n/BUILD + cd /tmp/B.YI7e_n/BUILD + rm -rf xdis-1.1.7 + /usr/bin/gzip -dc /tmp/B.YI7e_n/xdis-1.1.7.tar.gz + /bin/tar -xf - + STATUS=0 + '[' 0 -ne 0 ']' + cd xdis-1.1.7 + /bin/id -u + '[' 1000 '=' 0 ']' + /bin/id -u + '[' 1000 '=' 0 ']' + /bin/chmod -Rf a+rX,u+w,g-w,o-w . + /bin/rm '--interactive=never' -r xdis.egg-info + exit 0 Executing(%build): /bin/sh -e /tmp/B.YI7e_n/BUILD/tmp/rpm-tmp.96784 TMP=/home/users/builder/tmp HOME=/home/users/builder PATH=/home/users/builder/GNUstep/Tools:/usr/local/bin:/usr/bin:/bin:/home/users/builder/bin TMPDIR=/tmp/B.YI7e_n/BUILD/tmp + umask 022 + cd /tmp/B.YI7e_n/BUILD + cd xdis-1.1.7 + LDFLAGS='-Wl,--as-needed -Wl,--no-copy-dt-needed-entries -Wl,-z,relro -Wl,-z,combreloc ' + export LDFLAGS + CFLAGS=' -O2 -fwrapv -pipe -Wformat -Werror=format-security -gdwarf-4 -fno-debug-types-section -fvar-tracking-assignments -g2 -Wp,-D_FORTIFY_SOURCE=2 -fstack-protector-strong --param=ssp-buffer-size=4 -fPIC -march=x86-64 -gdwarf-4 -fno-debug-types-section -fvar-tracking-assignments -g2 ' + export CFLAGS + CXXFLAGS=' -O2 -fwrapv -pipe -Wformat -Werror=format-security -gdwarf-4 -fno-debug-types-section -fvar-tracking-assignments -g2 -Wp,-D_FORTIFY_SOURCE=2 -fstack-protector-strong --param=ssp-buffer-size=4 -fPIC -march=x86-64 -gdwarf-4 -fno-debug-types-section -fvar-tracking-assignments -g2 ' + export CXXFLAGS + CC=x86_64-pld-linux-gcc + export CC + CXX=x86_64-pld-linux-g++ + export CXX + /usr/bin/python2 setup.py build '--build-base=build-2' test running build running build_py creating build-2 creating build-2/lib creating build-2/lib/xdis copying xdis/__init__.py -> build-2/lib/xdis copying xdis/marsh.py -> build-2/lib/xdis copying xdis/code.py -> build-2/lib/xdis copying xdis/main.py -> build-2/lib/xdis copying xdis/version.py -> build-2/lib/xdis copying xdis/load.py -> build-2/lib/xdis copying xdis/unmarshal.py -> build-2/lib/xdis copying xdis/magics.py -> build-2/lib/xdis copying xdis/verify.py -> build-2/lib/xdis copying xdis/util.py -> build-2/lib/xdis copying xdis/bytecode.py -> build-2/lib/xdis creating build-2/lib/xdis/opcodes copying xdis/opcodes/opcode_30.py -> build-2/lib/xdis/opcodes copying xdis/opcodes/__init__.py -> build-2/lib/xdis/opcodes copying xdis/opcodes/opcode_3x.py -> build-2/lib/xdis/opcodes copying xdis/opcodes/opcode_33.py -> build-2/lib/xdis/opcodes copying xdis/opcodes/opcode_25.py -> build-2/lib/xdis/opcodes copying xdis/opcodes/opcode_35.py -> build-2/lib/xdis/opcodes copying xdis/opcodes/opcode_26.py -> build-2/lib/xdis/opcodes copying xdis/opcodes/opcode_27.py -> build-2/lib/xdis/opcodes copying xdis/opcodes/opcode_pypy26.py -> build-2/lib/xdis/opcodes copying xdis/opcodes/opcode_32.py -> build-2/lib/xdis/opcodes copying xdis/opcodes/opcode_31.py -> build-2/lib/xdis/opcodes copying xdis/opcodes/opcode_24.py -> build-2/lib/xdis/opcodes copying xdis/opcodes/opcode_23.py -> build-2/lib/xdis/opcodes copying xdis/opcodes/opcode_34.py -> build-2/lib/xdis/opcodes copying xdis/opcodes/opcode_pypy27.py -> build-2/lib/xdis/opcodes copying xdis/opcodes/opcode_2x.py -> build-2/lib/xdis/opcodes creating build-2/lib/xdis/bin copying xdis/bin/__init__.py -> build-2/lib/xdis/bin copying xdis/bin/pydisassemble.py -> build-2/lib/xdis/bin running test running egg_info creating xdis.egg-info writing xdis.egg-info/PKG-INFO writing top-level names to xdis.egg-info/top_level.txt writing dependency_links to xdis.egg-info/dependency_links.txt writing entry points to xdis.egg-info/entry_points.txt writing manifest file 'xdis.egg-info/SOURCES.txt' reading manifest file 'xdis.egg-info/SOURCES.txt' reading manifest template 'MANIFEST.in' writing manifest file 'xdis.egg-info/SOURCES.txt' running build_ext test_big_linenos (test_dis.DisTests) ... ok test_boundaries (test_dis.DisTests) ... ok test_opmap (test_dis.DisTests) ... ok test_opname (test_dis.DisTests) ... ok test_basic (test_load.TestLoad) Basic test of load_file, check_object_path and load_module ... ok test_basic (test_magic.TestOpcodes) Basic test of magic numbers ... ok test_basic (test_marsh.TestMarshal) Tests xdis.load.load_module ... ok test_basic (test_opcode.TestOpcodes) Basic test that opcodes match native installed opcodes ... ok ---------------------------------------------------------------------- Ran 8 tests in 0.223s OK + LDFLAGS='-Wl,--as-needed -Wl,--no-copy-dt-needed-entries -Wl,-z,relro -Wl,-z,combreloc ' + export LDFLAGS + CFLAGS=' -O2 -fwrapv -pipe -Wformat -Werror=format-security -gdwarf-4 -fno-debug-types-section -fvar-tracking-assignments -g2 -Wp,-D_FORTIFY_SOURCE=2 -fstack-protector-strong --param=ssp-buffer-size=4 -fPIC -march=x86-64 -gdwarf-4 -fno-debug-types-section -fvar-tracking-assignments -g2 ' + export CFLAGS + CXXFLAGS=' -O2 -fwrapv -pipe -Wformat -Werror=format-security -gdwarf-4 -fno-debug-types-section -fvar-tracking-assignments -g2 -Wp,-D_FORTIFY_SOURCE=2 -fstack-protector-strong --param=ssp-buffer-size=4 -fPIC -march=x86-64 -gdwarf-4 -fno-debug-types-section -fvar-tracking-assignments -g2 ' + export CXXFLAGS + CC=x86_64-pld-linux-gcc + export CC + CXX=x86_64-pld-linux-g++ + export CXX + /usr/bin/python3 setup.py build '--build-base=build-3' test running build running build_py creating build-3 creating build-3/lib creating build-3/lib/xdis copying xdis/__init__.py -> build-3/lib/xdis copying xdis/marsh.py -> build-3/lib/xdis copying xdis/code.py -> build-3/lib/xdis copying xdis/main.py -> build-3/lib/xdis copying xdis/version.py -> build-3/lib/xdis copying xdis/load.py -> build-3/lib/xdis copying xdis/unmarshal.py -> build-3/lib/xdis copying xdis/magics.py -> build-3/lib/xdis copying xdis/verify.py -> build-3/lib/xdis copying xdis/util.py -> build-3/lib/xdis copying xdis/bytecode.py -> build-3/lib/xdis creating build-3/lib/xdis/opcodes copying xdis/opcodes/opcode_30.py -> build-3/lib/xdis/opcodes copying xdis/opcodes/__init__.py -> build-3/lib/xdis/opcodes copying xdis/opcodes/opcode_3x.py -> build-3/lib/xdis/opcodes copying xdis/opcodes/opcode_33.py -> build-3/lib/xdis/opcodes copying xdis/opcodes/opcode_25.py -> build-3/lib/xdis/opcodes copying xdis/opcodes/opcode_35.py -> build-3/lib/xdis/opcodes copying xdis/opcodes/opcode_26.py -> build-3/lib/xdis/opcodes copying xdis/opcodes/opcode_27.py -> build-3/lib/xdis/opcodes copying xdis/opcodes/opcode_pypy26.py -> build-3/lib/xdis/opcodes copying xdis/opcodes/opcode_32.py -> build-3/lib/xdis/opcodes copying xdis/opcodes/opcode_31.py -> build-3/lib/xdis/opcodes copying xdis/opcodes/opcode_24.py -> build-3/lib/xdis/opcodes copying xdis/opcodes/opcode_23.py -> build-3/lib/xdis/opcodes copying xdis/opcodes/opcode_34.py -> build-3/lib/xdis/opcodes copying xdis/opcodes/opcode_pypy27.py -> build-3/lib/xdis/opcodes copying xdis/opcodes/opcode_2x.py -> build-3/lib/xdis/opcodes creating build-3/lib/xdis/bin copying xdis/bin/__init__.py -> build-3/lib/xdis/bin copying xdis/bin/pydisassemble.py -> build-3/lib/xdis/bin running test running egg_info writing xdis.egg-info/PKG-INFO writing dependency_links to xdis.egg-info/dependency_links.txt writing entry points to xdis.egg-info/entry_points.txt writing top-level names to xdis.egg-info/top_level.txt reading manifest file 'xdis.egg-info/SOURCES.txt' reading manifest template 'MANIFEST.in' writing manifest file 'xdis.egg-info/SOURCES.txt' running build_ext test_big_linenos (test_dis.DisTests) ... ERROR test_boundaries (test_dis.DisTests) ... ok test_opmap (test_dis.DisTests) ... ok test_opname (test_dis.DisTests) ... ok test_basic (test_load.TestLoad) Basic test of load_file, check_object_path and load_module ... ERROR test_basic (test_magic.TestOpcodes) Basic test of magic numbers ... ERROR test_basic (test_marsh.TestMarshal) Tests xdis.load.load_module ... ok test_basic (test_opcode.TestOpcodes) Basic test that opcodes match native installed opcodes ... FAIL ====================================================================== ERROR: test_big_linenos (test_dis.DisTests) ---------------------------------------------------------------------- Traceback (most recent call last): File "/tmp/B.YI7e_n/BUILD/xdis-1.1.7/test_unit/test_dis.py", line 57, in test_big_linenos self.do_disassembly(func(i), expected) File "/tmp/B.YI7e_n/BUILD/xdis-1.1.7/test_unit/test_dis.py", line 22, in do_disassembly got = bytecode.dis() File "/tmp/B.YI7e_n/BUILD/xdis-1.1.7/xdis/bytecode.py", line 231, in dis lasti=offset) File "/tmp/B.YI7e_n/BUILD/xdis-1.1.7/xdis/bytecode.py", line 243, in disassemble_bytes line_offset=line_offset): File "/tmp/B.YI7e_n/BUILD/xdis-1.1.7/xdis/bytecode.py", line 96, in get_instructions_bytes argval, argrepr = _get_name_info(arg, names) File "/tmp/B.YI7e_n/BUILD/xdis-1.1.7/xdis/bytecode.py", line 47, in _get_name_info argval = name_list[name_index] IndexError: tuple index out of range ====================================================================== ERROR: test_basic (test_load.TestLoad) Basic test of load_file, check_object_path and load_module ---------------------------------------------------------------------- Traceback (most recent call last): File "/tmp/B.YI7e_n/BUILD/xdis-1.1.7/xdis/load.py", line 84, in load_module version = float(magics.versions[magic]) KeyError: b'B\r\r\n' During handling of the above exception, another exception occurred: Traceback (most recent call last): File "/tmp/B.YI7e_n/BUILD/xdis-1.1.7/test_unit/test_load.py", line 16, in test_basic version, timestamp, magic_int, co2 = load_module(obj_path) File "/tmp/B.YI7e_n/BUILD/xdis-1.1.7/xdis/load.py", line 89, in load_module (ord(magic[0])+256*ord(magic[1]), filename)) TypeError: ord() expected string of length 1, but int found ====================================================================== ERROR: test_basic (test_magic.TestOpcodes) Basic test of magic numbers ---------------------------------------------------------------------- Traceback (most recent call last): File "/tmp/B.YI7e_n/BUILD/xdis-1.1.7/test_unit/test_magic.py", line 10, in test_basic python_via_magic = magics.by_magic[ current ] KeyError: b'B\r\r\n' ====================================================================== FAIL: test_basic (test_opcode.TestOpcodes) Basic test that opcodes match native installed opcodes ---------------------------------------------------------------------- Traceback (most recent call last): File "/tmp/B.YI7e_n/BUILD/xdis-1.1.7/test_unit/test_opcode.py", line 43, in test_basic self.assertFalse("Python version %s is not something I know about" % PYTHON_VERSION) AssertionError: 'Python version 3.7 is not something I know about' is not false ---------------------------------------------------------------------- Ran 8 tests in 0.069s FAILED (failures=1, errors=3) Test failed: <unittest.runner.TextTestResult run=8 errors=3 failures=1> error: Test failed: <unittest.runner.TextTestResult run=8 errors=3 failures=1> error: Bad exit status from /tmp/B.YI7e_n/BUILD/tmp/rpm-tmp.96784 (%build) RPM build errors: Bad exit status from /tmp/B.YI7e_n/BUILD/tmp/rpm-tmp.96784 (%build) ended at: Tue Jul 3 17:50:35 2018, done in 0:00:03.198232 error: No files produced. mesg: ttyname failed: Inappropriate ioctl for device + chmod -R u+rwX /tmp/B.YI7e_n/BUILD + rm -rf /tmp/B.YI7e_n/tmp /tmp/B.YI7e_n/BUILD mesg: ttyname failed: Inappropriate ioctl for device + rm -rf /tmp/B.YI7e_n Begin-PLD-Builder-Info Build-Time: user:3.73s sys:0.41s real:5.81s (faults io:0 non-io:171293) End-PLD-Builder-Info
[Back to list of logs] [View rpm -qa of builder]