FailedOk

th/SRPMS[OK]
th/x32[OK]
th/i686[OK]
th/x86_64[OK]

ac/SRPMS[OK]
ac/i386[OK]
ac/i586[OK]
ac/i686[OK]
ac/alpha[OK]
ac/amd64[OK]
ac/athlon[OK]
ac/ppc[OK]
ac/sparc[OK]
ac/sparc64[OK]

Advanced Search
main()
Powered by PLD Linux
(c) 2002-2017 PLD Team
$Revision: 1.37 $
Powered by Unix conspiracy.
Your IP: 23.22.136.56

python3 1cb60215-d801-4f5f-870e-e9124fe550ff

Status:Failed
Source URL:ftp://buildlogs.pld-linux.org/th/x86_64/FAIL/python3,1cb60215-d801-4f5f-870e-e9124fe550ff.bz2
text/plain URL:View!
full text:View!
rpm -qa of builder:View!
Date:2017/10/04 10:02:51
Runtime:0:04:28.676517

Toc:

  • files foo
  • Processing files: foo-0.1-1.noarch
  • clean
  • Executing(%clean): /bin/sh -e /tmp/B.XHAvYT/BUILD/tmp/rpm-tmp.64086
  • prep
  • Executing(%prep): /bin/sh -e /tmp/B.XHAvYT/BUILD/tmp/rpm-tmp.64086
  • build
  • Executing(%build): /bin/sh -e /tmp/B.XHAvYT/BUILD/tmp/rpm-tmp.64086
  • install
  • Executing(%install): /bin/sh -e /tmp/B.XHAvYT/BUILD/tmp/rpm-tmp.64086
  • files foo
  • Processing files: foo-0.1-1.noarch
  • clean
  • Executing(%clean): /bin/sh -e /tmp/B.XHAvYT/BUILD/tmp/rpm-tmp.68219
  • error 1
  • socket.gaierror: [Errno -3] Temporary failure in name resolution
  • error 2
  • urllib.error.URLError: <urlopen error [Errno -3] Temporary failure in name resolution>
  • error 3
  • AssertionError: Could not retrieve http://www.pythontest.net/unicode/9.0.0/NormalizationTest.txt
  • error 4
  • FAIL: test_main (test.test_normalization.NormalizationTest)
  • error 5
  • socket.gaierror: [Errno -3] Temporary failure in name resolution
  • error 6
  • urllib.error.URLError: <urlopen error [Errno -3] Temporary failure in name resolution>
  • error 7
  • AssertionError: Could not retrieve http://www.pythontest.net/unicode/9.0.0/NormalizationTest.txt
  • error 8
  • error: Bad exit status from /tmp/B.XHAvYT/BUILD/tmp/rpm-tmp.56143 (%build)
  • error 9
  • RPM build errors:
  • error 10
  • error: open of /tmp/B.XHAvYT/BUILD/tmp/tmp0w2qkbbp/foo/build/bdist.linux-x86_64/rpm/RPMS/foo-0.1-1.noarch.rpm failed: No such file or directory

Content:

0:00:49 load avg: 6.27 [153/390] test__osx_support passed -- running: test_multiprocessing_fork (41 sec)
0:00:49 load avg: 6.27 [154/390] test_filecmp passed -- running: test_multiprocessing_fork (41 sec)
0:00:49 load avg: 6.27 [155/390] test_urllib2_localnet passed -- running: test_multiprocessing_fork (41 sec)
0:00:50 load avg: 6.25 [156/390] test_ctypes passed -- running: test_multiprocessing_fork (42 sec)
0:00:50 load avg: 6.25 [157/390] test_strftime passed -- running: test_multiprocessing_fork (42 sec)
0:00:50 load avg: 6.25 [158/390] test_support passed -- running: test_multiprocessing_fork (42 sec)
0:00:50 load avg: 6.25 [159/390] test_compare passed -- running: test_multiprocessing_fork (42 sec)
0:00:50 load avg: 6.25 [160/390] test_ipaddress passed -- running: test_multiprocessing_fork (42 sec)
0:00:51 load avg: 6.25 [161/390] test_urllib_response passed -- running: test_multiprocessing_fork (42 sec)
0:00:51 load avg: 6.25 [162/390] test_pipes passed -- running: test_multiprocessing_fork (43 sec)
0:00:51 load avg: 6.25 [163/390] test_set passed -- running: test_multiprocessing_fork (43 sec)
0:00:51 load avg: 6.25 [164/390] test_print passed -- running: test_multiprocessing_fork (43 sec)
0:00:51 load avg: 6.25 [165/390] test_binhex passed -- running: test_multiprocessing_fork (43 sec)
0:00:51 load avg: 6.25 [166/390] test_int passed -- running: test_multiprocessing_fork (43 sec)
0:00:51 load avg: 6.25 [167/390] test_dictviews passed -- running: test_multiprocessing_fork (43 sec)
0:00:51 load avg: 6.25 [168/390] test_class passed -- running: test_multiprocessing_fork (43 sec)
0:00:52 load avg: 6.25 [169/390] test_fstring passed -- running: test_multiprocessing_fork (44 sec)
0:00:52 load avg: 6.25 [170/390] test_file_eintr passed -- running: test_multiprocessing_fork (44 sec)
0:00:53 load avg: 6.25 [171/390] test_optparse passed -- running: test_multiprocessing_fork (44 sec)
0:00:53 load avg: 6.25 [172/390] test_memoryview passed -- running: test_multiprocessing_fork (45 sec)
0:00:53 load avg: 6.25 [173/390] test_netrc passed -- running: test_multiprocessing_fork (45 sec)
0:00:55 load avg: 5.90 [174/390] test_ast passed -- running: test_multiprocessing_fork (47 sec)
0:00:55 load avg: 5.90 [175/390] test_unpack passed -- running: test_multiprocessing_fork (47 sec)
0:00:55 load avg: 5.90 [176/390] test_ioctl skipped -- running: test_multiprocessing_fork (47 sec)
test_ioctl skipped -- Unable to open /dev/tty
0:00:57 load avg: 5.90 [177/390] test_runpy passed -- running: test_multiprocessing_fork (48 sec)
0:00:57 load avg: 5.90 [178/390] test_tracemalloc passed -- running: test_multiprocessing_fork (49 sec)
0:00:58 load avg: 5.90 [179/390] test_complex passed -- running: test_multiprocessing_fork (50 sec)
0:00:59 load avg: 5.90 [180/390] test_zipimport_support passed -- running: test_multiprocessing_fork (50 sec)
0:01:11 load avg: 4.96 [181/390] test_logging passed -- running: test_multiprocessing_fork (63 sec), test_tools (41 sec), test_io (39 sec)
0:01:11 load avg: 4.96 [182/390] test_call passed -- running: test_multiprocessing_fork (63 sec), test_tools (41 sec), test_io (39 sec)
0:01:11 load avg: 4.96 [183/390] test_imp passed -- running: test_multiprocessing_fork (63 sec), test_tools (42 sec), test_io (40 sec)
0:01:11 load avg: 4.96 [184/390] test_augassign passed -- running: test_multiprocessing_fork (63 sec), test_tools (42 sec), test_io (40 sec)
0:01:12 load avg: 4.96 [185/390] test_msilib skipped -- running: test_multiprocessing_fork (64 sec), test_tools (42 sec), test_io (40 sec)
test_msilib skipped -- No module named '_msi'
0:01:13 load avg: 4.96 [186/390] test_inspect passed -- running: test_multiprocessing_fork (64 sec), test_tools (43 sec), test_io (41 sec)
0:01:14 load avg: 4.96 [187/390] test_tuple passed -- running: test_multiprocessing_fork (66 sec), test_tools (44 sec), test_io (42 sec)
0:01:14 load avg: 4.96 [188/390] test_plistlib passed -- running: test_multiprocessing_fork (66 sec), test_tools (44 sec), test_io (42 sec)
0:01:14 load avg: 4.96 [189/390] test_atexit passed -- running: test_multiprocessing_fork (66 sec), test_tools (44 sec), test_io (42 sec)
0:01:14 load avg: 4.96 [190/390] test_io passed (42 sec) -- running: test_multiprocessing_fork (66 sec), test_tools (45 sec)
0:01:15 load avg: 5.20 [191/390] test_sax passed -- running: test_multiprocessing_fork (66 sec), test_tools (45 sec)
0:01:15 load avg: 5.20 [192/390] test_marshal passed -- running: test_multiprocessing_fork (66 sec), test_tools (45 sec)
0:01:15 load avg: 5.20 [193/390] test_operator passed -- running: test_multiprocessing_fork (67 sec), test_tools (45 sec)
0:01:15 load avg: 5.20 [194/390] test_fileinput passed -- running: test_multiprocessing_fork (67 sec), test_tools (45 sec)
0:01:15 load avg: 5.20 [195/390] test_crashers passed -- running: test_multiprocessing_fork (67 sec), test_tools (45 sec)
0:01:16 load avg: 5.20 [196/390] test_multiprocessing_fork passed (67 sec) -- running: test_tools (46 sec)
0:01:17 load avg: 5.20 [197/390] test_doctest passed -- running: test_tools (47 sec)
0:01:17 load avg: 5.20 [198/390] test_struct passed -- running: test_tools (47 sec)
0:01:17 load avg: 5.20 [199/390] test_shutil passed -- running: test_tools (48 sec)
0:01:18 load avg: 5.20 [200/390] test_getargs2 passed -- running: test_tools (48 sec)
0:01:23 load avg: 5.03 [201/390] test_distutils passed -- running: test_tools (53 sec), test_multiprocessing_forkserver (31 sec)
Executing(%prep): /bin/sh -e /tmp/B.XHAvYT/BUILD/tmp/rpm-tmp.41138
drwxr-xr-x builder/users     0 2017-10-04 10:00 foo-0.1/
-rw-r--r-- builder/users     0 2017-10-04 10:00 foo-0.1/README
-rw-r--r-- builder/users     1 2017-10-04 10:00 foo-0.1/foo.py
-rw-r--r-- builder/users   150 2017-10-04 10:00 foo-0.1/setup.py
-rw-r--r-- builder/users   163 2017-10-04 10:00 foo-0.1/PKG-INFO
Executing(%build): /bin/sh -e /tmp/B.XHAvYT/BUILD/tmp/rpm-tmp.41138
TMP=/home/users/builder/tmp
HOME=/tmp/B.XHAvYT/BUILD/tmp/tmptqjwwzep
PATH=/home/users/builder/GNUstep/Tools:/usr/local/bin:/usr/bin:/bin:/home/users/builder/bin
TMPDIR=/tmp/B.XHAvYT/BUILD/tmp
running build
running build_py
creating build
creating build/lib
copying foo.py -> build/lib
Executing(%install): /bin/sh -e /tmp/B.XHAvYT/BUILD/tmp/rpm-tmp.64086
TMP=/home/users/builder/tmp
HOME=/tmp/B.XHAvYT/BUILD/tmp/tmptqjwwzep
PATH=/home/users/builder/GNUstep/Tools:/usr/local/bin:/usr/bin:/bin:/home/users/builder/bin
TMPDIR=/tmp/B.XHAvYT/BUILD/tmp
running install
running build
running build_py
running install_lib
creating /tmp/B.XHAvYT/BUILD/tmp/foo-0.1-root-builder/tmp
creating /tmp/B.XHAvYT/BUILD/tmp/foo-0.1-root-builder/tmp/B.XHAvYT
creating /tmp/B.XHAvYT/BUILD/tmp/foo-0.1-root-builder/tmp/B.XHAvYT/BUILD
creating /tmp/B.XHAvYT/BUILD/tmp/foo-0.1-root-builder/tmp/B.XHAvYT/BUILD/Python-3.6.3
creating /tmp/B.XHAvYT/BUILD/tmp/foo-0.1-root-builder/tmp/B.XHAvYT/BUILD/Python-3.6.3/lib64
creating /tmp/B.XHAvYT/BUILD/tmp/foo-0.1-root-builder/tmp/B.XHAvYT/BUILD/Python-3.6.3/lib64/python3.6
creating /tmp/B.XHAvYT/BUILD/tmp/foo-0.1-root-builder/tmp/B.XHAvYT/BUILD/Python-3.6.3/lib64/python3.6/site-packages
copying build/lib/foo.py -> /tmp/B.XHAvYT/BUILD/tmp/foo-0.1-root-builder/tmp/B.XHAvYT/BUILD/Python-3.6.3/lib64/python3.6/site-packages
byte-compiling /tmp/B.XHAvYT/BUILD/tmp/foo-0.1-root-builder/tmp/B.XHAvYT/BUILD/Python-3.6.3/lib64/python3.6/site-packages/foo.py to foo.cpython-36.pyc
writing byte-compilation script '/tmp/B.XHAvYT/BUILD/tmp/tmpmnuc6ej1.py'
/tmp/B.XHAvYT/BUILD/Python-3.6.3/python /tmp/B.XHAvYT/BUILD/tmp/tmpmnuc6ej1.py
removing /tmp/B.XHAvYT/BUILD/tmp/tmpmnuc6ej1.py
running install_egg_info
Writing /tmp/B.XHAvYT/BUILD/tmp/foo-0.1-root-builder/tmp/B.XHAvYT/BUILD/Python-3.6.3/lib64/python3.6/site-packages/foo-0.1-py3.6.egg-info
writing list of installed files to 'INSTALLED_FILES'
RPM_BUILD_DIR=/tmp/B.XHAvYT/BUILD/tmp/tmptqjwwzep/foo/build/bdist.linux-x86_64/rpm/BUILD

Searching for shared objects with unresolved symbols... DONE
Checking /var/run <-> tmpfiles.d completeness...
 DONE
Checking script shebangs...
 DONE
Hardlink Python files: 0/2 files hardlinked
Processing files: foo-0.1-1.noarch
Checking for unpackaged file(s): /usr/lib/rpm/check-files /tmp/B.XHAvYT/BUILD/tmp/foo-0.1-root-builder
Wrote: /tmp/B.XHAvYT/BUILD/tmp/tmptqjwwzep/foo/build/bdist.linux-x86_64/rpm/SRPMS/foo-0.1-1.src.rpm
Wrote: /tmp/B.XHAvYT/BUILD/tmp/tmptqjwwzep/foo/build/bdist.linux-x86_64/rpm/RPMS/foo-0.1-1.noarch.rpm
Executing(%clean): /bin/sh -e /tmp/B.XHAvYT/BUILD/tmp/rpm-tmp.64086
Executing(--clean): /bin/sh -e /tmp/B.XHAvYT/BUILD/tmp/rpm-tmp.64086
Executing(%prep): /bin/sh -e /tmp/B.XHAvYT/BUILD/tmp/rpm-tmp.64086
drwxr-xr-x builder/users     0 2017-10-04 10:00 foo-0.1/
-rw-r--r-- builder/users     0 2017-10-04 10:00 foo-0.1/README
-rw-r--r-- builder/users     1 2017-10-04 10:00 foo-0.1/foo.py
-rw-r--r-- builder/users   150 2017-10-04 10:00 foo-0.1/setup.py
-rw-r--r-- builder/users   163 2017-10-04 10:00 foo-0.1/PKG-INFO
Executing(%build): /bin/sh -e /tmp/B.XHAvYT/BUILD/tmp/rpm-tmp.64086
TMP=/home/users/builder/tmp
HOME=/tmp/B.XHAvYT/BUILD/tmp/tmp0w2qkbbp
PATH=/home/users/builder/GNUstep/Tools:/usr/local/bin:/usr/bin:/bin:/home/users/builder/bin
TMPDIR=/tmp/B.XHAvYT/BUILD/tmp
running build
running build_py
creating build
creating build/lib
copying foo.py -> build/lib
Executing(%install): /bin/sh -e /tmp/B.XHAvYT/BUILD/tmp/rpm-tmp.64086
TMP=/home/users/builder/tmp
HOME=/tmp/B.XHAvYT/BUILD/tmp/tmp0w2qkbbp
PATH=/home/users/builder/GNUstep/Tools:/usr/local/bin:/usr/bin:/bin:/home/users/builder/bin
TMPDIR=/tmp/B.XHAvYT/BUILD/tmp
running install
running build
running build_py
running install_lib
creating /tmp/B.XHAvYT/BUILD/tmp/foo-0.1-root-builder/tmp
creating /tmp/B.XHAvYT/BUILD/tmp/foo-0.1-root-builder/tmp/B.XHAvYT
creating /tmp/B.XHAvYT/BUILD/tmp/foo-0.1-root-builder/tmp/B.XHAvYT/BUILD
creating /tmp/B.XHAvYT/BUILD/tmp/foo-0.1-root-builder/tmp/B.XHAvYT/BUILD/Python-3.6.3
creating /tmp/B.XHAvYT/BUILD/tmp/foo-0.1-root-builder/tmp/B.XHAvYT/BUILD/Python-3.6.3/lib64
creating /tmp/B.XHAvYT/BUILD/tmp/foo-0.1-root-builder/tmp/B.XHAvYT/BUILD/Python-3.6.3/lib64/python3.6
creating /tmp/B.XHAvYT/BUILD/tmp/foo-0.1-root-builder/tmp/B.XHAvYT/BUILD/Python-3.6.3/lib64/python3.6/site-packages
copying build/lib/foo.py -> /tmp/B.XHAvYT/BUILD/tmp/foo-0.1-root-builder/tmp/B.XHAvYT/BUILD/Python-3.6.3/lib64/python3.6/site-packages
byte-compiling /tmp/B.XHAvYT/BUILD/tmp/foo-0.1-root-builder/tmp/B.XHAvYT/BUILD/Python-3.6.3/lib64/python3.6/site-packages/foo.py to foo.cpython-36.pyc
writing byte-compilation script '/tmp/B.XHAvYT/BUILD/tmp/tmpv7ii5eqe.py'
/tmp/B.XHAvYT/BUILD/Python-3.6.3/python /tmp/B.XHAvYT/BUILD/tmp/tmpv7ii5eqe.py
removing /tmp/B.XHAvYT/BUILD/tmp/tmpv7ii5eqe.py
running install_egg_info
Writing /tmp/B.XHAvYT/BUILD/tmp/foo-0.1-root-builder/tmp/B.XHAvYT/BUILD/Python-3.6.3/lib64/python3.6/site-packages/foo-0.1-py3.6.egg-info
writing list of installed files to 'INSTALLED_FILES'
RPM_BUILD_DIR=/tmp/B.XHAvYT/BUILD/tmp/tmp0w2qkbbp/foo/build/bdist.linux-x86_64/rpm/BUILD

Searching for shared objects with unresolved symbols... DONE
Checking /var/run <-> tmpfiles.d completeness...
 DONE
Checking script shebangs...
 DONE
Hardlink Python files: 0/2 files hardlinked
Processing files: foo-0.1-1.noarch
Checking for unpackaged file(s): /usr/lib/rpm/check-files /tmp/B.XHAvYT/BUILD/tmp/foo-0.1-root-builder
Wrote: /tmp/B.XHAvYT/BUILD/tmp/tmp0w2qkbbp/foo/build/bdist.linux-x86_64/rpm/SRPMS/foo-0.1-1.src.rpm
Wrote: /tmp/B.XHAvYT/BUILD/tmp/tmp0w2qkbbp/foo/build/bdist.linux-x86_64/rpm/RPMS/foo-0.1-1.noarch.rpm
Executing(%clean): /bin/sh -e /tmp/B.XHAvYT/BUILD/tmp/rpm-tmp.68219
Executing(--clean): /bin/sh -e /tmp/B.XHAvYT/BUILD/tmp/rpm-tmp.68219
+ umask 022
+ cd /tmp/B.XHAvYT/BUILD/tmp/tmptqjwwzep/foo/build/bdist.linux-x86_64/rpm/BUILD
+ cd /tmp/B.XHAvYT/BUILD/tmp/tmptqjwwzep/foo/build/bdist.linux-x86_64/rpm/BUILD
+ rm -rf foo-0.1
+ /usr/bin/gzip -dc /tmp/B.XHAvYT/BUILD/tmp/tmptqjwwzep/foo/build/bdist.linux-x86_64/rpm/SOURCES/foo-0.1.tar.gz
+ /bin/tar -xvvf -
+ STATUS=0 
+ '[' 0 -ne 0 ']'
+ cd foo-0.1
+ /bin/id -u
+ '[' 1000 '=' 0 ']'
+ /bin/id -u
+ '[' 1000 '=' 0 ']'
+ /bin/chmod -Rf a+rX,u+w,g-w,o-w .
+ exit 0
+ umask 022
+ cd /tmp/B.XHAvYT/BUILD/tmp/tmptqjwwzep/foo/build/bdist.linux-x86_64/rpm/BUILD
+ cd foo-0.1
+ /tmp/B.XHAvYT/BUILD/Python-3.6.3/python setup.py build
+ exit 0
+ umask 022
+ cd /tmp/B.XHAvYT/BUILD/tmp/tmptqjwwzep/foo/build/bdist.linux-x86_64/rpm/BUILD
+ /bin/rm '--interactive=never' -rf /tmp/B.XHAvYT/BUILD/tmp/foo-0.1-root-builder
+ /bin/mkdir -p /tmp/B.XHAvYT/BUILD/tmp/foo-0.1-root-builder
+ cd foo-0.1
+ /tmp/B.XHAvYT/BUILD/Python-3.6.3/python setup.py install -O1 '--root=/tmp/B.XHAvYT/BUILD/tmp/foo-0.1-root-builder' '--record=INSTALLED_FILES'
+ /usr/lib/rpm/find-debuginfo.sh /tmp/B.XHAvYT/BUILD/tmp/tmptqjwwzep/foo/build/bdist.linux-x86_64/rpm/BUILD/foo-0.1
+ __spec_install_post_strip
+ set +x
+ __spec_install_post_chrpath
+ set +x
+ __spec_install_post_compress_modules
+ set +x
+ __spec_install_post_check_so
+ set +x
+ __spec_install_post_check_tmpfiles
+ set +x
+ __spec_install_post_check_shebangs
+ set +x
+ __spec_install_post_compress_docs
+ set +x
+ __spec_install_post_py_hardlink
+ set +x
warning: Could not canonicalize hostname: ymir-builder
+ umask 022
+ cd /tmp/B.XHAvYT/BUILD/tmp/tmptqjwwzep/foo/build/bdist.linux-x86_64/rpm/BUILD
+ cd foo-0.1
+ /bin/rm '--interactive=never' -rf /tmp/B.XHAvYT/BUILD/tmp/foo-0.1-root-builder
+ rm -rf /tmp/B.XHAvYT/BUILD/tmp/foo-0.1-root-builder
+ umask 022
+ cd /tmp/B.XHAvYT/BUILD/tmp/tmptqjwwzep/foo/build/bdist.linux-x86_64/rpm/BUILD
+ rm -rf foo-0.1
+ umask 022
+ cd /tmp/B.XHAvYT/BUILD/tmp/tmp0w2qkbbp/foo/build/bdist.linux-x86_64/rpm/BUILD
+ cd /tmp/B.XHAvYT/BUILD/tmp/tmp0w2qkbbp/foo/build/bdist.linux-x86_64/rpm/BUILD
+ rm -rf foo-0.1
+ /bin/tar -xvvf -
+ /usr/bin/gzip -dc /tmp/B.XHAvYT/BUILD/tmp/tmp0w2qkbbp/foo/build/bdist.linux-x86_64/rpm/SOURCES/foo-0.1.tar.gz
+ STATUS=0 
+ '[' 0 -ne 0 ']'
+ cd foo-0.1
+ /bin/id -u
+ '[' 1000 '=' 0 ']'
+ /bin/id -u
+ '[' 1000 '=' 0 ']'
+ /bin/chmod -Rf a+rX,u+w,g-w,o-w .
+ exit 0
+ umask 022
+ cd /tmp/B.XHAvYT/BUILD/tmp/tmp0w2qkbbp/foo/build/bdist.linux-x86_64/rpm/BUILD
+ cd foo-0.1
+ /tmp/B.XHAvYT/BUILD/Python-3.6.3/python setup.py build
+ exit 0
+ umask 022
+ cd /tmp/B.XHAvYT/BUILD/tmp/tmp0w2qkbbp/foo/build/bdist.linux-x86_64/rpm/BUILD
+ /bin/rm '--interactive=never' -rf /tmp/B.XHAvYT/BUILD/tmp/foo-0.1-root-builder
+ /bin/mkdir -p /tmp/B.XHAvYT/BUILD/tmp/foo-0.1-root-builder
+ cd foo-0.1
+ /tmp/B.XHAvYT/BUILD/Python-3.6.3/python setup.py install -O1 '--root=/tmp/B.XHAvYT/BUILD/tmp/foo-0.1-root-builder' '--record=INSTALLED_FILES'
+ /usr/lib/rpm/find-debuginfo.sh /tmp/B.XHAvYT/BUILD/tmp/tmp0w2qkbbp/foo/build/bdist.linux-x86_64/rpm/BUILD/foo-0.1
+ __spec_install_post_strip
+ set +x
+ __spec_install_post_chrpath
+ set +x
+ __spec_install_post_compress_modules
+ set +x
+ __spec_install_post_check_so
+ set +x
+ __spec_install_post_check_tmpfiles
+ set +x
+ __spec_install_post_check_shebangs
+ set +x
+ __spec_install_post_compress_docs
+ set +x
+ __spec_install_post_py_hardlink
+ set +x
warning: Could not canonicalize hostname: ymir-builder
+ umask 022
+ cd /tmp/B.XHAvYT/BUILD/tmp/tmp0w2qkbbp/foo/build/bdist.linux-x86_64/rpm/BUILD
+ cd foo-0.1
+ /bin/rm '--interactive=never' -rf /tmp/B.XHAvYT/BUILD/tmp/foo-0.1-root-builder
+ rm -rf /tmp/B.XHAvYT/BUILD/tmp/foo-0.1-root-builder
+ umask 022
+ cd /tmp/B.XHAvYT/BUILD/tmp/tmp0w2qkbbp/foo/build/bdist.linux-x86_64/rpm/BUILD
+ rm -rf foo-0.1
0:01:24 load avg: 5.03 [202/390] test_tools passed (54 sec) -- running: test_multiprocessing_forkserver (32 sec)
0:01:24 load avg: 5.03 [203/390] test_colorsys passed -- running: test_multiprocessing_forkserver (32 sec)
0:01:24 load avg: 5.03 [204/390] test_functools passed -- running: test_multiprocessing_forkserver (32 sec)
0:01:25 load avg: 4.86 [205/390] test_argparse passed -- running: test_multiprocessing_forkserver (33 sec)
0:01:25 load avg: 4.86 [206/390] test_symbol passed -- running: test_multiprocessing_forkserver (33 sec)
0:01:26 load avg: 4.86 [207/390] test_multibytecodec passed -- running: test_multiprocessing_forkserver (34 sec)
0:01:27 load avg: 4.86 [208/390] test_subprocess passed -- running: test_multiprocessing_forkserver (35 sec)
0:01:27 load avg: 4.86 [209/390] test_statistics passed -- running: test_multiprocessing_forkserver (35 sec)
0:01:27 load avg: 4.86 [210/390] test_weakset passed -- running: test_multiprocessing_forkserver (35 sec)
0:01:27 load avg: 4.86 [211/390] test_xmlrpc_net passed -- running: test_multiprocessing_forkserver (35 sec)
0:01:28 load avg: 4.86 [212/390] test_enumerate passed -- running: test_multiprocessing_forkserver (36 sec)
0:01:28 load avg: 4.86 [213/390] test_codecmaps_hk passed -- running: test_multiprocessing_forkserver (36 sec)
0:01:28 load avg: 4.86 [214/390] test_frame passed -- running: test_multiprocessing_forkserver (36 sec)
0:01:28 load avg: 4.86 [215/390] test_pathlib passed -- running: test_multiprocessing_forkserver (36 sec)
0:01:29 load avg: 4.86 [216/390] test_decimal passed -- running: test_multiprocessing_forkserver (37 sec)
0:01:29 load avg: 4.86 [217/390] test_coroutines passed -- running: test_multiprocessing_forkserver (37 sec)
0:01:30 load avg: 4.71 [218/390] test_raise passed -- running: test_multiprocessing_forkserver (38 sec)
0:01:34 load avg: 4.71 [219/390] test_long passed -- running: test_multiprocessing_forkserver (42 sec)
0:01:34 load avg: 4.71 [220/390] test_tix skipped (resource denied) -- running: test_multiprocessing_forkserver (42 sec)
test_tix skipped -- Use of the 'gui' resource not enabled
0:01:34 load avg: 4.71 [221/390] test_imaplib passed -- running: test_multiprocessing_forkserver (42 sec)
Resource 'cyrus.andrew.cmu.edu' is not available
Resource 'cyrus.andrew.cmu.edu' is not available
Resource 'cyrus.andrew.cmu.edu' is not available
Resource 'cyrus.andrew.cmu.edu' is not available
Resource 'cyrus.andrew.cmu.edu' is not available
Resource 'cyrus.andrew.cmu.edu' is not available
0:01:34 load avg: 4.71 [222/390] test_userlist passed -- running: test_multiprocessing_forkserver (42 sec)
0:01:34 load avg: 4.58 [223/390] test_mailcap passed -- running: test_multiprocessing_forkserver (43 sec)
0:01:35 load avg: 4.58 [224/390] test_codecencodings_iso2022 passed -- running: test_multiprocessing_forkserver (43 sec)
0:01:35 load avg: 4.58 [225/390] test_sysconfig passed -- running: test_multiprocessing_forkserver (43 sec)
0:01:35 load avg: 4.58 [226/390] test_code passed -- running: test_multiprocessing_forkserver (43 sec)
0:01:35 load avg: 4.58 [227/390] test_sndhdr passed -- running: test_multiprocessing_forkserver (43 sec)
0:01:35 load avg: 4.58 [228/390] test_copy passed -- running: test_multiprocessing_forkserver (43 sec)
0:01:35 load avg: 4.58 [229/390] test_minidom passed -- running: test_multiprocessing_forkserver (43 sec)
0:01:35 load avg: 4.58 [230/390] test_threading_local passed -- running: test_multiprocessing_forkserver (44 sec)
0:01:36 load avg: 4.58 [231/390] test_threadedtempfile passed -- running: test_multiprocessing_forkserver (44 sec)
0:01:36 load avg: 4.58 [232/390] test_bool passed -- running: test_multiprocessing_forkserver (44 sec)
0:01:36 load avg: 4.58 [233/390] test_email passed -- running: test_multiprocessing_forkserver (44 sec)
0:01:36 load avg: 4.58 [234/390] test_pulldom passed -- running: test_multiprocessing_forkserver (44 sec)
0:01:36 load avg: 4.58 [235/390] test_xml_etree passed -- running: test_multiprocessing_forkserver (44 sec)
0:01:36 load avg: 4.58 [236/390] test_asdl_parser passed -- running: test_multiprocessing_forkserver (44 sec)
0:01:37 load avg: 4.58 [237/390] test_traceback passed -- running: test_multiprocessing_forkserver (45 sec)
0:01:37 load avg: 4.58 [238/390] test_float passed -- running: test_multiprocessing_forkserver (45 sec)
0:01:37 load avg: 4.58 [239/390] test_turtle passed -- running: test_multiprocessing_forkserver (45 sec)
0:01:37 load avg: 4.58 [240/390] test_codecs passed -- running: test_multiprocessing_forkserver (46 sec)
0:01:38 load avg: 4.58 [241/390] test_dummy_thread passed -- running: test_multiprocessing_forkserver (46 sec)
0:01:38 load avg: 4.58 [242/390] test_unpack_ex passed -- running: test_multiprocessing_forkserver (46 sec)
0:01:38 load avg: 4.58 [243/390] test_ordered_dict passed -- running: test_multiprocessing_forkserver (47 sec)
0:01:39 load avg: 4.58 [244/390] test_select passed -- running: test_multiprocessing_forkserver (47 sec)
0:01:39 load avg: 4.58 [245/390] test_list passed -- running: test_multiprocessing_forkserver (47 sec)
0:01:39 load avg: 4.53 [246/390] test_calendar passed -- running: test_multiprocessing_forkserver (48 sec)
0:01:40 load avg: 4.53 [247/390] test_gettext passed -- running: test_multiprocessing_forkserver (48 sec)
0:01:40 load avg: 4.53 [248/390] test_dbm passed -- running: test_multiprocessing_forkserver (48 sec)
0:01:40 load avg: 4.53 [249/390] test_structmembers passed -- running: test_multiprocessing_forkserver (48 sec)
0:01:41 load avg: 4.53 [250/390] test_string_literals passed -- running: test_multiprocessing_forkserver (49 sec)
0:01:41 load avg: 4.53 [251/390] test_syslog passed -- running: test_multiprocessing_forkserver (49 sec)
0:01:41 load avg: 4.53 [252/390] test_exception_variations passed -- running: test_multiprocessing_forkserver (49 sec)
0:01:41 load avg: 4.53 [253/390] test_numeric_tower passed -- running: test_multiprocessing_forkserver (49 sec)
0:01:42 load avg: 4.53 [254/390] test_collections passed -- running: test_multiprocessing_forkserver (50 sec)
0:01:45 load avg: 4.49 [255/390] test_datetime passed -- running: test_multiprocessing_forkserver (53 sec)
0:01:45 load avg: 4.49 [256/390] test_zipimport passed -- running: test_multiprocessing_forkserver (53 sec)
0:01:46 load avg: 4.49 [257/390] test_wsgiref passed -- running: test_multiprocessing_forkserver (54 sec)
0:01:47 load avg: 4.49 [258/390] test_zlib passed -- running: test_multiprocessing_forkserver (55 sec)
0:01:48 load avg: 4.49 [259/390] test_socketserver passed -- running: test_concurrent_futures (30 sec), test_multiprocessing_forkserver (56 sec)
0:01:48 load avg: 4.49 [260/390] test_int_literal passed -- running: test_concurrent_futures (30 sec), test_multiprocessing_forkserver (56 sec)
0:01:48 load avg: 4.49 [261/390] test_codecmaps_tw passed -- running: test_concurrent_futures (30 sec), test_multiprocessing_forkserver (56 sec)
0:01:48 load avg: 4.49 [262/390] test_quopri passed -- running: test_concurrent_futures (31 sec), test_multiprocessing_forkserver (56 sec)
0:01:48 load avg: 4.49 [263/390] test_zipfile passed -- running: test_concurrent_futures (31 sec), test_multiprocessing_forkserver (56 sec)
0:01:49 load avg: 4.49 [264/390] test_reprlib passed -- running: test_concurrent_futures (31 sec), test_multiprocessing_forkserver (57 sec)
0:01:49 load avg: 4.49 [265/390] test_platform passed -- running: test_concurrent_futures (31 sec), test_multiprocessing_forkserver (57 sec)
0:01:49 load avg: 4.49 [266/390] test_import passed -- running: test_concurrent_futures (31 sec), test_multiprocessing_forkserver (57 sec)
0:01:49 load avg: 4.49 [267/390] test_dummy_threading passed -- running: test_concurrent_futures (32 sec), test_multiprocessing_forkserver (57 sec)
0:01:49 load avg: 4.49 [268/390] test_bigaddrspace passed -- running: test_concurrent_futures (32 sec), test_multiprocessing_forkserver (57 sec)
0:01:49 load avg: 4.49 [269/390] test_charmapcodec passed -- running: test_concurrent_futures (32 sec), test_multiprocessing_forkserver (57 sec)
0:01:49 load avg: 4.49 [270/390/1] test_normalization failed -- running: test_concurrent_futures (32 sec), test_multiprocessing_forkserver (57 sec)
test test_normalization failed -- Traceback (most recent call last):
  File "/tmp/B.XHAvYT/BUILD/Python-3.6.3/Lib/urllib/request.py", line 1318, in do_open
    encode_chunked=req.has_header('Transfer-encoding'))
socket.gaierror: [Errno -3] Temporary failure in name resolution

During handling of the above exception, another exception occurred:

Traceback (most recent call last):
  File "/tmp/B.XHAvYT/BUILD/Python-3.6.3/Lib/test/test_normalization.py", line 42, in test_main
    check=check_version)
urllib.error.URLError: <urlopen error [Errno -3] Temporary failure in name resolution>

During handling of the above exception, another exception occurred:

Traceback (most recent call last):
  File "/tmp/B.XHAvYT/BUILD/Python-3.6.3/Lib/test/test_normalization.py", line 47, in test_main
    self.fail(f"Could not retrieve {TESTDATAURL}")
AssertionError: Could not retrieve http://www.pythontest.net/unicode/9.0.0/NormalizationTest.txt
0:01:49 load avg: 4.37 [271/390/1] test_types passed -- running: test_concurrent_futures (32 sec), test_multiprocessing_forkserver (58 sec)
0:01:50 load avg: 4.37 [272/390/1] test_hashlib passed -- running: test_concurrent_futures (33 sec), test_multiprocessing_forkserver (58 sec)
0:01:52 load avg: 4.37 [273/390/1] test_cmd_line passed -- running: test_concurrent_futures (35 sec), test_multiprocessing_forkserver (60 sec)
0:01:52 load avg: 4.37 [274/390/1] test_fcntl passed -- running: test_concurrent_futures (35 sec), test_multiprocessing_forkserver (60 sec)
0:01:53 load avg: 4.37 [275/390/1] test_mmap passed -- running: test_concurrent_futures (35 sec), test_multiprocessing_forkserver (61 sec)
0:01:53 load avg: 4.37 [276/390/1] test_robotparser passed -- running: test_concurrent_futures (35 sec), test_multiprocessing_forkserver (61 sec)
Resource 'http://www.pythontest.net/' is not available
0:01:57 load avg: 4.26 [277/390/1] test_weakref passed -- running: test_concurrent_futures (39 sec), test_multiprocessing_forkserver (65 sec)
0:01:58 load avg: 4.26 [278/390/1] test_unicode passed -- running: test_concurrent_futures (41 sec), test_multiprocessing_forkserver (67 sec)
0:01:59 load avg: 4.26 [279/390/1] test_urllib passed -- running: test_concurrent_futures (41 sec), test_multiprocessing_forkserver (67 sec)
0:01:59 load avg: 4.26 [280/390/1] test_keyword passed -- running: test_concurrent_futures (42 sec), test_multiprocessing_forkserver (67 sec)
0:02:00 load avg: 4.16 [281/390/1] test_multiprocessing_forkserver passed (67 sec) -- running: test_concurrent_futures (42 sec)
0:02:00 load avg: 4.16 [282/390/1] test_pkg passed -- running: test_concurrent_futures (42 sec)
0:02:00 load avg: 4.16 [283/390/1] test_codecmaps_jp passed -- running: test_concurrent_futures (42 sec)
0:02:00 load avg: 4.16 [284/390/1] test_ttk_guionly skipped (resource denied) -- running: test_concurrent_futures (43 sec)
test_ttk_guionly skipped -- Use of the 'gui' resource not enabled
0:02:00 load avg: 4.16 [285/390/1] test_secrets passed -- running: test_concurrent_futures (43 sec)
0:02:00 load avg: 4.16 [286/390/1] test_getpass passed -- running: test_concurrent_futures (43 sec)
0:02:03 load avg: 4.16 [287/390/1] test_buffer passed -- running: test_concurrent_futures (45 sec)
0:02:03 load avg: 4.16 [288/390/1] test_mimetypes passed -- running: test_concurrent_futures (45 sec)
0:02:03 load avg: 4.16 [289/390/1] test_with passed -- running: test_concurrent_futures (46 sec)
0:02:03 load avg: 4.16 [290/390/1] test_binascii passed -- running: test_concurrent_futures (46 sec)
0:02:04 load avg: 4.16 [291/390/1] test_yield_from passed -- running: test_concurrent_futures (46 sec)
0:02:04 load avg: 4.16 [292/390/1] test_bytes passed -- running: test_concurrent_futures (46 sec)
0:02:04 load avg: 4.16 [293/390/1] test_bisect passed -- running: test_concurrent_futures (47 sec)
0:02:04 load avg: 4.16 [294/390/1] test_sundry passed -- running: test_concurrent_futures (47 sec)
0:02:05 load avg: 4.31 [295/390/1] test_http_cookies passed -- running: test_concurrent_futures (47 sec)
0:02:05 load avg: 4.31 [296/390/1] test_mailbox passed -- running: test_concurrent_futures (47 sec)
0:02:05 load avg: 4.31 [297/390/1] test_winconsoleio skipped -- running: test_concurrent_futures (47 sec)
test_winconsoleio skipped -- test only relevant on win32
0:02:06 load avg: 4.31 [298/390/1] test_fork1 passed -- running: test_concurrent_futures (48 sec)
0:02:06 load avg: 4.31 [299/390/1] test_future passed -- running: test_concurrent_futures (49 sec)
0:02:07 load avg: 4.31 [300/390/1] test_htmlparser passed -- running: test_concurrent_futures (49 sec)
0:02:07 load avg: 4.31 [301/390/1] test_sys_settrace passed -- running: test_concurrent_futures (49 sec)
0:02:07 load avg: 4.31 [302/390/1] test___future__ passed -- running: test_concurrent_futures (49 sec)
0:02:07 load avg: 4.31 [303/390/1] test_ntpath passed -- running: test_concurrent_futures (50 sec)
0:02:07 load avg: 4.31 [304/390/1] test_tcl passed -- running: test_concurrent_futures (50 sec)
0:02:08 load avg: 4.31 [305/390/1] test_pydoc passed -- running: test_concurrent_futures (50 sec)
0:02:08 load avg: 4.31 [306/390/1] test_xdrlib passed -- running: test_concurrent_futures (51 sec)
0:02:08 load avg: 4.31 [307/390/1] test_timeit passed -- running: test_concurrent_futures (51 sec)
0:02:09 load avg: 4.31 [308/390/1] test_array passed -- running: test_concurrent_futures (51 sec)
0:02:09 load avg: 4.31 [309/390/1] test_curses passed -- running: test_concurrent_futures (51 sec)
0:02:09 load avg: 4.31 [310/390/1] test_pkgimport passed -- running: test_concurrent_futures (51 sec)
0:02:09 load avg: 4.31 [311/390/1] test_exception_hierarchy passed -- running: test_concurrent_futures (51 sec)
0:02:09 load avg: 4.31 [312/390/1] test_subclassinit passed -- running: test_concurrent_futures (52 sec)
0:02:09 load avg: 4.31 [313/390/1] test_compile passed -- running: test_concurrent_futures (52 sec)
0:02:09 load avg: 4.31 [314/390/1] test_abstract_numbers passed -- running: test_concurrent_futures (52 sec)
0:02:10 load avg: 4.44 [315/390/1] test_doctest2 passed -- running: test_concurrent_futures (52 sec)
0:02:10 load avg: 4.44 [316/390/1] test_setcomps passed -- running: test_concurrent_futures (52 sec)
0:02:12 load avg: 4.44 [317/390/1] test_time passed -- running: test_concurrent_futures (54 sec)
0:02:12 load avg: 4.44 [318/390/1] test_imghdr passed -- running: test_concurrent_futures (55 sec)
0:02:13 load avg: 4.44 [319/390/1] test_configparser passed -- running: test_concurrent_futures (55 sec), test_multiprocessing_spawn (31 sec)
0:02:14 load avg: 4.44 [320/390/1] test_trace passed -- running: test_concurrent_futures (57 sec), test_multiprocessing_spawn (32 sec)
0:02:14 load avg: 4.41 [321/390/1] test_glob passed -- running: test_concurrent_futures (57 sec), test_multiprocessing_spawn (32 sec)
0:02:15 load avg: 4.41 [322/390/1] test_fnmatch passed -- running: test_concurrent_futures (57 sec), test_multiprocessing_spawn (33 sec)
0:02:15 load avg: 4.41 [323/390/1] test_typechecks passed -- running: test_concurrent_futures (57 sec), test_multiprocessing_spawn (33 sec)
0:02:15 load avg: 4.41 [324/390/1] test_binop passed -- running: test_concurrent_futures (58 sec), test_multiprocessing_spawn (33 sec)
0:02:15 load avg: 4.41 [325/390/1] test_smtpd passed -- running: test_concurrent_futures (58 sec), test_multiprocessing_spawn (33 sec)
0:02:16 load avg: 4.41 [326/390/1] test_contextlib passed -- running: test_concurrent_futures (58 sec), test_multiprocessing_spawn (33 sec)
0:02:16 load avg: 4.41 [327/390/1] test_dynamicclassattribute passed -- running: test_concurrent_futures (58 sec), test_multiprocessing_spawn (34 sec)
0:02:16 load avg: 4.41 [328/390/1] test_tarfile passed -- running: test_concurrent_futures (58 sec), test_multiprocessing_spawn (34 sec)
0:02:16 load avg: 4.41 [329/390/1] test_zipapp passed -- running: test_concurrent_futures (59 sec), test_multiprocessing_spawn (34 sec)
0:02:16 load avg: 4.41 [330/390/1] test_builtin passed -- running: test_concurrent_futures (59 sec), test_multiprocessing_spawn (34 sec)
0:02:16 load avg: 4.41 [331/390/1] test_codecmaps_cn passed -- running: test_concurrent_futures (59 sec), test_multiprocessing_spawn (34 sec)
0:02:16 load avg: 4.41 [332/390/1] test_shlex passed -- running: test_concurrent_futures (59 sec), test_multiprocessing_spawn (34 sec)
0:02:17 load avg: 4.41 [333/390/1] test_slice passed -- running: test_concurrent_futures (59 sec), test_multiprocessing_spawn (34 sec)
0:02:17 load avg: 4.41 [334/390/1] test_popen passed -- running: test_concurrent_futures (59 sec), test_multiprocessing_spawn (35 sec)
0:02:17 load avg: 4.41 [335/390/1] test_string passed -- running: test_concurrent_futures (60 sec), test_multiprocessing_spawn (35 sec)
0:02:17 load avg: 4.41 [336/390/1] test_contains passed -- running: test_concurrent_futures (60 sec), test_multiprocessing_spawn (35 sec)
0:02:18 load avg: 4.41 [337/390/1] test_thread passed -- running: test_concurrent_futures (61 sec), test_multiprocessing_spawn (36 sec)
0:02:18 load avg: 4.41 [338/390/1] test_devpoll skipped -- running: test_concurrent_futures (61 sec), test_multiprocessing_spawn (36 sec)
test_devpoll skipped -- test works only on Solaris OS family
0:02:19 load avg: 4.41 [339/390/1] test_gzip passed -- running: test_concurrent_futures (61 sec), test_multiprocessing_spawn (37 sec)
0:02:19 load avg: 4.41 [340/390/1] test_keywordonlyarg passed -- running: test_concurrent_futures (62 sec), test_multiprocessing_spawn (37 sec)
0:02:19 load avg: 4.41 [341/390/1] test_codeccallbacks passed -- running: test_concurrent_futures (62 sec), test_multiprocessing_spawn (37 sec)
0:02:19 load avg: 4.21 [342/390/1] test_iterlen passed -- running: test_concurrent_futures (62 sec), test_multiprocessing_spawn (37 sec)
0:02:20 load avg: 4.21 [343/390/1] test_descrtut passed -- running: test_concurrent_futures (62 sec), test_multiprocessing_spawn (38 sec)
0:02:20 load avg: 4.21 [344/390/1] test_urllibnet passed -- running: test_concurrent_futures (62 sec), test_multiprocessing_spawn (38 sec)
Resource 'www.example.com' is not available
Resource 'http://www.pythontest.net/' is not available
Resource 'http://www.pythontest.net/XXXinvalidXXX' is not available
Resource 'http://www.pythontest.net/' is not available
Resource 'http://www.pythontest.net/' is not available
Resource 'http://www.pythontest.net/' is not available
Resource 'http://www.pythontest.net/' is not available
Resource 'http://www.pythontest.net/' is not available
Resource 'http://www.pythontest.net/' is not available
Resource 'http://www.pythontest.net/' is not available
Resource 'http://www.pythontest.net/' is not available
0:02:20 load avg: 4.21 [345/390/1] test_queue passed -- running: test_concurrent_futures (62 sec), test_multiprocessing_spawn (38 sec)
0:02:20 load avg: 4.21 [346/390/1] test_http_cookiejar passed -- running: test_concurrent_futures (63 sec), test_multiprocessing_spawn (38 sec)
0:02:20 load avg: 4.21 [347/390/1] test_structseq passed -- running: test_concurrent_futures (63 sec), test_multiprocessing_spawn (38 sec)
0:02:20 load avg: 4.21 [348/390/1] test_code_module passed -- running: test_concurrent_futures (63 sec), test_multiprocessing_spawn (38 sec)
0:02:21 load avg: 4.21 [349/390/1] test_memoryio passed -- running: test_concurrent_futures (63 sec), test_multiprocessing_spawn (39 sec)
0:02:22 load avg: 4.21 [350/390/1] test_concurrent_futures passed (64 sec) -- running: test_multiprocessing_spawn (40 sec)
0:02:23 load avg: 4.21 [351/390/1] test_fractions passed -- running: test_multiprocessing_spawn (40 sec)
0:02:24 load avg: 4.21 [352/390/1] test_faulthandler passed -- running: test_multiprocessing_spawn (42 sec)
0:02:24 load avg: 4.21 [353/390/1] test_hash passed -- running: test_multiprocessing_spawn (42 sec)
0:02:25 load avg: 4.28 [354/390/1] test_base64 passed -- running: test_multiprocessing_spawn (43 sec)
0:02:27 load avg: 4.28 [355/390/1] test_unicodedata passed -- running: test_multiprocessing_spawn (45 sec)
0:02:28 load avg: 4.28 [356/390/1] test_codecmaps_kr passed -- running: test_multiprocessing_spawn (46 sec)
0:02:36 load avg: 4.77 [357/390/1] test_capi passed -- running: test_multiprocessing_spawn (54 sec)
0:02:37 load avg: 4.77 [358/390/1] test_poll passed -- running: test_multiprocessing_spawn (54 sec)
0:02:37 load avg: 4.77 [359/390/1] test_pow passed -- running: test_multiprocessing_spawn (55 sec)
0:02:37 load avg: 4.77 [360/390/1] test_heapq passed -- running: test_multiprocessing_spawn (55 sec)
0:02:37 load avg: 4.77 [361/390/1] test_xml_dom_minicompat passed -- running: test_multiprocessing_spawn (55 sec)
0:02:39 load avg: 4.77 [362/390/1] test_shelve passed -- running: test_multiprocessing_spawn (57 sec)
0:02:39 load avg: 4.77 [363/390/1] test_cgi passed -- running: test_multiprocessing_spawn (57 sec)
0:02:40 load avg: 4.87 [364/390/1] test_rlcompleter passed -- running: test_multiprocessing_spawn (58 sec)
0:02:42 load avg: 4.87 [365/390/1] test_xmlrpc passed -- running: test_multiprocessing_spawn (60 sec)
0:02:42 load avg: 4.87 [366/390/1] test_itertools passed -- running: test_multiprocessing_spawn (60 sec)
0:02:42 load avg: 4.87 [367/390/1] test_abc passed -- running: test_multiprocessing_spawn (60 sec)
0:02:43 load avg: 4.87 [368/390/1] test_index passed -- running: test_multiprocessing_spawn (61 sec)
0:02:43 load avg: 4.87 [369/390/1] test_listcomps passed -- running: test_multiprocessing_spawn (61 sec)
0:02:43 load avg: 4.87 [370/390/1] test_genexps passed -- running: test_lib2to3 (30 sec), test_multiprocessing_spawn (61 sec)
0:02:43 load avg: 4.87 [371/390/1] test_uuid passed -- running: test_lib2to3 (31 sec), test_multiprocessing_spawn (61 sec)
0:02:44 load avg: 4.87 [372/390/1] test_wave passed -- running: test_lib2to3 (31 sec), test_multiprocessing_spawn (62 sec)
0:02:44 load avg: 4.87 [373/390/1] test_osx_env passed -- running: test_lib2to3 (31 sec), test_multiprocessing_spawn (62 sec)
0:02:44 load avg: 4.87 [374/390/1] test_dictcomps passed -- running: test_lib2to3 (31 sec), test_multiprocessing_spawn (62 sec)
0:02:45 load avg: 4.96 [375/390/1] test_crypt passed -- running: test_lib2to3 (32 sec), test_multiprocessing_spawn (63 sec)
0:02:47 load avg: 4.96 [376/390/1] test_httpservers passed -- running: test_lib2to3 (34 sec), test_multiprocessing_spawn (65 sec)
0:02:47 load avg: 4.96 [377/390/1] test_future4 passed -- running: test_lib2to3 (34 sec), test_multiprocessing_spawn (65 sec)
0:02:47 load avg: 4.96 [378/390/1] test_webbrowser passed -- running: test_lib2to3 (34 sec), test_multiprocessing_spawn (65 sec)
0:02:47 load avg: 4.96 [379/390/1] test_lzma passed -- running: test_lib2to3 (35 sec), test_multiprocessing_spawn (65 sec)
0:02:48 load avg: 4.96 [380/390/1] test_global passed -- running: test_lib2to3 (35 sec), test_multiprocessing_spawn (65 sec)
0:02:48 load avg: 4.96 [381/390/1] test_sys_setprofile passed -- running: test_lib2to3 (35 sec), test_multiprocessing_spawn (66 sec)
0:02:48 load avg: 4.96 [382/390/1] test_pwd passed -- running: test_lib2to3 (35 sec), test_multiprocessing_spawn (66 sec)
0:02:48 load avg: 4.96 [383/390/1] test_pyexpat passed -- running: test_lib2to3 (35 sec), test_multiprocessing_spawn (66 sec)
0:02:48 load avg: 4.96 [384/390/1] test_utf8source passed -- running: test_lib2to3 (35 sec), test_multiprocessing_spawn (66 sec)
0:02:48 load avg: 4.96 [385/390/1] test_stat passed -- running: test_lib2to3 (35 sec), test_multiprocessing_spawn (66 sec)
0:02:49 load avg: 4.96 [386/390/1] test___all__ passed -- running: test_lib2to3 (36 sec), test_multiprocessing_spawn (67 sec)
0:03:02 load avg: 4.53 [387/390/1] test_lib2to3 passed (49 sec) -- running: test_tokenize (41 sec), test_multiprocessing_spawn (80 sec)
0:03:06 load avg: 4.33 [388/390/1] test_signal passed -- running: test_tokenize (45 sec), test_multiprocessing_spawn (83 sec)
0:03:19 load avg: 3.81 [389/390/1] test_multiprocessing_spawn passed (97 sec) -- running: test_tokenize (58 sec)
0:03:19 load avg: 3.81 [390/390/1] test_tokenize passed (58 sec)
374 tests OK.

1 test failed:
    test_normalization

15 tests skipped:
    test_devpoll test_ioctl test_kqueue test_msilib test_ossaudiodev
    test_startfile test_tix test_tk test_ttk_guionly test_unicode_file
    test_unicode_file_functions test_winconsoleio test_winreg
    test_winsound test_zipfile64
Re-running failed tests in verbose mode
Re-running test 'test_normalization' in verbose mode
test_bug_834676 (test.test_normalization.NormalizationTest) ... ok
test_main (test.test_normalization.NormalizationTest) ... test test_normalization failed
	fetching http://www.pythontest.net/unicode/9.0.0/NormalizationTest.txt ...
FAIL

======================================================================
FAIL: test_main (test.test_normalization.NormalizationTest)
----------------------------------------------------------------------
Traceback (most recent call last):
  File "/tmp/B.XHAvYT/BUILD/Python-3.6.3/Lib/urllib/request.py", line 1318, in do_open
    encode_chunked=req.has_header('Transfer-encoding'))
socket.gaierror: [Errno -3] Temporary failure in name resolution

During handling of the above exception, another exception occurred:

Traceback (most recent call last):
  File "/tmp/B.XHAvYT/BUILD/Python-3.6.3/Lib/test/test_normalization.py", line 42, in test_main
    check=check_version)
urllib.error.URLError: <urlopen error [Errno -3] Temporary failure in name resolution>

During handling of the above exception, another exception occurred:

Traceback (most recent call last):
  File "/tmp/B.XHAvYT/BUILD/Python-3.6.3/Lib/test/test_normalization.py", line 47, in test_main
    self.fail(f"Could not retrieve {TESTDATAURL}")
AssertionError: Could not retrieve http://www.pythontest.net/unicode/9.0.0/NormalizationTest.txt

----------------------------------------------------------------------
Ran 2 tests in 0.008s

FAILED (failures=1)
1 test failed again:
    test_normalization

Total duration: 3 min 20 sec
Tests result: FAILURE
make: *** [Makefile:1025: test] Error 2
error: Bad exit status from /tmp/B.XHAvYT/BUILD/tmp/rpm-tmp.56143 (%build)


RPM build errors:
    Bad exit status from /tmp/B.XHAvYT/BUILD/tmp/rpm-tmp.56143 (%build)
ended at: Wed Oct  4 10:02:51 2017, done in 0:04:28.676517
mesg: ttyname failed: Inappropriate ioctl for device
+ chmod -R u+rwX /tmp/B.XHAvYT/BUILD
+ rm -rf /tmp/B.XHAvYT/tmp /tmp/B.XHAvYT/BUILD
copy rpm files to cache_dir: /spools/ready
cp: cannot stat '/tmp/B.XHAvYT/BUILD/tmp/tmp0w2qkbbp/foo/build/bdist.linux-x86_64/rpm/RPMS/foo-0.1-1.noarch.rpm': No such file or directory
cp: cannot stat '/tmp/B.XHAvYT/BUILD/tmp/tmp0w2qkbbp/foo/build/bdist.linux-x86_64/rpm/SRPMS/foo-0.1-1.src.rpm': No such file or directory
Begin-PLD-Builder-Info
upgrading packages
error: open of /tmp/B.XHAvYT/BUILD/tmp/tmp0w2qkbbp/foo/build/bdist.linux-x86_64/rpm/RPMS/foo-0.1-1.noarch.rpm failed: No such file or directory
package upgrade failed
End-PLD-Builder-Info
mesg: ttyname failed: Inappropriate ioctl for device
+ rm -rf /tmp/B.XHAvYT
Begin-PLD-Builder-Info
Build-Time: user:625.22s sys:48.18s real:275.22s (faults io:70 non-io:12560603)

Files queued for ftp:
         0 foo-0.1-1.noarch.rpm
         0 foo-0.1-1.src.rpm
        98 python3-3.6.3-1.src.rpm.uploadinfo

End-PLD-Builder-Info
[Back to list of logs] [View rpm -qa of builder]