FailedOk

th/SRPMS[OK]
th/x32[OK]
th/i686[OK]
th/x86_64[OK]

ac/SRPMS[OK]
ac/i386[OK]
ac/i586[OK]
ac/i686[OK]
ac/alpha[OK]
ac/amd64[OK]
ac/athlon[OK]
ac/ppc[OK]
ac/sparc[OK]
ac/sparc64[OK]

Advanced Search
main()
Powered by PLD Linux
(c) 2002-2018 PLD Team
$Revision: 1.37 $
Powered by Microsoft Windows 2003.
Your IP: 54.147.142.16

python3 d10d9539-ed88-4f43-904b-3ee475a5a93f

Status:Failed
Source URL:ftp://buildlogs.pld-linux.org/th/x86_64/FAIL/python3,d10d9539-ed88-4f43-904b-3ee475a5a93f.bz2
text/plain URL:View!
full text:View!
rpm -qa of builder:View!
Date:2018/06/18 06:19:41
Runtime:0:03:15.096999

Toc:

  • files foo
  • Processing files: foo-0.1-1.noarch
  • clean
  • Executing(%clean): /bin/sh -e /tmp/B.8NdzK7/BUILD/tmp/rpm-tmp.29130
  • prep
  • Executing(%prep): /bin/sh -e /tmp/B.8NdzK7/BUILD/tmp/rpm-tmp.73685
  • build
  • Executing(%build): /bin/sh -e /tmp/B.8NdzK7/BUILD/tmp/rpm-tmp.73685
  • install
  • Executing(%install): /bin/sh -e /tmp/B.8NdzK7/BUILD/tmp/rpm-tmp.73685
  • files foo
  • Processing files: foo-0.1-1.noarch
  • clean
  • Executing(%clean): /bin/sh -e /tmp/B.8NdzK7/BUILD/tmp/rpm-tmp.86460
  • error 1
  • FAIL: test_interpreter_requires_environment_details (test.test_script_helper.TestScriptHelperEnvironment)
  • error 2
  • AssertionError: True is not false
  • error 3
  • FAIL: test_interpreter_requires_environment_false (test.test_script_helper.TestScriptHelperEnvironment)
  • error 4
  • AssertionError: True is not false
  • error 5
  • FAIL: test_interpreter_requires_environment_true (test.test_script_helper.TestScriptHelperEnvironment)
  • error 6
  • AssertionError: 1 != 0
  • error 7
  • error: Bad exit status from /tmp/B.8NdzK7/BUILD/tmp/rpm-tmp.68097 (%build)
  • error 8
  • RPM build errors:

Content:

0:01:07 load avg: 6.30 [261/390/1] test_turtle passed -- running: test_multiprocessing_fork (49 sec), test_lib2to3 (40 sec), test_multiprocessing_forkserver (65 sec), test_multiprocessing_spawn (65 sec)
0:01:07 load avg: 6.30 [262/390/1] test_class passed -- running: test_multiprocessing_fork (49 sec), test_lib2to3 (40 sec), test_multiprocessing_forkserver (65 sec), test_multiprocessing_spawn (65 sec)
0:01:08 load avg: 6.30 [263/390/1] test_pyclbr passed -- running: test_multiprocessing_fork (49 sec), test_lib2to3 (41 sec), test_multiprocessing_forkserver (66 sec), test_multiprocessing_spawn (65 sec)
0:01:08 load avg: 6.30 [264/390/1] test_binascii passed -- running: test_multiprocessing_fork (49 sec), test_lib2to3 (41 sec), test_multiprocessing_forkserver (66 sec), test_multiprocessing_spawn (65 sec)
0:01:08 load avg: 6.30 [265/390/1] test___all__ passed -- running: test_multiprocessing_fork (49 sec), test_lib2to3 (41 sec), test_multiprocessing_forkserver (66 sec), test_multiprocessing_spawn (65 sec)
0:01:08 load avg: 6.30 [266/390/1] test_super passed -- running: test_multiprocessing_fork (50 sec), test_lib2to3 (41 sec), test_multiprocessing_forkserver (66 sec), test_multiprocessing_spawn (66 sec)
0:01:08 load avg: 6.30 [267/390/1] test_tix skipped (resource denied) -- running: test_multiprocessing_fork (50 sec), test_lib2to3 (41 sec), test_multiprocessing_forkserver (66 sec), test_multiprocessing_spawn (66 sec)
test_tix skipped -- Use of the 'gui' resource not enabled
0:01:08 load avg: 6.30 [268/390/1] test_dbm_gnu passed -- running: test_multiprocessing_fork (50 sec), test_lib2to3 (41 sec), test_multiprocessing_forkserver (66 sec), test_multiprocessing_spawn (66 sec)
0:01:08 load avg: 6.30 [269/390/1] test_generator_stop passed -- running: test_multiprocessing_fork (50 sec), test_lib2to3 (41 sec), test_multiprocessing_forkserver (66 sec), test_multiprocessing_spawn (66 sec)
0:01:09 load avg: 6.30 [270/390/1] test_queue passed -- running: test_multiprocessing_fork (50 sec), test_lib2to3 (42 sec), test_multiprocessing_forkserver (67 sec), test_multiprocessing_spawn (66 sec)
0:01:09 load avg: 6.30 [271/390/1] test_isinstance passed -- running: test_multiprocessing_fork (50 sec), test_lib2to3 (42 sec), test_multiprocessing_forkserver (67 sec), test_multiprocessing_spawn (66 sec)
0:01:09 load avg: 6.30 [272/390/1] test_pprint passed -- running: test_multiprocessing_fork (51 sec), test_lib2to3 (42 sec), test_multiprocessing_forkserver (67 sec), test_multiprocessing_spawn (67 sec)
0:01:09 load avg: 6.43 [273/390/1] test_keywordonlyarg passed -- running: test_multiprocessing_fork (51 sec), test_lib2to3 (42 sec), test_multiprocessing_forkserver (67 sec), test_multiprocessing_spawn (67 sec)
0:01:09 load avg: 6.43 [274/390/1] test_macurl2path passed -- running: test_multiprocessing_fork (51 sec), test_lib2to3 (42 sec), test_multiprocessing_forkserver (67 sec), test_multiprocessing_spawn (67 sec)
0:01:09 load avg: 6.43 [275/390/1] test_argparse passed -- running: test_multiprocessing_fork (51 sec), test_lib2to3 (42 sec), test_multiprocessing_forkserver (67 sec), test_multiprocessing_spawn (67 sec)
0:01:10 load avg: 6.43 [276/390/1] test_curses passed -- running: test_multiprocessing_fork (51 sec), test_lib2to3 (43 sec), test_multiprocessing_forkserver (68 sec), test_multiprocessing_spawn (67 sec)
0:01:10 load avg: 6.43 [277/390/1] test_fstring passed -- running: test_multiprocessing_fork (52 sec), test_lib2to3 (43 sec), test_multiprocessing_forkserver (68 sec), test_multiprocessing_spawn (68 sec)
0:01:10 load avg: 6.43 [278/390/1] test_codecs passed -- running: test_multiprocessing_fork (52 sec), test_lib2to3 (44 sec), test_multiprocessing_forkserver (68 sec), test_multiprocessing_spawn (68 sec)
0:01:11 load avg: 6.43 [279/390/1] test_sax passed -- running: test_multiprocessing_fork (52 sec), test_lib2to3 (44 sec), test_multiprocessing_forkserver (69 sec), test_multiprocessing_spawn (68 sec)
0:01:11 load avg: 6.43 [280/390/1] test_plistlib passed -- running: test_multiprocessing_fork (53 sec), test_lib2to3 (44 sec), test_multiprocessing_forkserver (69 sec), test_multiprocessing_spawn (69 sec)
0:01:11 load avg: 6.43 [281/390/1] test_contextlib passed -- running: test_multiprocessing_fork (53 sec), test_lib2to3 (44 sec), test_multiprocessing_forkserver (69 sec), test_multiprocessing_spawn (69 sec)
0:01:11 load avg: 6.43 [282/390/1] test_frame passed -- running: test_multiprocessing_fork (53 sec), test_lib2to3 (44 sec), test_multiprocessing_forkserver (69 sec), test_multiprocessing_spawn (69 sec)
0:01:12 load avg: 6.43 [283/390/1] test_runpy passed -- running: test_multiprocessing_fork (53 sec), test_lib2to3 (45 sec), test_multiprocessing_forkserver (70 sec), test_multiprocessing_spawn (69 sec)
0:01:12 load avg: 6.43 [284/390/1] test_xmlrpc_net passed -- running: test_multiprocessing_fork (53 sec), test_lib2to3 (45 sec), test_multiprocessing_forkserver (70 sec), test_multiprocessing_spawn (69 sec)
0:01:12 load avg: 6.43 [285/390/1] test_strptime passed -- running: test_multiprocessing_fork (54 sec), test_lib2to3 (45 sec), test_multiprocessing_forkserver (70 sec), test_multiprocessing_spawn (70 sec)
0:01:12 load avg: 6.43 [286/390/1] test_bool passed -- running: test_multiprocessing_fork (54 sec), test_lib2to3 (45 sec), test_multiprocessing_forkserver (70 sec), test_multiprocessing_spawn (70 sec)
0:01:12 load avg: 6.43 [287/390/1] test_dict passed -- running: test_multiprocessing_fork (54 sec), test_lib2to3 (45 sec), test_multiprocessing_forkserver (70 sec), test_multiprocessing_spawn (70 sec)
0:01:13 load avg: 6.43 [288/390/1] test_zipapp passed -- running: test_multiprocessing_fork (54 sec), test_lib2to3 (46 sec), test_multiprocessing_forkserver (71 sec), test_multiprocessing_spawn (70 sec)
0:01:13 load avg: 6.43 [289/390/1] test_winreg skipped -- running: test_multiprocessing_fork (54 sec), test_lib2to3 (46 sec), test_multiprocessing_forkserver (71 sec), test_multiprocessing_spawn (70 sec)
test_winreg skipped -- No module named 'winreg'
0:01:13 load avg: 6.43 [290/390/1] test_unicode_identifiers passed -- running: test_multiprocessing_fork (54 sec), test_lib2to3 (46 sec), test_multiprocessing_forkserver (71 sec), test_multiprocessing_spawn (70 sec)
0:01:13 load avg: 6.43 [291/390/1] test_imaplib passed -- running: test_multiprocessing_fork (55 sec), test_lib2to3 (46 sec), test_multiprocessing_forkserver (71 sec), test_multiprocessing_spawn (71 sec)
Resource 'cyrus.andrew.cmu.edu' is not available
Resource 'cyrus.andrew.cmu.edu' is not available
Resource 'cyrus.andrew.cmu.edu' is not available
Resource 'cyrus.andrew.cmu.edu' is not available
Resource 'cyrus.andrew.cmu.edu' is not available
Resource 'cyrus.andrew.cmu.edu' is not available
0:01:13 load avg: 6.43 [292/390/1] test_popen passed -- running: test_multiprocessing_fork (55 sec), test_lib2to3 (46 sec), test_multiprocessing_forkserver (71 sec), test_multiprocessing_spawn (71 sec)
0:01:13 load avg: 6.43 [293/390/1] test_tcl passed -- running: test_multiprocessing_fork (55 sec), test_lib2to3 (46 sec), test_multiprocessing_forkserver (71 sec), test_multiprocessing_spawn (71 sec)
0:01:13 load avg: 6.43 [294/390/1] test_cmd passed -- running: test_multiprocessing_fork (55 sec), test_lib2to3 (46 sec), test_multiprocessing_forkserver (71 sec), test_multiprocessing_spawn (71 sec)
0:01:14 load avg: 6.43 [295/390/1] test_quopri passed -- running: test_multiprocessing_fork (55 sec), test_lib2to3 (47 sec), test_multiprocessing_forkserver (72 sec), test_multiprocessing_spawn (71 sec)
0:01:14 load avg: 6.43 [296/390/1] test_tracemalloc passed -- running: test_multiprocessing_fork (55 sec), test_lib2to3 (47 sec), test_multiprocessing_forkserver (72 sec), test_multiprocessing_spawn (71 sec)
0:01:14 load avg: 6.43 [297/390/1] test_typing passed -- running: test_multiprocessing_fork (55 sec), test_lib2to3 (47 sec), test_multiprocessing_forkserver (72 sec), test_multiprocessing_spawn (71 sec)
0:01:14 load avg: 6.43 [298/390/1] test_structmembers passed -- running: test_multiprocessing_fork (55 sec), test_lib2to3 (47 sec), test_multiprocessing_forkserver (72 sec), test_multiprocessing_spawn (71 sec)
0:01:14 load avg: 6.43 [299/390/1] test_imghdr passed -- running: test_multiprocessing_fork (56 sec), test_lib2to3 (47 sec), test_multiprocessing_forkserver (72 sec), test_multiprocessing_spawn (72 sec)
0:01:14 load avg: 6.40 [300/390/1] test_ipaddress passed -- running: test_multiprocessing_fork (56 sec), test_lib2to3 (47 sec), test_multiprocessing_forkserver (72 sec), test_multiprocessing_spawn (72 sec)
0:01:14 load avg: 6.40 [301/390/1] test_numeric_tower passed -- running: test_multiprocessing_fork (56 sec), test_lib2to3 (47 sec), test_multiprocessing_forkserver (72 sec), test_multiprocessing_spawn (72 sec)
0:01:14 load avg: 6.40 [302/390/1] test_urlparse passed -- running: test_multiprocessing_fork (56 sec), test_lib2to3 (47 sec), test_multiprocessing_forkserver (72 sec), test_multiprocessing_spawn (72 sec)
0:01:14 load avg: 6.40 [303/390/1] test_distutils passed -- running: test_multiprocessing_fork (56 sec), test_lib2to3 (47 sec), test_multiprocessing_forkserver (72 sec), test_multiprocessing_spawn (72 sec)
Executing(%prep): /bin/sh -e /tmp/B.8NdzK7/BUILD/tmp/rpm-tmp.29130
drwxr-xr-x builder/users     0 2018-06-18 06:18 foo-0.1/
-rw-r--r-- builder/users     0 2018-06-18 06:18 foo-0.1/README
-rw-r--r-- builder/users     1 2018-06-18 06:18 foo-0.1/foo.py
-rw-r--r-- builder/users   150 2018-06-18 06:18 foo-0.1/setup.py
-rw-r--r-- builder/users   163 2018-06-18 06:18 foo-0.1/PKG-INFO
Executing(%build): /bin/sh -e /tmp/B.8NdzK7/BUILD/tmp/rpm-tmp.29130
TMP=/home/users/builder/tmp
HOME=/tmp/B.8NdzK7/BUILD/tmp/tmpi970_dme
PATH=/home/users/builder/GNUstep/Tools:/usr/local/bin:/usr/bin:/bin:/home/users/builder/bin
TMPDIR=/tmp/B.8NdzK7/BUILD/tmp
running build
running build_py
creating build
creating build/lib
copying foo.py -> build/lib
Executing(%install): /bin/sh -e /tmp/B.8NdzK7/BUILD/tmp/rpm-tmp.29130
TMP=/home/users/builder/tmp
HOME=/tmp/B.8NdzK7/BUILD/tmp/tmpi970_dme
PATH=/home/users/builder/GNUstep/Tools:/usr/local/bin:/usr/bin:/bin:/home/users/builder/bin
TMPDIR=/tmp/B.8NdzK7/BUILD/tmp
running install
running build
running build_py
running install_lib
creating /tmp/B.8NdzK7/BUILD/tmp/foo-0.1-root-builder/tmp
creating /tmp/B.8NdzK7/BUILD/tmp/foo-0.1-root-builder/tmp/B.8NdzK7
creating /tmp/B.8NdzK7/BUILD/tmp/foo-0.1-root-builder/tmp/B.8NdzK7/BUILD
creating /tmp/B.8NdzK7/BUILD/tmp/foo-0.1-root-builder/tmp/B.8NdzK7/BUILD/Python-3.6.5
creating /tmp/B.8NdzK7/BUILD/tmp/foo-0.1-root-builder/tmp/B.8NdzK7/BUILD/Python-3.6.5/lib64
creating /tmp/B.8NdzK7/BUILD/tmp/foo-0.1-root-builder/tmp/B.8NdzK7/BUILD/Python-3.6.5/lib64/python3.6
creating /tmp/B.8NdzK7/BUILD/tmp/foo-0.1-root-builder/tmp/B.8NdzK7/BUILD/Python-3.6.5/lib64/python3.6/site-packages
copying build/lib/foo.py -> /tmp/B.8NdzK7/BUILD/tmp/foo-0.1-root-builder/tmp/B.8NdzK7/BUILD/Python-3.6.5/lib64/python3.6/site-packages
byte-compiling /tmp/B.8NdzK7/BUILD/tmp/foo-0.1-root-builder/tmp/B.8NdzK7/BUILD/Python-3.6.5/lib64/python3.6/site-packages/foo.py to foo.cpython-36.pyc
writing byte-compilation script '/tmp/B.8NdzK7/BUILD/tmp/tmpxmfa522i.py'
/tmp/B.8NdzK7/BUILD/Python-3.6.5/python /tmp/B.8NdzK7/BUILD/tmp/tmpxmfa522i.py
removing /tmp/B.8NdzK7/BUILD/tmp/tmpxmfa522i.py
running install_egg_info
Writing /tmp/B.8NdzK7/BUILD/tmp/foo-0.1-root-builder/tmp/B.8NdzK7/BUILD/Python-3.6.5/lib64/python3.6/site-packages/foo-0.1-py3.6.egg-info
writing list of installed files to 'INSTALLED_FILES'
RPM_BUILD_DIR=/tmp/B.8NdzK7/BUILD/tmp/tmpi970_dme/foo/build/bdist.linux-x86_64/rpm/BUILD

Searching for shared objects with unresolved symbols... DONE
Checking /var/run <-> tmpfiles.d completeness...
 DONE
Checking script shebangs...
 DONE
Hardlink Python files: 0/2 files hardlinked
Processing files: foo-0.1-1.noarch
Checking for unpackaged file(s): /usr/lib/rpm/check-files /tmp/B.8NdzK7/BUILD/tmp/foo-0.1-root-builder
Wrote: /tmp/B.8NdzK7/BUILD/tmp/tmpi970_dme/foo/build/bdist.linux-x86_64/rpm/SRPMS/foo-0.1-1.src.rpm
Wrote: /tmp/B.8NdzK7/BUILD/tmp/tmpi970_dme/foo/build/bdist.linux-x86_64/rpm/RPMS/foo-0.1-1.noarch.rpm
Executing(%clean): /bin/sh -e /tmp/B.8NdzK7/BUILD/tmp/rpm-tmp.29130
Executing(--clean): /bin/sh -e /tmp/B.8NdzK7/BUILD/tmp/rpm-tmp.29130
Executing(%prep): /bin/sh -e /tmp/B.8NdzK7/BUILD/tmp/rpm-tmp.73685
drwxr-xr-x builder/users     0 2018-06-18 06:18 foo-0.1/
-rw-r--r-- builder/users     0 2018-06-18 06:18 foo-0.1/README
-rw-r--r-- builder/users     1 2018-06-18 06:18 foo-0.1/foo.py
-rw-r--r-- builder/users   150 2018-06-18 06:18 foo-0.1/setup.py
-rw-r--r-- builder/users   163 2018-06-18 06:18 foo-0.1/PKG-INFO
Executing(%build): /bin/sh -e /tmp/B.8NdzK7/BUILD/tmp/rpm-tmp.73685
TMP=/home/users/builder/tmp
HOME=/tmp/B.8NdzK7/BUILD/tmp/tmp7i4z4j3d
PATH=/home/users/builder/GNUstep/Tools:/usr/local/bin:/usr/bin:/bin:/home/users/builder/bin
TMPDIR=/tmp/B.8NdzK7/BUILD/tmp
running build
running build_py
creating build
creating build/lib
copying foo.py -> build/lib
Executing(%install): /bin/sh -e /tmp/B.8NdzK7/BUILD/tmp/rpm-tmp.73685
TMP=/home/users/builder/tmp
HOME=/tmp/B.8NdzK7/BUILD/tmp/tmp7i4z4j3d
PATH=/home/users/builder/GNUstep/Tools:/usr/local/bin:/usr/bin:/bin:/home/users/builder/bin
TMPDIR=/tmp/B.8NdzK7/BUILD/tmp
running install
running build
running build_py
running install_lib
creating /tmp/B.8NdzK7/BUILD/tmp/foo-0.1-root-builder/tmp
creating /tmp/B.8NdzK7/BUILD/tmp/foo-0.1-root-builder/tmp/B.8NdzK7
creating /tmp/B.8NdzK7/BUILD/tmp/foo-0.1-root-builder/tmp/B.8NdzK7/BUILD
creating /tmp/B.8NdzK7/BUILD/tmp/foo-0.1-root-builder/tmp/B.8NdzK7/BUILD/Python-3.6.5
creating /tmp/B.8NdzK7/BUILD/tmp/foo-0.1-root-builder/tmp/B.8NdzK7/BUILD/Python-3.6.5/lib64
creating /tmp/B.8NdzK7/BUILD/tmp/foo-0.1-root-builder/tmp/B.8NdzK7/BUILD/Python-3.6.5/lib64/python3.6
creating /tmp/B.8NdzK7/BUILD/tmp/foo-0.1-root-builder/tmp/B.8NdzK7/BUILD/Python-3.6.5/lib64/python3.6/site-packages
copying build/lib/foo.py -> /tmp/B.8NdzK7/BUILD/tmp/foo-0.1-root-builder/tmp/B.8NdzK7/BUILD/Python-3.6.5/lib64/python3.6/site-packages
byte-compiling /tmp/B.8NdzK7/BUILD/tmp/foo-0.1-root-builder/tmp/B.8NdzK7/BUILD/Python-3.6.5/lib64/python3.6/site-packages/foo.py to foo.cpython-36.pyc
writing byte-compilation script '/tmp/B.8NdzK7/BUILD/tmp/tmpk8rgatck.py'
/tmp/B.8NdzK7/BUILD/Python-3.6.5/python /tmp/B.8NdzK7/BUILD/tmp/tmpk8rgatck.py
removing /tmp/B.8NdzK7/BUILD/tmp/tmpk8rgatck.py
running install_egg_info
Writing /tmp/B.8NdzK7/BUILD/tmp/foo-0.1-root-builder/tmp/B.8NdzK7/BUILD/Python-3.6.5/lib64/python3.6/site-packages/foo-0.1-py3.6.egg-info
writing list of installed files to 'INSTALLED_FILES'
RPM_BUILD_DIR=/tmp/B.8NdzK7/BUILD/tmp/tmp7i4z4j3d/foo/build/bdist.linux-x86_64/rpm/BUILD

Searching for shared objects with unresolved symbols... DONE
Checking /var/run <-> tmpfiles.d completeness...
 DONE
Checking script shebangs...
 DONE
Hardlink Python files: 0/2 files hardlinked
Processing files: foo-0.1-1.noarch
Checking for unpackaged file(s): /usr/lib/rpm/check-files /tmp/B.8NdzK7/BUILD/tmp/foo-0.1-root-builder
Wrote: /tmp/B.8NdzK7/BUILD/tmp/tmp7i4z4j3d/foo/build/bdist.linux-x86_64/rpm/SRPMS/foo-0.1-1.src.rpm
Wrote: /tmp/B.8NdzK7/BUILD/tmp/tmp7i4z4j3d/foo/build/bdist.linux-x86_64/rpm/RPMS/foo-0.1-1.noarch.rpm
Executing(%clean): /bin/sh -e /tmp/B.8NdzK7/BUILD/tmp/rpm-tmp.86460
Executing(--clean): /bin/sh -e /tmp/B.8NdzK7/BUILD/tmp/rpm-tmp.86460
+ umask 022
+ cd /tmp/B.8NdzK7/BUILD/tmp/tmpi970_dme/foo/build/bdist.linux-x86_64/rpm/BUILD
+ cd /tmp/B.8NdzK7/BUILD/tmp/tmpi970_dme/foo/build/bdist.linux-x86_64/rpm/BUILD
+ rm -rf foo-0.1
+ /usr/bin/gzip -dc /tmp/B.8NdzK7/BUILD/tmp/tmpi970_dme/foo/build/bdist.linux-x86_64/rpm/SOURCES/foo-0.1.tar.gz
+ /bin/tar -xvvf -
+ STATUS=0 
+ '[' 0 -ne 0 ']'
+ cd foo-0.1
+ /bin/id -u
+ '[' 1000 '=' 0 ']'
+ /bin/id -u
+ '[' 1000 '=' 0 ']'
+ /bin/chmod -Rf a+rX,u+w,g-w,o-w .
+ exit 0
+ umask 022
+ cd /tmp/B.8NdzK7/BUILD/tmp/tmpi970_dme/foo/build/bdist.linux-x86_64/rpm/BUILD
+ cd foo-0.1
+ /tmp/B.8NdzK7/BUILD/Python-3.6.5/python setup.py build
+ exit 0
+ umask 022
+ cd /tmp/B.8NdzK7/BUILD/tmp/tmpi970_dme/foo/build/bdist.linux-x86_64/rpm/BUILD
+ /bin/rm '--interactive=never' -rf /tmp/B.8NdzK7/BUILD/tmp/foo-0.1-root-builder
+ /bin/mkdir -p /tmp/B.8NdzK7/BUILD/tmp/foo-0.1-root-builder
+ cd foo-0.1
+ /tmp/B.8NdzK7/BUILD/Python-3.6.5/python setup.py install -O1 '--root=/tmp/B.8NdzK7/BUILD/tmp/foo-0.1-root-builder' '--record=INSTALLED_FILES'
+ /usr/lib/rpm/find-debuginfo.sh /tmp/B.8NdzK7/BUILD/tmp/tmpi970_dme/foo/build/bdist.linux-x86_64/rpm/BUILD/foo-0.1
+ __spec_install_post_strip
+ set +x
+ __spec_install_post_chrpath
+ set +x
+ __spec_install_post_compress_modules
+ set +x
+ __spec_install_post_check_so
+ set +x
+ __spec_install_post_check_tmpfiles
+ set +x
+ __spec_install_post_check_shebangs
+ set +x
+ __spec_install_post_compress_docs
+ set +x
+ __spec_install_post_py_hardlink
+ set +x
warning: Could not canonicalize hostname: ymir-builder
+ umask 022
+ cd /tmp/B.8NdzK7/BUILD/tmp/tmpi970_dme/foo/build/bdist.linux-x86_64/rpm/BUILD
+ cd foo-0.1
+ /bin/rm '--interactive=never' -rf /tmp/B.8NdzK7/BUILD/tmp/foo-0.1-root-builder
+ rm -rf /tmp/B.8NdzK7/BUILD/tmp/foo-0.1-root-builder
+ umask 022
+ cd /tmp/B.8NdzK7/BUILD/tmp/tmpi970_dme/foo/build/bdist.linux-x86_64/rpm/BUILD
+ rm -rf foo-0.1
+ umask 022
+ cd /tmp/B.8NdzK7/BUILD/tmp/tmp7i4z4j3d/foo/build/bdist.linux-x86_64/rpm/BUILD
+ cd /tmp/B.8NdzK7/BUILD/tmp/tmp7i4z4j3d/foo/build/bdist.linux-x86_64/rpm/BUILD
+ rm -rf foo-0.1
+ /bin/tar -xvvf -
+ /usr/bin/gzip -dc /tmp/B.8NdzK7/BUILD/tmp/tmp7i4z4j3d/foo/build/bdist.linux-x86_64/rpm/SOURCES/foo-0.1.tar.gz
+ STATUS=0 
+ '[' 0 -ne 0 ']'
+ cd foo-0.1
+ /bin/id -u
+ '[' 1000 '=' 0 ']'
+ /bin/id -u
+ '[' 1000 '=' 0 ']'
+ /bin/chmod -Rf a+rX,u+w,g-w,o-w .
+ exit 0
+ umask 022
+ cd /tmp/B.8NdzK7/BUILD/tmp/tmp7i4z4j3d/foo/build/bdist.linux-x86_64/rpm/BUILD
+ cd foo-0.1
+ /tmp/B.8NdzK7/BUILD/Python-3.6.5/python setup.py build
+ exit 0
+ umask 022
+ cd /tmp/B.8NdzK7/BUILD/tmp/tmp7i4z4j3d/foo/build/bdist.linux-x86_64/rpm/BUILD
+ /bin/rm '--interactive=never' -rf /tmp/B.8NdzK7/BUILD/tmp/foo-0.1-root-builder
+ /bin/mkdir -p /tmp/B.8NdzK7/BUILD/tmp/foo-0.1-root-builder
+ cd foo-0.1
+ /tmp/B.8NdzK7/BUILD/Python-3.6.5/python setup.py install -O1 '--root=/tmp/B.8NdzK7/BUILD/tmp/foo-0.1-root-builder' '--record=INSTALLED_FILES'
+ /usr/lib/rpm/find-debuginfo.sh /tmp/B.8NdzK7/BUILD/tmp/tmp7i4z4j3d/foo/build/bdist.linux-x86_64/rpm/BUILD/foo-0.1
+ __spec_install_post_strip
+ set +x
+ __spec_install_post_chrpath
+ set +x
+ __spec_install_post_compress_modules
+ set +x
+ __spec_install_post_check_so
+ set +x
+ __spec_install_post_check_tmpfiles
+ set +x
+ __spec_install_post_check_shebangs
+ set +x
+ __spec_install_post_compress_docs
+ set +x
+ __spec_install_post_py_hardlink
+ set +x
warning: Could not canonicalize hostname: ymir-builder
+ umask 022
+ cd /tmp/B.8NdzK7/BUILD/tmp/tmp7i4z4j3d/foo/build/bdist.linux-x86_64/rpm/BUILD
+ cd foo-0.1
+ /bin/rm '--interactive=never' -rf /tmp/B.8NdzK7/BUILD/tmp/foo-0.1-root-builder
+ rm -rf /tmp/B.8NdzK7/BUILD/tmp/foo-0.1-root-builder
+ umask 022
+ cd /tmp/B.8NdzK7/BUILD/tmp/tmp7i4z4j3d/foo/build/bdist.linux-x86_64/rpm/BUILD
+ rm -rf foo-0.1
0:01:14 load avg: 6.40 [304/390/1] test_sndhdr passed -- running: test_multiprocessing_fork (56 sec), test_lib2to3 (47 sec), test_multiprocessing_forkserver (72 sec), test_multiprocessing_spawn (72 sec)
0:01:15 load avg: 6.40 [305/390/1] test_syntax passed -- running: test_multiprocessing_fork (56 sec), test_lib2to3 (48 sec), test_multiprocessing_forkserver (73 sec), test_multiprocessing_spawn (72 sec)
0:01:15 load avg: 6.40 [306/390/1] test_httplib passed -- running: test_multiprocessing_fork (56 sec), test_lib2to3 (48 sec), test_multiprocessing_forkserver (73 sec), test_multiprocessing_spawn (72 sec)
Resource 'self-signed.pythontest.net' is not available
Resource 'self-signed.pythontest.net' is not available
Resource 'self-signed.pythontest.net' is not available
Resource 'self-signed.pythontest.net' is not available
Resource 'www.python.org' is not available
0:01:15 load avg: 6.40 [307/390/1] test_compileall passed -- running: test_multiprocessing_fork (57 sec), test_lib2to3 (48 sec), test_multiprocessing_forkserver (73 sec), test_multiprocessing_spawn (73 sec)
0:01:15 load avg: 6.40 [308/390/1] test_lib2to3 passed (48 sec) -- running: test_multiprocessing_fork (57 sec), test_multiprocessing_forkserver (73 sec), test_multiprocessing_spawn (73 sec)
0:01:15 load avg: 6.40 [309/390/1] test_platform passed -- running: test_multiprocessing_fork (57 sec), test_multiprocessing_forkserver (73 sec), test_multiprocessing_spawn (73 sec)
0:01:16 load avg: 6.40 [310/390/1] test_uu passed -- running: test_multiprocessing_fork (57 sec), test_multiprocessing_forkserver (74 sec), test_multiprocessing_spawn (73 sec)
0:01:16 load avg: 6.40 [311/390/1] test_webbrowser passed -- running: test_multiprocessing_fork (58 sec), test_multiprocessing_forkserver (74 sec), test_multiprocessing_spawn (74 sec)
0:01:16 load avg: 6.40 [312/390/1] test_print passed -- running: test_multiprocessing_fork (58 sec), test_multiprocessing_forkserver (74 sec), test_multiprocessing_spawn (74 sec)
0:01:16 load avg: 6.40 [313/390/1] test_parser passed -- running: test_multiprocessing_fork (58 sec), test_multiprocessing_forkserver (74 sec), test_multiprocessing_spawn (74 sec)
0:01:16 load avg: 6.40 [314/390/1] test_multiprocessing_forkserver passed (74 sec) -- running: test_multiprocessing_fork (58 sec), test_multiprocessing_spawn (74 sec)
0:01:17 load avg: 6.40 [315/390/1] test_userlist passed -- running: test_multiprocessing_fork (58 sec), test_multiprocessing_spawn (74 sec)
0:01:17 load avg: 6.40 [316/390/1] test_httpservers passed -- running: test_multiprocessing_fork (58 sec), test_multiprocessing_spawn (74 sec)
0:01:17 load avg: 6.40 [317/390/1] test_yield_from passed -- running: test_multiprocessing_fork (59 sec), test_multiprocessing_spawn (75 sec)
0:01:17 load avg: 6.40 [318/390/1] test_support passed -- running: test_multiprocessing_fork (59 sec), test_multiprocessing_spawn (75 sec)
0:01:17 load avg: 6.40 [319/390/1] test_xml_etree passed -- running: test_multiprocessing_fork (59 sec), test_multiprocessing_spawn (75 sec)
0:01:18 load avg: 6.40 [320/390/1] test_codecmaps_jp passed -- running: test_multiprocessing_fork (59 sec), test_multiprocessing_spawn (75 sec)
0:01:18 load avg: 6.40 [321/390/1] test_cmd_line_script passed -- running: test_multiprocessing_fork (59 sec), test_multiprocessing_spawn (75 sec)
0:01:18 load avg: 6.40 [322/390/1] test__locale passed -- running: test_multiprocessing_fork (60 sec), test_multiprocessing_spawn (76 sec)
0:01:18 load avg: 6.40 [323/390/1] test_netrc passed -- running: test_multiprocessing_fork (60 sec), test_multiprocessing_spawn (76 sec)
0:01:18 load avg: 6.40 [324/390/1] test_opcodes passed -- running: test_multiprocessing_fork (60 sec), test_multiprocessing_spawn (76 sec)
0:01:18 load avg: 6.40 [325/390/1] test_import passed -- running: test_multiprocessing_fork (60 sec), test_multiprocessing_spawn (76 sec)
0:01:18 load avg: 6.40 [326/390/1] test_spwd passed -- running: test_multiprocessing_fork (60 sec), test_multiprocessing_spawn (76 sec)
0:01:19 load avg: 6.40 [327/390/1] test_codecmaps_tw passed -- running: test_multiprocessing_fork (60 sec), test_multiprocessing_spawn (76 sec)
0:01:19 load avg: 6.40 [328/390/1] test_cgi passed -- running: test_multiprocessing_fork (60 sec), test_multiprocessing_spawn (76 sec)
0:01:19 load avg: 6.37 [329/390/1] test_zipimport passed -- running: test_multiprocessing_fork (61 sec), test_multiprocessing_spawn (77 sec)
0:01:19 load avg: 6.37 [330/390/1] test_syslog passed -- running: test_multiprocessing_fork (61 sec), test_multiprocessing_spawn (77 sec)
0:01:20 load avg: 6.37 [331/390/1] test_dis passed -- running: test_multiprocessing_fork (61 sec), test_multiprocessing_spawn (77 sec)
0:01:20 load avg: 6.37 [332/390/1] test_bisect passed -- running: test_multiprocessing_fork (62 sec), test_multiprocessing_spawn (78 sec)
0:01:20 load avg: 6.37 [333/390/1] test_urllib2 passed -- running: test_multiprocessing_fork (62 sec), test_multiprocessing_spawn (78 sec)
Resource 'http://www.example.com/' is not available
0:01:21 load avg: 6.37 [334/390/1] test_codecmaps_kr passed -- running: test_multiprocessing_fork (62 sec), test_multiprocessing_spawn (78 sec)
0:01:21 load avg: 6.37 [335/390/1] test_itertools passed -- running: test_multiprocessing_fork (63 sec), test_multiprocessing_spawn (79 sec)
0:01:21 load avg: 6.37 [336/390/1] test_complex passed -- running: test_multiprocessing_fork (63 sec), test_multiprocessing_spawn (79 sec)
0:01:22 load avg: 6.37 [337/390/1] test_signal passed -- running: test_multiprocessing_fork (64 sec), test_multiprocessing_spawn (80 sec)
0:01:23 load avg: 6.37 [338/390/1] test_cmd_line passed -- running: test_multiprocessing_fork (64 sec), test_multiprocessing_spawn (80 sec)
0:01:23 load avg: 6.37 [339/390/1] test_datetime passed -- running: test_multiprocessing_fork (64 sec), test_multiprocessing_spawn (80 sec)
0:01:23 load avg: 6.37 [340/390/1] test_fractions passed -- running: test_multiprocessing_fork (64 sec), test_multiprocessing_spawn (80 sec)
0:01:23 load avg: 6.37 [341/390/1] test_unary passed -- running: test_multiprocessing_fork (64 sec), test_multiprocessing_spawn (80 sec)
0:01:23 load avg: 6.37 [342/390/1] test_mmap passed -- running: test_multiprocessing_fork (65 sec), test_multiprocessing_spawn (81 sec)
0:01:23 load avg: 6.37 [343/390/1] test_math passed -- running: test_multiprocessing_fork (65 sec), test_multiprocessing_spawn (81 sec)
0:01:23 load avg: 6.37 [344/390/1] test_decimal passed -- running: test_multiprocessing_fork (65 sec), test_multiprocessing_spawn (81 sec)
0:01:23 load avg: 6.37 [345/390/1] test_baseexception passed -- running: test_multiprocessing_fork (65 sec), test_multiprocessing_spawn (81 sec)
0:01:23 load avg: 6.37 [346/390/1] test_iter passed -- running: test_multiprocessing_fork (65 sec), test_multiprocessing_spawn (81 sec)
0:01:23 load avg: 6.37 [347/390/1] test_modulefinder passed -- running: test_multiprocessing_fork (65 sec), test_multiprocessing_spawn (81 sec)
0:01:23 load avg: 6.37 [348/390/1] test_pickle passed -- running: test_multiprocessing_fork (65 sec), test_multiprocessing_spawn (81 sec)
0:01:24 load avg: 6.37 [349/390/1] test_descrtut passed -- running: test_multiprocessing_fork (65 sec), test_multiprocessing_spawn (81 sec)
0:01:24 load avg: 6.37 [350/390/1] test_pyexpat passed -- running: test_multiprocessing_fork (65 sec), test_multiprocessing_spawn (81 sec)
0:01:24 load avg: 6.37 [351/390/1] test_slice passed -- running: test_multiprocessing_fork (65 sec), test_multiprocessing_spawn (81 sec)
0:01:24 load avg: 6.37 [352/390/1] test_pkg passed -- running: test_multiprocessing_fork (65 sec), test_multiprocessing_spawn (81 sec)
0:01:24 load avg: 6.37 [353/390/1] test_pwd passed -- running: test_multiprocessing_fork (66 sec), test_multiprocessing_spawn (82 sec)
0:01:24 load avg: 6.37 [354/390/1] test_cprofile passed -- running: test_multiprocessing_fork (66 sec), test_multiprocessing_spawn (82 sec)
0:01:24 load avg: 6.34 [355/390/1] test_exceptions passed -- running: test_multiprocessing_fork (66 sec), test_multiprocessing_spawn (82 sec)
0:01:25 load avg: 6.34 [356/390/1] test_userstring passed -- running: test_multiprocessing_fork (66 sec), test_multiprocessing_spawn (82 sec)
0:01:25 load avg: 6.34 [357/390/1] test_dynamic passed -- running: test_multiprocessing_fork (66 sec), test_multiprocessing_spawn (82 sec)
0:01:25 load avg: 6.34 [358/390/1] test_doctest passed -- running: test_multiprocessing_fork (66 sec), test_multiprocessing_spawn (82 sec)
0:01:25 load avg: 6.34 [359/390/1] test_dummy_thread passed -- running: test_multiprocessing_fork (67 sec), test_multiprocessing_spawn (83 sec)
0:01:25 load avg: 6.34 [360/390/1] test_copyreg passed -- running: test_multiprocessing_fork (67 sec), test_multiprocessing_spawn (83 sec)
0:01:25 load avg: 6.34 [361/390/1] test_glob passed -- running: test_multiprocessing_fork (67 sec), test_multiprocessing_spawn (83 sec)
0:01:25 load avg: 6.34 [362/390/1] test_structseq passed -- running: test_multiprocessing_fork (67 sec), test_multiprocessing_spawn (83 sec)
0:01:25 load avg: 6.34 [363/390/1] test_univnewlines passed -- running: test_multiprocessing_fork (67 sec), test_multiprocessing_spawn (83 sec)
0:01:25 load avg: 6.34 [364/390/1] test_statistics passed -- running: test_multiprocessing_fork (67 sec), test_multiprocessing_spawn (83 sec)
0:01:25 load avg: 6.34 [365/390/1] test_pkgimport passed -- running: test_multiprocessing_fork (67 sec), test_multiprocessing_spawn (83 sec)
0:01:25 load avg: 6.34 [366/390/1] test_shelve passed -- running: test_multiprocessing_fork (67 sec), test_multiprocessing_spawn (83 sec)
0:01:25 load avg: 6.34 [367/390/1] test_html passed -- running: test_multiprocessing_fork (67 sec), test_multiprocessing_spawn (83 sec)
0:01:25 load avg: 6.34 [368/390/1] test_smtpnet passed -- running: test_multiprocessing_fork (67 sec), test_multiprocessing_spawn (83 sec)
Resource 'smtp.gmail.com' is not available
Resource 'smtp.gmail.com' is not available
Resource 'smtp.gmail.com' is not available
Resource 'smtp.gmail.com' is not available
Resource 'smtp.gmail.com' is not available
0:01:25 load avg: 6.34 [369/390/1] test_multiprocessing_fork passed (67 sec) -- running: test_multiprocessing_spawn (83 sec)
0:01:25 load avg: 6.34 [370/390/1] test_types passed -- running: test_multiprocessing_spawn (83 sec)
0:01:26 load avg: 6.34 [371/390/1] test_base64 passed -- running: test_multiprocessing_spawn (83 sec)
0:01:26 load avg: 6.34 [372/390/1] test_uuid passed -- running: test_multiprocessing_spawn (83 sec)
0:01:26 load avg: 6.34 [373/390/1] test_devpoll skipped -- running: test_multiprocessing_spawn (83 sec)
test_devpoll skipped -- test works only on Solaris OS family
0:01:26 load avg: 6.34 [374/390/1] test_listcomps passed -- running: test_multiprocessing_spawn (83 sec)
0:01:26 load avg: 6.34 [375/390/1] test_socketserver passed -- running: test_multiprocessing_spawn (84 sec)
0:01:26 load avg: 6.34 [376/390/1] test_wsgiref passed -- running: test_multiprocessing_spawn (84 sec)
0:01:26 load avg: 6.34 [377/390/1] test_http_cookiejar passed -- running: test_multiprocessing_spawn (84 sec)
0:01:26 load avg: 6.34 [378/390/1] test_tempfile passed -- running: test_multiprocessing_spawn (84 sec)
0:01:26 load avg: 6.34 [379/390/1] test_stringprep passed -- running: test_multiprocessing_spawn (84 sec)
0:01:26 load avg: 6.34 [380/390/1] test_binop passed -- running: test_multiprocessing_spawn (84 sec)
0:01:26 load avg: 6.34 [381/390/1] test_stat passed -- running: test_multiprocessing_spawn (84 sec)
0:01:26 load avg: 6.34 [382/390/1] test_symtable passed -- running: test_multiprocessing_spawn (84 sec)
0:01:26 load avg: 6.34 [383/390/1] test_xmlrpc passed -- running: test_multiprocessing_spawn (84 sec)
0:01:26 load avg: 6.34 [384/390/1] test_threadedtempfile passed -- running: test_multiprocessing_spawn (84 sec)
0:01:27 load avg: 6.34 [385/390/1] test_sys passed -- running: test_multiprocessing_spawn (84 sec)
0:01:36 load avg: 5.60 [386/390/1] test_threading passed -- running: test_multiprocessing_spawn (94 sec)
0:01:37 load avg: 5.60 [387/390/1] test_multiprocessing_spawn passed (95 sec)
0:01:50 load avg: 5.02 [388/390/1] test_subprocess passed (31 sec) -- running: test_concurrent_futures (35 sec)
0:02:19 load avg: 3.65 [389/390/1] test_concurrent_futures passed (64 sec) -- running: test_tokenize (53 sec)
0:02:23 load avg: 3.43 [390/390/1] test_tokenize passed (57 sec)
374 tests OK.

1 test failed:
    test_script_helper

15 tests skipped:
    test_devpoll test_ioctl test_kqueue test_msilib test_ossaudiodev
    test_startfile test_tix test_tk test_ttk_guionly test_unicode_file
    test_unicode_file_functions test_winconsoleio test_winreg
    test_winsound test_zipfile64
Re-running failed tests in verbose mode
Re-running test 'test_script_helper' in verbose mode
test_assert_python_failure (test.test_script_helper.TestScriptHelper) ... ok
test_assert_python_failure_raises (test.test_script_helper.TestScriptHelper) ... ok
test_assert_python_isolated_when_env_not_required (test.test_script_helper.TestScriptHelper) ... ok
test_assert_python_not_isolated_when_env_is_required (test.test_script_helper.TestScriptHelper)
Ensure that -I is not passed when the environment is required. ... ok
test_assert_python_ok (test.test_script_helper.TestScriptHelper) ... ok
test_assert_python_ok_raises (test.test_script_helper.TestScriptHelper) ... ok
test_interpreter_requires_environment_details (test.test_script_helper.TestScriptHelperEnvironment) ... FAIL
test_interpreter_requires_environment_false (test.test_script_helper.TestScriptHelperEnvironment) ... FAIL
test_interpreter_requires_environment_true (test.test_script_helper.TestScriptHelperEnvironment) ... test test_script_helper failed
FAIL

======================================================================
FAIL: test_interpreter_requires_environment_details (test.test_script_helper.TestScriptHelperEnvironment)
----------------------------------------------------------------------
Traceback (most recent call last):
  File "/tmp/B.8NdzK7/BUILD/Python-3.6.5/Lib/unittest/mock.py", line 1179, in patched
    return func(*args, **keywargs)
  File "/tmp/B.8NdzK7/BUILD/Python-3.6.5/Lib/test/test_script_helper.py", line 101, in test_interpreter_requires_environment_details
    self.assertFalse(script_helper.interpreter_requires_environment())
AssertionError: True is not false

======================================================================
FAIL: test_interpreter_requires_environment_false (test.test_script_helper.TestScriptHelperEnvironment)
----------------------------------------------------------------------
Traceback (most recent call last):
  File "/tmp/B.8NdzK7/BUILD/Python-3.6.5/Lib/unittest/mock.py", line 1179, in patched
    return func(*args, **keywargs)
  File "/tmp/B.8NdzK7/BUILD/Python-3.6.5/Lib/test/test_script_helper.py", line 95, in test_interpreter_requires_environment_false
    self.assertFalse(script_helper.interpreter_requires_environment())
AssertionError: True is not false

======================================================================
FAIL: test_interpreter_requires_environment_true (test.test_script_helper.TestScriptHelperEnvironment)
----------------------------------------------------------------------
Traceback (most recent call last):
  File "/tmp/B.8NdzK7/BUILD/Python-3.6.5/Lib/unittest/mock.py", line 1179, in patched
    return func(*args, **keywargs)
  File "/tmp/B.8NdzK7/BUILD/Python-3.6.5/Lib/test/test_script_helper.py", line 89, in test_interpreter_requires_environment_true
    self.assertEqual(1, mock_check_call.call_count)
AssertionError: 1 != 0

----------------------------------------------------------------------
Ran 9 tests in 0.105s

FAILED (failures=3)
1 test failed again:
    test_script_helper

Total duration: 2 min 23 sec
Tests result: FAILURE
make: *** [Makefile:1045: test] Error 2
error: Bad exit status from /tmp/B.8NdzK7/BUILD/tmp/rpm-tmp.68097 (%build)


RPM build errors:
    Bad exit status from /tmp/B.8NdzK7/BUILD/tmp/rpm-tmp.68097 (%build)
ended at: Mon Jun 18 06:19:40 2018, done in 0:03:15.096999
mesg: ttyname failed: Inappropriate ioctl for device
+ chmod -R u+rwX /tmp/B.8NdzK7/BUILD
+ rm -rf /tmp/B.8NdzK7/tmp /tmp/B.8NdzK7/BUILD
test-build: not copying to /spools/ready
Begin-PLD-Builder-Info
not upgrading
End-PLD-Builder-Info
mesg: ttyname failed: Inappropriate ioctl for device
+ rm -rf /tmp/B.8NdzK7
Begin-PLD-Builder-Info
Build-Time: user:673.33s sys:60.82s real:199.49s (faults io:36 non-io:12466387)

Files queued for ftp:
         0 foo-0.1-1.noarch.rpm
         0 foo-0.1-1.src.rpm

End-PLD-Builder-Info
[Back to list of logs] [View rpm -qa of builder]