FailedOk

th/SRPMS[OK]
th/x32[OK]
th/i686[OK]
th/x86_64[OK]

ac/SRPMS[OK]
ac/i386[OK]
ac/i586[OK]
ac/i686[OK]
ac/alpha[OK]
ac/amd64[OK]
ac/athlon[OK]
ac/ppc[OK]
ac/sparc[OK]
ac/sparc64[OK]

Advanced Search
main()
Powered by PLD Linux
(c) 2002-2017 PLD Team
$Revision: 1.37 $
Powered by Unix conspiracy.
Your IP: 54.80.132.10

q 3462dde3-f58e-4cd0-a8fe-9db7fcd51bdd

Status:Failed
Source URL:ftp://buildlogs.pld-linux.org/th/x86_64/FAIL/q,3462dde3-f58e-4cd0-a8fe-9db7fcd51bdd.bz2
text/plain URL:View!
full text:View!
rpm -qa of builder:View!
Date:2017/10/11 08:35:10
Runtime:0:00:49.929072

Toc:

  • error 1
  • clib.c:2638:21: error: format not a string literal and no format arguments [-Werror=format-security]
  • error 2
  • clib.c:2680:19: error: format not a string literal and no format arguments [-Werror=format-security]
  • error 3
  • clib.c:2871:25: error: format not a string literal and no format arguments [-Werror=format-security]
  • error 4
  • clib.c:2918:23: error: format not a string literal and no format arguments [-Werror=format-security]
  • error 5
  • error: Bad exit status from /tmp/B.zNMJ7I/BUILD/tmp/rpm-tmp.66745 (%build)
  • error 6
  • RPM build errors:
  • error 7
  • error: No files produced.

Content:

   fail_stack.stack[fail_stack.avail++] = (fail_stack_elt_t) item
                                          ^
regex.c:2407:5: note: in expansion of macro 'PUSH_FAILURE_ITEM'
     PUSH_FAILURE_ITEM (lowest_active_reg);    \
     ^~~~~~~~~~~~~~~~~
regex.c:4110:11: note: in expansion of macro 'PUSH_FAILURE_POINT'
           PUSH_FAILURE_POINT (0, 0, -2);
           ^~~~~~~~~~~~~~~~~~
regex.c:2328:42: warning: cast to pointer from integer of different size [-Wint-to-pointer-cast]
   fail_stack.stack[fail_stack.avail++] = (fail_stack_elt_t) item
                                          ^
regex.c:2410:5: note: in expansion of macro 'PUSH_FAILURE_ITEM'
     PUSH_FAILURE_ITEM (highest_active_reg);    \
     ^~~~~~~~~~~~~~~~~
regex.c:4110:11: note: in expansion of macro 'PUSH_FAILURE_POINT'
           PUSH_FAILURE_POINT (0, 0, -2);
           ^~~~~~~~~~~~~~~~~~
regex.c:2328:42: warning: cast to pointer from integer of different size [-Wint-to-pointer-cast]
   fail_stack.stack[fail_stack.avail++] = (fail_stack_elt_t) item
                                          ^
regex.c:2407:5: note: in expansion of macro 'PUSH_FAILURE_ITEM'
     PUSH_FAILURE_ITEM (lowest_active_reg);    \
     ^~~~~~~~~~~~~~~~~
regex.c:4123:11: note: in expansion of macro 'PUSH_FAILURE_POINT'
           PUSH_FAILURE_POINT (0, 0, -2);
           ^~~~~~~~~~~~~~~~~~
regex.c:2328:42: warning: cast to pointer from integer of different size [-Wint-to-pointer-cast]
   fail_stack.stack[fail_stack.avail++] = (fail_stack_elt_t) item
                                          ^
regex.c:2410:5: note: in expansion of macro 'PUSH_FAILURE_ITEM'
     PUSH_FAILURE_ITEM (highest_active_reg);    \
     ^~~~~~~~~~~~~~~~~
regex.c:4123:11: note: in expansion of macro 'PUSH_FAILURE_POINT'
           PUSH_FAILURE_POINT (0, 0, -2);
           ^~~~~~~~~~~~~~~~~~
regex.c:2495:14: warning: cast from pointer to integer of different size [-Wpointer-to-int-cast]
   high_reg = (unsigned) POP_FAILURE_ITEM ();    \
              ^
regex.c:4291:11: note: in expansion of macro 'POP_FAILURE_POINT'
           POP_FAILURE_POINT (d, p,
           ^~~~~~~~~~~~~~~~~
regex.c:2498:13: warning: cast from pointer to integer of different size [-Wpointer-to-int-cast]
   low_reg = (unsigned) POP_FAILURE_ITEM ();    \
             ^
regex.c:4291:11: note: in expansion of macro 'POP_FAILURE_POINT'
           POP_FAILURE_POINT (d, p,
           ^~~~~~~~~~~~~~~~~
 x86_64-pld-linux-gcc -DPACKAGE_NAME=\"\" -DPACKAGE_TARNAME=\"\" -DPACKAGE_VERSION=\"\" -DPACKAGE_STRING=\"\" -DPACKAGE_BUGREPORT=\"\" -DPACKAGE=\"regex\" -DVERSION=\"0.12\" -DHAVE_GETMNTENT=1 -DSTDC_HEADERS=1 -DHAVE_SYS_TYPES_H=1 -DHAVE_SYS_STAT_H=1 -DHAVE_STDLIB_H=1 -DHAVE_STRING_H=1 -DHAVE_MEMORY_H=1 -DHAVE_STRINGS_H=1 -DHAVE_INTTYPES_H=1 -DHAVE_STDINT_H=1 -DHAVE_UNISTD_H=1 -DHAVE_DLFCN_H=1 -DSTDC_HEADERS=1 -DHAVE_STRING_H=1 -DHAVE_ALLOCA_H=1 -DHAVE_ALLOCA=1 -I. -I. -I./regex -O2 -fwrapv -pipe -Wformat -Werror=format-security -gdwarf-4 -fno-debug-types-section -fvar-tracking-assignments -g2 -Wp,-D_FORTIFY_SOURCE=2 -fstack-protector-strong --param=ssp-buffer-size=4 -fPIC -march=x86-64 -gdwarf-4 -fno-debug-types-section -fvar-tracking-assignments -g2 -MT regex.lo -MD -MP -MF .deps/regex.Tpo -c regex.c -o regex.o >/dev/null 2>&1
make[2]: Leaving directory '/tmp/B.zNMJ7I/BUILD/q-6.0/regex'
make[2]: Entering directory '/tmp/B.zNMJ7I/BUILD/q-6.0/regex'
/bin/sh ./libtool --mode=link --tag=CC x86_64-pld-linux-gcc  -O2 -fwrapv -pipe -Wformat -Werror=format-security -gdwarf-4 -fno-debug-types-section -fvar-tracking-assignments -g2 -Wp,-D_FORTIFY_SOURCE=2 -fstack-protector-strong --param=ssp-buffer-size=4 -fPIC -march=x86-64 -gdwarf-4 -fno-debug-types-section -fvar-tracking-assignments -g2   -Wl,--as-needed -Wl,--no-copy-dt-needed-entries -Wl,-z,relro -Wl,-z,combreloc  -o libregex.la   regex.lo  
ar cru .libs/libregex.a .libs/regex.o
ranlib .libs/libregex.a
creating libregex.la
(cd .libs && rm -f libregex.la && ln -s ../libregex.la libregex.la)
make[2]: Leaving directory '/tmp/B.zNMJ7I/BUILD/q-6.0/regex'
Making all in doc
make[2]: Nothing to be done for 'all'.
Making all in etc
make[2]: Entering directory '/tmp/B.zNMJ7I/BUILD/q-6.0/etc'
sed -e "s?@q-prog@?/usr/bin/q?g" \
-e "s?@q-data-dir@?/usr/share/q/lib?g" \
-e "s?@q-lib-dir@?/usr/lib64/q?g" <./q-mode.in >q-mode.el
make[2]: Leaving directory '/tmp/B.zNMJ7I/BUILD/q-6.0/etc'
Making all in examples
make[2]: Nothing to be done for 'all'.
Making all in libq
make[2]: Entering directory '/tmp/B.zNMJ7I/BUILD/q-6.0/libq'
if /bin/sh ../libtool --mode=compile --tag=CC x86_64-pld-linux-gcc -DHAVE_CONFIG_H -I. -I. -I.. -I../src     -O2 -fwrapv -pipe -Wformat -Werror=format-security -gdwarf-4 -fno-debug-types-section -fvar-tracking-assignments -g2 -Wp,-D_FORTIFY_SOURCE=2 -fstack-protector-strong --param=ssp-buffer-size=4 -fPIC -march=x86-64 -gdwarf-4 -fno-debug-types-section -fvar-tracking-assignments -g2  -MT libq.lo -MD -MP -MF ".deps/libq.Tpo" -c -o libq.lo libq.c; \
then mv -f ".deps/libq.Tpo" ".deps/libq.Plo"; else rm -f ".deps/libq.Tpo"; exit 1; fi
mkdir .libs
 x86_64-pld-linux-gcc -DHAVE_CONFIG_H -I. -I. -I.. -I../src -O2 -fwrapv -pipe -Wformat -Werror=format-security -gdwarf-4 -fno-debug-types-section -fvar-tracking-assignments -g2 -Wp,-D_FORTIFY_SOURCE=2 -fstack-protector-strong --param=ssp-buffer-size=4 -fPIC -march=x86-64 -gdwarf-4 -fno-debug-types-section -fvar-tracking-assignments -g2 -MT libq.lo -MD -MP -MF .deps/libq.Tpo -c libq.c  -fPIC -DPIC -o .libs/libq.o
 x86_64-pld-linux-gcc -DHAVE_CONFIG_H -I. -I. -I.. -I../src -O2 -fwrapv -pipe -Wformat -Werror=format-security -gdwarf-4 -fno-debug-types-section -fvar-tracking-assignments -g2 -Wp,-D_FORTIFY_SOURCE=2 -fstack-protector-strong --param=ssp-buffer-size=4 -fPIC -march=x86-64 -gdwarf-4 -fno-debug-types-section -fvar-tracking-assignments -g2 -MT libq.lo -MD -MP -MF .deps/libq.Tpo -c libq.c -o libq.o >/dev/null 2>&1
make[2]: Leaving directory '/tmp/B.zNMJ7I/BUILD/q-6.0/libq'
make[2]: Entering directory '/tmp/B.zNMJ7I/BUILD/q-6.0/libq'
/bin/sh ../libtool --mode=link --tag=CC x86_64-pld-linux-gcc  -O2 -fwrapv -pipe -Wformat -Werror=format-security -gdwarf-4 -fno-debug-types-section -fvar-tracking-assignments -g2 -Wp,-D_FORTIFY_SOURCE=2 -fstack-protector-strong --param=ssp-buffer-size=4 -fPIC -march=x86-64 -gdwarf-4 -fno-debug-types-section -fvar-tracking-assignments -g2   -Wl,--as-needed -Wl,--no-copy-dt-needed-entries -Wl,-z,relro -Wl,-z,combreloc  -o libq.la -rpath /usr/lib64 -no-undefined -version-info 6:0:0 libq.lo  -lcrypt -lutil -lnsl -lm 
x86_64-pld-linux-gcc -shared  .libs/libq.o  -lcrypt -lutil -lnsl -lm  -march=x86-64 -Wl,--as-needed -Wl,--no-copy-dt-needed-entries -Wl,-z -Wl,relro -Wl,-z -Wl,combreloc -Wl,-soname -Wl,libq.so.6 -o .libs/libq.so.6.0.0
(cd .libs && rm -f libq.so.6 && ln -s libq.so.6.0.0 libq.so.6)
(cd .libs && rm -f libq.so && ln -s libq.so.6.0.0 libq.so)
ar cru .libs/libq.a  libq.o
ranlib .libs/libq.a
creating libq.la
(cd .libs && rm -f libq.la && ln -s ../libq.la libq.la)
make[2]: Leaving directory '/tmp/B.zNMJ7I/BUILD/q-6.0/libq'
Making all in modules
Making all in clib
Making all in .
make[4]: Entering directory '/tmp/B.zNMJ7I/BUILD/q-6.0/modules/clib'
if /bin/sh ../../libtool --mode=compile --tag=CC x86_64-pld-linux-gcc -DHAVE_CONFIG_H -I. -I. -I../.. -I../../libq -I../../glob -I../../regex    -O2 -fwrapv -pipe -Wformat -Werror=format-security -gdwarf-4 -fno-debug-types-section -fvar-tracking-assignments -g2 -Wp,-D_FORTIFY_SOURCE=2 -fstack-protector-strong --param=ssp-buffer-size=4 -fPIC -march=x86-64 -gdwarf-4 -fno-debug-types-section -fvar-tracking-assignments -g2  -MT clib.lo -MD -MP -MF ".deps/clib.Tpo" -c -o clib.lo clib.c; \
then mv -f ".deps/clib.Tpo" ".deps/clib.Plo"; else rm -f ".deps/clib.Tpo"; exit 1; fi
mkdir .libs
 x86_64-pld-linux-gcc -DHAVE_CONFIG_H -I. -I. -I../.. -I../../libq -I../../glob -I../../regex -O2 -fwrapv -pipe -Wformat -Werror=format-security -gdwarf-4 -fno-debug-types-section -fvar-tracking-assignments -g2 -Wp,-D_FORTIFY_SOURCE=2 -fstack-protector-strong --param=ssp-buffer-size=4 -fPIC -march=x86-64 -gdwarf-4 -fno-debug-types-section -fvar-tracking-assignments -g2 -MT clib.lo -MD -MP -MF .deps/clib.Tpo -c clib.c  -fPIC -DPIC -o .libs/clib.o
In file included from /usr/include/bits/libc-header-start.h:33:0,
                 from /usr/include/stdio.h:28,
                 from clib.c:35:
/usr/include/features.h:180:3: warning: #warning "_BSD_SOURCE and _SVID_SOURCE are deprecated, use _DEFAULT_SOURCE" [-Wcpp]
 # warning "_BSD_SOURCE and _SVID_SOURCE are deprecated, use _DEFAULT_SOURCE"
   ^~~~~~~
clib.c: In function '__F__clib_fprintf':
clib.c:2638:21: error: format not a string literal and no format arguments [-Werror=format-security]
     if (fprintf(fp, f_str) < 0) goto errexit;
                     ^~~~~
clib.c:2680:19: error: format not a string literal and no format arguments [-Werror=format-security]
   if (fprintf(fp, f_str) < 0) goto errexit;
                   ^~~~~
clib.c: In function '__F__clib_sprintf':
clib.c:2871:25: error: format not a string literal and no format arguments [-Werror=format-security]
     if (sprintf(bufptr, f_str) < 0) goto errexit;
                         ^~~~~
clib.c:2918:23: error: format not a string literal and no format arguments [-Werror=format-security]
   if (sprintf(bufptr, f_str) < 0) goto errexit;
                       ^~~~~
clib.c: At top level:
clib.c:7031:8: warning: return type defaults to 'int' [-Wimplicit-int]
 static check_mut(my_mutex_t *mut)
        ^~~~~~~~~
clib.c:7039:8: warning: return type defaults to 'int' [-Wimplicit-int]
 static check_cond(my_cond_t *cond)
        ^~~~~~~~~~
clib.c:7049:8: warning: return type defaults to 'int' [-Wimplicit-int]
 static check_sem(my_sem_t *sem)
        ^~~~~~~~~
clib.c: In function '__F__clib_tmpnam':
clib.c:2089:5: warning: ignoring return value of 'tmpnam', declared with attribute warn_unused_result [-Wunused-result]
     tmpnam(s);
     ^~~~~~~~~
clib.c: In function '__F__clib_fscanf':
clib.c:3052:19: warning: ignoring return value of 'fscanf', declared with attribute warn_unused_result [-Wunused-result]
       count = -1; fscanf(fp, f_format, &count);
                   ^~~~~~~~~~~~~~~~~~~~~~~~~~~~
clib.c: In function '__clib__init':
clib.c:8930:7: warning: ignoring return value of 'system', declared with attribute warn_unused_result [-Wunused-result]
       system(givertcap);
       ^~~~~~~~~~~~~~~~~
cc1: some warnings being treated as errors
make[4]: *** [Makefile:374: clib.lo] Error 1
make[4]: Leaving directory '/tmp/B.zNMJ7I/BUILD/q-6.0/modules/clib'
make[3]: *** [Makefile:431: all-recursive] Error 1
make[2]: *** [Makefile:291: all-recursive] Error 1
make[1]: *** [Makefile:365: all-recursive] Error 1
make: *** [Makefile:277: all] Error 2
error: Bad exit status from /tmp/B.zNMJ7I/BUILD/tmp/rpm-tmp.66745 (%build)


RPM build errors:
    Bad exit status from /tmp/B.zNMJ7I/BUILD/tmp/rpm-tmp.66745 (%build)
ended at: Wed Oct 11 08:35:10 2017, done in 0:00:49.929072
error: No files produced.
mesg: ttyname failed: Inappropriate ioctl for device
+ chmod -R u+rwX /tmp/B.zNMJ7I/BUILD
+ rm -rf /tmp/B.zNMJ7I/tmp /tmp/B.zNMJ7I/BUILD
mesg: ttyname failed: Inappropriate ioctl for device
+ rm -rf /tmp/B.zNMJ7I
Begin-PLD-Builder-Info
Build-Time: user:21.14s sys:6.51s real:54.45s (faults io:158 non-io:5221590)

End-PLD-Builder-Info
[Back to list of logs] [View rpm -qa of builder]