FailedOk

th/SRPMS[OK]
th/x32[OK]
th/i686[OK]
th/x86_64[OK]

ac/SRPMS[OK]
ac/i386[OK]
ac/i586[OK]
ac/i686[OK]
ac/alpha[OK]
ac/amd64[OK]
ac/athlon[OK]
ac/ppc[OK]
ac/sparc[OK]
ac/sparc64[OK]

Advanced Search
main()
Powered by PLD Linux
(c) 2002-2019 PLD Team
$Revision: 1.37 $
Powered by Parallel thinking.
Your IP: 3.84.243.246

qalculate-gtk 315c8fb1-45f0-466e-bbcf-69abab1e33ac

Status:Failed
Source URL:ftp://buildlogs.pld-linux.org/th/x86_64/FAIL/qalculate-gtk,315c8fb1-45f0-466e-bbcf-69abab1e33ac.bz2
text/plain URL:View!
rpm -qa of builder:View!
Date:2019/02/10 12:06:27
Runtime:0:00:08.444604

Toc:

  • prep
  • Executing(%prep): /bin/sh -e /tmp/B.TusOH8/BUILD/tmp/rpm-tmp.25529
  • build
  • Executing(%build): /bin/sh -e /tmp/B.TusOH8/BUILD/tmp/rpm-tmp.25529
  • error 1
  • callbacks.cc:183:1: error: 'Sgi' does not name a type
  • error 2
  • callbacks.cc:184:1: error: 'Sgi' does not name a type
  • error 3
  • callbacks.cc:238:6: error: 'Sgi' has not been declared
  • error 4
  • callbacks.cc:238:20: error: expected primary-expression before 'int'
  • error 5
  • callbacks.cc:238:74: error: 'it' was not declared in this scope
  • error 6
  • callbacks.cc:238:80: error: 'left_par_pix' was not declared in this scope
  • error 7
  • callbacks.cc:241:2: error: 'left_par_pix' was not declared in this scope
  • error 8
  • callbacks.cc:242:6: error: 'Sgi' has not been declared
  • error 9
  • callbacks.cc:242:20: error: expected primary-expression before 'int'
  • error 10
  • callbacks.cc:242:75: error: 'it' was not declared in this scope
  • error 11
  • callbacks.cc:242:81: error: 'right_par_pix' was not declared in this scope
  • error 12
  • callbacks.cc:245:2: error: 'right_par_pix' was not declared in this scope
  • error 13
  • callbacks.cc:3179:5: error: 'left_par_pix' was not declared in this scope
  • error 14
  • callbacks.cc:3195:2: error: 'left_par_pix' was not declared in this scope
  • error 15
  • callbacks.cc:3199:5: error: 'right_par_pix' was not declared in this scope
  • error 16
  • callbacks.cc:3215:2: error: 'right_par_pix' was not declared in this scope
  • error 17
  • make[2]: *** [Makefile:346: callbacks.o] Error 1
  • error 18
  • make[1]: *** [Makefile:322: all-recursive] Error 1
  • error 19
  • error: Bad exit status from /tmp/B.TusOH8/BUILD/tmp/rpm-tmp.25529 (%build)
  • error 20
  • RPM build errors:
  • error 21
  • error: No files produced.

Content:

request from: baggins
checking if we should skip the build
started at: Sun Feb 10 12:06:17 2019
killing old processes on a builder
sending signal 9 to pid -1
Killed
cleaning up /tmp
fetching https://srcbuilder.pld-linux.org/th//srpms/315c8fb1-45f0-466e-bbcf-69abab1e33ac/qalculate-gtk-0.9.7-2.src.rpm
fetched 1525501 bytes, 2607.7 K/s
installing srpm: qalculate-gtk-0.9.7-2.src.rpm
+ install -d /tmp/B.TusOH8/BUILD /tmp/B.TusOH8/RPMS
+ LC_ALL=en_US.UTF-8
+ rpm -qp --changelog qalculate-gtk-0.9.7-2.src.rpm
* Sun Feb 10 2019 PLD Linux Team <feedback@pld-linux.org>
- For complete changelog see: http://git.pld-linux.org/?p=packages/qalculate-gtk.git;a=log;h=master
+ rpm -Uhv --nodeps --define '_topdir /tmp/B.TusOH8' --define '_specdir %{_topdir}' --define '_sourcedir %{_specdir}' --define '_rpmdir %{_topdir}/RPMS' --define '_builddir %{_topdir}/BUILD' qalculate-gtk-0.9.7-2.src.rpm Preparing... ################################################## qalculate-gtk ################################################## + rm -f qalculate-gtk-0.9.7-2.src.rpm + install -m 700 -d /tmp/B.TusOH8/BUILD/tmp + TMPDIR=/tmp/B.TusOH8/BUILD/tmp + exec nice -n 0 rpmbuild -bp --short-circuit --nodeps --define '_topdir /tmp/B.TusOH8' --define '_specdir %{_topdir}' --define '_sourcedir %{_specdir}' --define '_rpmdir %{_topdir}/RPMS' --define '_builddir %{_topdir}/BUILD' --target x86_64-pld-linux --define 'prep exit 0' /tmp/B.TusOH8/qalculate-gtk.spec Building target platforms: x86_64-pld-linux checking BuildConflict-ing packages no BuildConflicts found checking BR rpm: Building target platforms: x86_64-pld-linux no BR needed building RPM using: set -ex; : build-id: 315c8fb1-45f0-466e-bbcf-69abab1e33ac; TMPDIR=/tmp/B.TusOH8/BUILD/tmp exec nice -n 0 rpmbuild -bb --define '_smp_mflags -j9' --define '_make_opts -Otarget' --define '_pld_builder 1' --define '_topdir /tmp/B.TusOH8' --define '_specdir %{_topdir}' --define '_sourcedir %{_specdir}' --define '_rpmdir %{_topdir}/RPMS' --define '_builddir %{_topdir}/BUILD' --target x86_64-pld-linux /tmp/B.TusOH8/qalculate-gtk.spec + : build-id: 315c8fb1-45f0-466e-bbcf-69abab1e33ac + TMPDIR=/tmp/B.TusOH8/BUILD/tmp + exec nice -n 0 rpmbuild -bb --define '_smp_mflags -j9' --define '_make_opts -Otarget' --define '_pld_builder 1' --define '_topdir /tmp/B.TusOH8' --define '_specdir %{_topdir}' --define '_sourcedir %{_specdir}' --define '_rpmdir %{_topdir}/RPMS' --define '_builddir %{_topdir}/BUILD' --target x86_64-pld-linux /tmp/B.TusOH8/qalculate-gtk.spec Building target platforms: x86_64-pld-linux Executing(%prep): /bin/sh -e /tmp/B.TusOH8/BUILD/tmp/rpm-tmp.25529 + umask 022 + cd /tmp/B.TusOH8/BUILD + cd /tmp/B.TusOH8/BUILD + rm -rf qalculate-gtk-0.9.7 + /usr/bin/gzip -dc /tmp/B.TusOH8/qalculate-gtk-0.9.7.tar.gz + /bin/tar -xf - + STATUS=0 + '[' 0 -ne 0 ']' + cd qalculate-gtk-0.9.7 + /bin/id -u + '[' 1000 '=' 0 ']' + /bin/id -u + '[' 1000 '=' 0 ']' + /bin/chmod -Rf a+rX,u+w,g-w,o-w . + echo 'Patch #0 (desktop.patch):' Patch #0 (desktop.patch): + '[' -f /tmp/B.TusOH8/desktop.patch ']' + /bin/cat /tmp/B.TusOH8/desktop.patch + /usr/bin/patch -s -p0 + echo 'Patch #1 (qalculate-wformat-security.patch):' Patch #1 (qalculate-wformat-security.patch): + '[' -f /tmp/B.TusOH8/qalculate-wformat-security.patch ']' + /bin/cat /tmp/B.TusOH8/qalculate-wformat-security.patch + /usr/bin/patch -s -p0 + exit 0 Executing(%build): /bin/sh -e /tmp/B.TusOH8/BUILD/tmp/rpm-tmp.25529 TMP=/home/users/builder/tmp HOME=/home/users/builder PATH=/home/users/builder/GNUstep/Tools:/usr/local/bin:/usr/bin:/bin:/home/users/builder/bin TMPDIR=/tmp/B.TusOH8/BUILD/tmp + umask 022 + cd /tmp/B.TusOH8/BUILD + cd qalculate-gtk-0.9.7 + ./configure 'LDFLAGS=-Wl,--as-needed -Wl,--no-copy-dt-needed-entries -Wl,-z,relro -Wl,-z,combreloc ' 'CFLAGS=-O2 -fwrapv -pipe -Wformat -Werror=format-security -gdwarf-4 -fno-debug-types-section -fvar-tracking-assignments -g2 -Wp,-D_FORTIFY_SOURCE=2 -fstack-protector-strong --param=ssp-buffer-size=4 -fPIC -march=x86-64 -gdwarf-4 -fno-debug-types-section -fvar-tracking-assignments -g2 ' 'CXXFLAGS=-O2 -fwrapv -pipe -Wformat -Werror=format-security -gdwarf-4 -fno-debug-types-section -fvar-tracking-assignments -g2 -Wp,-D_FORTIFY_SOURCE=2 -fstack-protector-strong --param=ssp-buffer-size=4 -fPIC -march=x86-64 -gdwarf-4 -fno-debug-types-section -fvar-tracking-assignments -g2 ' 'FFLAGS=-O2 -fwrapv -pipe -Wformat -Werror=format-security -gdwarf-4 -fno-debug-types-section -fvar-tracking-assignments -g2 -Wp,-D_FORTIFY_SOURCE=2 -fstack-protector-strong --param=ssp-buffer-size=4 -fPIC -march=x86-64 -gdwarf-4 -fno-debug-types-section -fvar-tracking-assignments -g2 ' 'FCFLAGS=-O2 -fwrapv -pipe -Wformat -Werror=format-security -gdwarf-4 -fno-debug-types-section -fvar-tracking-assignments -g2 -Wp,-D_FORTIFY_SOURCE=2 -fstack-protector-strong --param=ssp-buffer-size=4 -fPIC -march=x86-64 -gdwarf-4 -fno-debug-types-section -fvar-tracking-assignments -g2 ' 'CPPFLAGS=' 'CC=x86_64-pld-linux-gcc' 'CXX=x86_64-pld-linux-g++' '--host=x86_64-pld-linux' '--build=x86_64-pld-linux' '--prefix=/usr' '--exec-prefix=/usr' '--bindir=/usr/bin' '--sbindir=/usr/sbin' '--sysconfdir=/etc' '--datadir=/usr/share' '--includedir=/usr/include' '--libdir=/usr/lib64' '--libexecdir=/usr/libexec' '--localstatedir=/var' '--sharedstatedir=/var/lib' '--mandir=/usr/share/man' '--infodir=/usr/share/info' '--x-libraries=/usr/lib64' checking for a BSD-compatible install... /usr/bin/install -c checking whether build environment is sane... yes checking for a thread-safe mkdir -p... /bin/mkdir -p checking for gawk... gawk checking whether make sets $(MAKE)... yes checking whether to enable maintainer-specific portions of Makefiles... no checking for style of include used by make... GNU checking for x86_64-pld-linux-gcc... x86_64-pld-linux-gcc checking for C compiler default output file name... a.out checking whether the C compiler works... yes checking whether we are cross compiling... no checking for suffix of executables... checking for suffix of object files... o checking whether we are using the GNU C compiler... yes checking whether x86_64-pld-linux-gcc accepts -g... yes checking for x86_64-pld-linux-gcc option to accept ISO C89... none needed checking dependency style of x86_64-pld-linux-gcc... gcc3 checking for library containing strerror... none required checking for x86_64-pld-linux-gcc... (cached) x86_64-pld-linux-gcc checking whether we are using the GNU C compiler... (cached) yes checking whether x86_64-pld-linux-gcc accepts -g... (cached) yes checking for x86_64-pld-linux-gcc option to accept ISO C89... (cached) none needed checking dependency style of x86_64-pld-linux-gcc... (cached) gcc3 checking whether we are using the GNU C++ compiler... yes checking whether x86_64-pld-linux-g++ accepts -g... yes checking dependency style of x86_64-pld-linux-g++... gcc3 checking for x86_64-pld-linux-gcc... (cached) x86_64-pld-linux-gcc checking whether we are using the GNU C compiler... (cached) yes checking whether x86_64-pld-linux-gcc accepts -g... (cached) yes checking for x86_64-pld-linux-gcc option to accept ISO C89... (cached) none needed checking dependency style of x86_64-pld-linux-gcc... (cached) gcc3 checking whether ln -s works... yes checking how to run the C preprocessor... x86_64-pld-linux-gcc -E checking for grep that handles long lines and -e... /bin/grep checking for egrep... /bin/grep -E checking for ANSI C header files... yes checking for xgettext... /usr/bin/xgettext checking for msgmerge... /usr/bin/msgmerge checking for msgfmt... /usr/bin/msgfmt checking for perl... /usr/bin/perl checking for XML::Parser... ok checking build system type... x86_64-pld-linux-gnu checking host system type... x86_64-pld-linux-gnu checking for a sed that does not truncate output... /bin/sed checking for ld used by x86_64-pld-linux-gcc... /usr/bin/ld checking if the linker (/usr/bin/ld) is GNU ld... yes checking for /usr/bin/ld option to reload object files... -r checking for BSD-compatible nm... /usr/bin/nm -B checking how to recognize dependent libraries... pass_all checking for sys/types.h... yes checking for sys/stat.h... yes checking for stdlib.h... yes checking for string.h... yes checking for memory.h... yes checking for strings.h... yes checking for inttypes.h... yes checking for stdint.h... yes checking for unistd.h... yes checking dlfcn.h usability... yes checking dlfcn.h presence... yes checking for dlfcn.h... yes checking how to run the C++ preprocessor... x86_64-pld-linux-g++ -E checking for x86_64-pld-linux-g77... no checking for x86_64-pld-linux-xlf... no checking for x86_64-pld-linux-f77... no checking for x86_64-pld-linux-frt... no checking for x86_64-pld-linux-pgf77... no checking for x86_64-pld-linux-cf77... no checking for x86_64-pld-linux-fort77... no checking for x86_64-pld-linux-fl32... no checking for x86_64-pld-linux-af77... no checking for x86_64-pld-linux-xlf90... no checking for x86_64-pld-linux-f90... no checking for x86_64-pld-linux-pgf90... no checking for x86_64-pld-linux-pghpf... no checking for x86_64-pld-linux-epcf90... no checking for x86_64-pld-linux-gfortran... x86_64-pld-linux-gfortran checking whether we are using the GNU Fortran 77 compiler... yes checking whether x86_64-pld-linux-gfortran accepts -g... yes checking the maximum length of command line arguments... 1572864 checking command to parse /usr/bin/nm -B output from x86_64-pld-linux-gcc object... ok checking for objdir... .libs checking for x86_64-pld-linux-ar... no checking for ar... ar checking for x86_64-pld-linux-ranlib... no checking for ranlib... ranlib checking for x86_64-pld-linux-strip... no checking for strip... strip checking if x86_64-pld-linux-gcc supports -fno-rtti -fno-exceptions... no checking for x86_64-pld-linux-gcc option to produce PIC... -fPIC checking if x86_64-pld-linux-gcc PIC flag -fPIC works... yes checking if x86_64-pld-linux-gcc static flag -static works... yes checking if x86_64-pld-linux-gcc supports -c -o file.o... yes checking whether the x86_64-pld-linux-gcc linker (/usr/bin/ld -m elf_x86_64) supports shared libraries... yes checking whether -lc should be explicitly linked in... no checking dynamic linker characteristics... GNU/Linux ld.so checking how to hardcode library paths into programs... immediate checking whether stripping libraries is possible... yes checking if libtool supports shared libraries... yes checking whether to build shared libraries... yes checking whether to build static libraries... yes configure: creating libtool appending configuration tag "CXX" to libtool checking for ld used by x86_64-pld-linux-g++... /usr/bin/ld -m elf_x86_64 checking if the linker (/usr/bin/ld -m elf_x86_64) is GNU ld... yes checking whether the x86_64-pld-linux-g++ linker (/usr/bin/ld -m elf_x86_64) supports shared libraries... yes checking for x86_64-pld-linux-g++ option to produce PIC... -fPIC checking if x86_64-pld-linux-g++ PIC flag -fPIC works... yes checking if x86_64-pld-linux-g++ static flag -static works... yes checking if x86_64-pld-linux-g++ supports -c -o file.o... yes checking whether the x86_64-pld-linux-g++ linker (/usr/bin/ld -m elf_x86_64) supports shared libraries... yes checking dynamic linker characteristics... GNU/Linux ld.so (cached) (cached) checking how to hardcode library paths into programs... immediate appending configuration tag "F77" to libtool checking if libtool supports shared libraries... yes checking whether to build shared libraries... yes checking whether to build static libraries... yes checking for x86_64-pld-linux-gfortran option to produce PIC... -fPIC checking if x86_64-pld-linux-gfortran PIC flag -fPIC works... yes checking if x86_64-pld-linux-gfortran static flag -static works... no checking if x86_64-pld-linux-gfortran supports -c -o file.o... yes checking whether the x86_64-pld-linux-gfortran linker (/usr/bin/ld -m elf_x86_64) supports shared libraries... yes checking dynamic linker characteristics... GNU/Linux ld.so (cached) (cached) checking how to hardcode library paths into programs... immediate checking for pthread_create in -lpthread... yes checking for x86_64-pld-linux-pkg-config... no checking for pkg-config... /usr/bin/pkg-config checking pkg-config is at least version 0.9.0... yes checking for GLIB... yes checking for GTK... yes checking for QALCULATE... yes checking for CLN... yes checking whether to use libgnome... auto checking for LIBGNOME... yes checking for scrollkeeper-config... /usr/bin/scrollkeeper-config checking locale.h usability... yes checking locale.h presence... yes checking for locale.h... yes checking for LC_MESSAGES... yes checking libintl.h usability... yes checking libintl.h presence... yes checking for libintl.h... yes checking for ngettext in libc... yes checking for dgettext in libc... yes checking for bind_textdomain_codeset... yes checking for msgfmt... (cached) /usr/bin/msgfmt checking for dcgettext... yes checking if msgfmt accepts -c... yes checking for gmsgfmt... /usr/bin/msgfmt checking for xgettext... (cached) /usr/bin/xgettext checking for catalogs to be installed... nl sv checking locale directory... "/usr/share/locale" configure: creating ./config.status config.status: creating Makefile config.status: creating data/Makefile config.status: creating doc/Makefile config.status: creating doc/C/Makefile config.status: creating src/Makefile config.status: creating po/Makefile.in config.status: creating config.h config.status: executing depfiles commands config.status: executing intltool commands config.status: executing default-1 commands config.status: executing po/stamp-it commands + /usr/bin/make -Otarget -j9 /usr/bin/make all-recursive Making all in data make[2]: Entering directory '/tmp/B.TusOH8/BUILD/qalculate-gtk-0.9.7/data' LC_ALL=C ../intltool-merge -d -u -c ../po/.intltool-merge-cache ../po qalculate-gtk.desktop.in qalculate-gtk.desktop Generating and caching the translation database Merging translations into qalculate-gtk.desktop. make[2]: Leaving directory '/tmp/B.TusOH8/BUILD/qalculate-gtk-0.9.7/data' Making all in src make[2]: Entering directory '/tmp/B.TusOH8/BUILD/qalculate-gtk-0.9.7/src' x86_64-pld-linux-g++ -DHAVE_CONFIG_H -I. -I.. -DPACKAGE_DATA_DIR=\""/usr/share"\" -DPACKAGE_LOCALE_DIR=\""/usr/share/locale"\" -D_REENTRANT -DORBIT2=1 -pthread -I/usr/include/libgnome-2.0 -I/usr/include/gnome-vfs-2.0 -I/usr/lib64/gnome-vfs-2.0/include -I/usr/include/gconf2 -I/usr/include/libmount -I/usr/include/blkid -I/usr/include/uuid -I/usr/include/libbonobo-2.0 -I/usr/include/bonobo-activation-2.0 -I/usr/include/orbit-2.0 -I/usr/include/glib-2.0 -I/usr/lib64/glib-2.0/include -pthread -I/usr/include/libglade-2.0 -I/usr/include/gtk-2.0 -I/usr/lib64/gtk-2.0/include -I/usr/include/pango-1.0 -I/usr/include/gio-unix-2.0/ -I/usr/include/cairo -I/usr/include/atk-1.0 -I/usr/include/cairo -I/usr/include/pixman-1 -I/usr/include/gdk-pixbuf-2.0 -I/usr/include/libmount -I/usr/include/blkid -I/usr/include/pango-1.0 -I/usr/include/fribidi -I/usr/include/uuid -I/usr/include/freetype2 -I/usr/include/libpng16 -I/usr/include/harfbuzz -I/usr/include/glib-2.0 -I/usr/lib64/glib-2.0/include -I/usr/include/libxml2 -I/usr/include/glib-2.0 -I/usr/lib64/glib-2.0/include -I/usr/include/libxml2 -O2 -fwrapv -pipe -Wformat -Werror=format-security -gdwarf-4 -fno-debug-types-section -fvar-tracking-assignments -g2 -Wp,-D_FORTIFY_SOURCE=2 -fstack-protector-strong --param=ssp-buffer-size=4 -fPIC -march=x86-64 -gdwarf-4 -fno-debug-types-section -fvar-tracking-assignments -g2 -MT main.o -MD -MP -MF .deps/main.Tpo -c -o main.o main.cc main.cc: In function 'int main(int, char**)': main.cc:271:6: warning: ignoring return value of 'int pipe(int*)', declared with attribute warn_unused_result [-Wunused-result] pipe(pipe_wr); ~~~~^~~~~~~~~ main.cc:278:6: warning: ignoring return value of 'int pipe(int*)', declared with attribute warn_unused_result [-Wunused-result] pipe(pipe_wr2); ~~~~^~~~~~~~~~ mv -f .deps/main.Tpo .deps/main.Po make[2]: Leaving directory '/tmp/B.TusOH8/BUILD/qalculate-gtk-0.9.7/src' make[2]: Entering directory '/tmp/B.TusOH8/BUILD/qalculate-gtk-0.9.7/src' x86_64-pld-linux-g++ -DHAVE_CONFIG_H -I. -I.. -DPACKAGE_DATA_DIR=\""/usr/share"\" -DPACKAGE_LOCALE_DIR=\""/usr/share/locale"\" -D_REENTRANT -DORBIT2=1 -pthread -I/usr/include/libgnome-2.0 -I/usr/include/gnome-vfs-2.0 -I/usr/lib64/gnome-vfs-2.0/include -I/usr/include/gconf2 -I/usr/include/libmount -I/usr/include/blkid -I/usr/include/uuid -I/usr/include/libbonobo-2.0 -I/usr/include/bonobo-activation-2.0 -I/usr/include/orbit-2.0 -I/usr/include/glib-2.0 -I/usr/lib64/glib-2.0/include -pthread -I/usr/include/libglade-2.0 -I/usr/include/gtk-2.0 -I/usr/lib64/gtk-2.0/include -I/usr/include/pango-1.0 -I/usr/include/gio-unix-2.0/ -I/usr/include/cairo -I/usr/include/atk-1.0 -I/usr/include/cairo -I/usr/include/pixman-1 -I/usr/include/gdk-pixbuf-2.0 -I/usr/include/libmount -I/usr/include/blkid -I/usr/include/pango-1.0 -I/usr/include/fribidi -I/usr/include/uuid -I/usr/include/freetype2 -I/usr/include/libpng16 -I/usr/include/harfbuzz -I/usr/include/glib-2.0 -I/usr/lib64/glib-2.0/include -I/usr/include/libxml2 -I/usr/include/glib-2.0 -I/usr/lib64/glib-2.0/include -I/usr/include/libxml2 -O2 -fwrapv -pipe -Wformat -Werror=format-security -gdwarf-4 -fno-debug-types-section -fvar-tracking-assignments -g2 -Wp,-D_FORTIFY_SOURCE=2 -fstack-protector-strong --param=ssp-buffer-size=4 -fPIC -march=x86-64 -gdwarf-4 -fno-debug-types-section -fvar-tracking-assignments -g2 -MT callbacks.o -MD -MP -MF .deps/callbacks.Tpo -c -o callbacks.o callbacks.cc callbacks.cc:183:1: error: 'Sgi' does not name a type Sgi::hash_map<int, GdkPixbuf*> left_par_pix; ^~~ callbacks.cc:184:1: error: 'Sgi' does not name a type Sgi::hash_map<int, GdkPixbuf*> right_par_pix; ^~~ callbacks.cc: In function 'void clear_parenthesis_pix()': callbacks.cc:231:35: warning: 'void gdk_pixbuf_unref(GdkPixbuf*)' is deprecated: Use 'g_object_unref' instead [-Wdeprecated-declarations] gdk_pixbuf_unref(pixbuf_left_par); ^ In file included from /usr/include/gdk-pixbuf-2.0/gdk-pixbuf/gdk-pixbuf.h:34, from /usr/include/gtk-2.0/gdk/gdkpixbuf.h:37, from /usr/include/gtk-2.0/gdk/gdkcairo.h:28, from /usr/include/gtk-2.0/gdk/gdk.h:33, from /usr/include/gtk-2.0/gtk/gtk.h:32, from callbacks.cc:17: /usr/include/gdk-pixbuf-2.0/gdk-pixbuf/gdk-pixbuf-core.h:232:12: note: declared here void gdk_pixbuf_unref (GdkPixbuf *pixbuf); ^~~~~~~~~~~~~~~~ callbacks.cc:231:35: warning: 'void gdk_pixbuf_unref(GdkPixbuf*)' is deprecated: Use 'g_object_unref' instead [-Wdeprecated-declarations] gdk_pixbuf_unref(pixbuf_left_par); ^ In file included from /usr/include/gdk-pixbuf-2.0/gdk-pixbuf/gdk-pixbuf.h:34, from /usr/include/gtk-2.0/gdk/gdkpixbuf.h:37, from /usr/include/gtk-2.0/gdk/gdkcairo.h:28, from /usr/include/gtk-2.0/gdk/gdk.h:33, from /usr/include/gtk-2.0/gtk/gtk.h:32, from callbacks.cc:17: /usr/include/gdk-pixbuf-2.0/gdk-pixbuf/gdk-pixbuf-core.h:232:12: note: declared here void gdk_pixbuf_unref (GdkPixbuf *pixbuf); ^~~~~~~~~~~~~~~~ callbacks.cc:235:36: warning: 'void gdk_pixbuf_unref(GdkPixbuf*)' is deprecated: Use 'g_object_unref' instead [-Wdeprecated-declarations] gdk_pixbuf_unref(pixbuf_right_par); ^ In file included from /usr/include/gdk-pixbuf-2.0/gdk-pixbuf/gdk-pixbuf.h:34, from /usr/include/gtk-2.0/gdk/gdkpixbuf.h:37, from /usr/include/gtk-2.0/gdk/gdkcairo.h:28, from /usr/include/gtk-2.0/gdk/gdk.h:33, from /usr/include/gtk-2.0/gtk/gtk.h:32, from callbacks.cc:17: /usr/include/gdk-pixbuf-2.0/gdk-pixbuf/gdk-pixbuf-core.h:232:12: note: declared here void gdk_pixbuf_unref (GdkPixbuf *pixbuf); ^~~~~~~~~~~~~~~~ callbacks.cc:235:36: warning: 'void gdk_pixbuf_unref(GdkPixbuf*)' is deprecated: Use 'g_object_unref' instead [-Wdeprecated-declarations] gdk_pixbuf_unref(pixbuf_right_par); ^ In file included from /usr/include/gdk-pixbuf-2.0/gdk-pixbuf/gdk-pixbuf.h:34, from /usr/include/gtk-2.0/gdk/gdkpixbuf.h:37, from /usr/include/gtk-2.0/gdk/gdkcairo.h:28, from /usr/include/gtk-2.0/gdk/gdk.h:33, from /usr/include/gtk-2.0/gtk/gtk.h:32, from callbacks.cc:17: /usr/include/gdk-pixbuf-2.0/gdk-pixbuf/gdk-pixbuf-core.h:232:12: note: declared here void gdk_pixbuf_unref (GdkPixbuf *pixbuf); ^~~~~~~~~~~~~~~~ callbacks.cc:238:6: error: 'Sgi' has not been declared for(Sgi::hash_map<int, GdkPixbuf*>::iterator it = left_par_pix.begin(); it != left_par_pix.end(); ++it) { ^~~ callbacks.cc:238:20: error: expected primary-expression before 'int' for(Sgi::hash_map<int, GdkPixbuf*>::iterator it = left_par_pix.begin(); it != left_par_pix.end(); ++it) { ^~~ callbacks.cc:238:74: error: 'it' was not declared in this scope for(Sgi::hash_map<int, GdkPixbuf*>::iterator it = left_par_pix.begin(); it != left_par_pix.end(); ++it) { ^~ callbacks.cc:238:74: note: suggested alternative: 'int' for(Sgi::hash_map<int, GdkPixbuf*>::iterator it = left_par_pix.begin(); it != left_par_pix.end(); ++it) { ^~ int callbacks.cc:238:80: error: 'left_par_pix' was not declared in this scope for(Sgi::hash_map<int, GdkPixbuf*>::iterator it = left_par_pix.begin(); it != left_par_pix.end(); ++it) { ^~~~~~~~~~~~ callbacks.cc:238:80: note: suggested alternative: 'set_prefix' for(Sgi::hash_map<int, GdkPixbuf*>::iterator it = left_par_pix.begin(); it != left_par_pix.end(); ++it) { ^~~~~~~~~~~~ set_prefix callbacks.cc:241:2: error: 'left_par_pix' was not declared in this scope left_par_pix.clear(); ^~~~~~~~~~~~ callbacks.cc:241:2: note: suggested alternative: 'set_prefix' left_par_pix.clear(); ^~~~~~~~~~~~ set_prefix callbacks.cc:242:6: error: 'Sgi' has not been declared for(Sgi::hash_map<int, GdkPixbuf*>::iterator it = right_par_pix.begin(); it != right_par_pix.end(); ++it) { ^~~ callbacks.cc:242:20: error: expected primary-expression before 'int' for(Sgi::hash_map<int, GdkPixbuf*>::iterator it = right_par_pix.begin(); it != right_par_pix.end(); ++it) { ^~~ callbacks.cc:242:75: error: 'it' was not declared in this scope for(Sgi::hash_map<int, GdkPixbuf*>::iterator it = right_par_pix.begin(); it != right_par_pix.end(); ++it) { ^~ callbacks.cc:242:75: note: suggested alternative: 'int' for(Sgi::hash_map<int, GdkPixbuf*>::iterator it = right_par_pix.begin(); it != right_par_pix.end(); ++it) { ^~ int callbacks.cc:242:81: error: 'right_par_pix' was not declared in this scope for(Sgi::hash_map<int, GdkPixbuf*>::iterator it = right_par_pix.begin(); it != right_par_pix.end(); ++it) { ^~~~~~~~~~~~~ callbacks.cc:245:2: error: 'right_par_pix' was not declared in this scope right_par_pix.clear(); ^~~~~~~~~~~~~ callbacks.cc: In function 'GdkPixbuf* get_left_parenthesis(gint, gint, int)': callbacks.cc:3179:5: error: 'left_par_pix' was not declared in this scope if(left_par_pix.count(arc_w * 1000 + arc_h) > 0) { ^~~~~~~~~~~~ callbacks.cc:3179:5: note: suggested alternative: 'set_prefix' if(left_par_pix.count(arc_w * 1000 + arc_h) > 0) { ^~~~~~~~~~~~ set_prefix callbacks.cc:3195:2: error: 'left_par_pix' was not declared in this scope left_par_pix[arc_w * 1000 + arc_h] = pixbuf_parl; ^~~~~~~~~~~~ callbacks.cc:3195:2: note: suggested alternative: 'set_prefix' left_par_pix[arc_w * 1000 + arc_h] = pixbuf_parl; ^~~~~~~~~~~~ set_prefix callbacks.cc: In function 'GdkPixbuf* get_right_parenthesis(gint, gint, int)': callbacks.cc:3199:5: error: 'right_par_pix' was not declared in this scope if(right_par_pix.count(arc_w * 1000 + arc_h) > 0) { ^~~~~~~~~~~~~ callbacks.cc:3215:2: error: 'right_par_pix' was not declared in this scope right_par_pix[arc_w * 1000 + arc_h] = pixbuf_parl; ^~~~~~~~~~~~~ callbacks.cc: In function 'void clearresult()': callbacks.cc:4554:33: warning: 'void gdk_pixbuf_unref(GdkPixbuf*)' is deprecated: Use 'g_object_unref' instead [-Wdeprecated-declarations] gdk_pixbuf_unref(pixbuf_result); ^ In file included from /usr/include/gdk-pixbuf-2.0/gdk-pixbuf/gdk-pixbuf.h:34, from /usr/include/gtk-2.0/gdk/gdkpixbuf.h:37, from /usr/include/gtk-2.0/gdk/gdkcairo.h:28, from /usr/include/gtk-2.0/gdk/gdk.h:33, from /usr/include/gtk-2.0/gtk/gtk.h:32, from callbacks.cc:17: /usr/include/gdk-pixbuf-2.0/gdk-pixbuf/gdk-pixbuf-core.h:232:12: note: declared here void gdk_pixbuf_unref (GdkPixbuf *pixbuf); ^~~~~~~~~~~~~~~~ callbacks.cc:4554:33: warning: 'void gdk_pixbuf_unref(GdkPixbuf*)' is deprecated: Use 'g_object_unref' instead [-Wdeprecated-declarations] gdk_pixbuf_unref(pixbuf_result); ^ In file included from /usr/include/gdk-pixbuf-2.0/gdk-pixbuf/gdk-pixbuf.h:34, from /usr/include/gtk-2.0/gdk/gdkpixbuf.h:37, from /usr/include/gtk-2.0/gdk/gdkcairo.h:28, from /usr/include/gtk-2.0/gdk/gdk.h:33, from /usr/include/gtk-2.0/gtk/gtk.h:32, from callbacks.cc:17: /usr/include/gdk-pixbuf-2.0/gdk-pixbuf/gdk-pixbuf-core.h:232:12: note: declared here void gdk_pixbuf_unref (GdkPixbuf *pixbuf); ^~~~~~~~~~~~~~~~ callbacks.cc: In function 'void setResult(Prefix*, bool, bool, bool, std::__cxx11::string, size_t, bool)': callbacks.cc:4789:35: warning: 'void gdk_pixbuf_unref(GdkPixbuf*)' is deprecated: Use 'g_object_unref' instead [-Wdeprecated-declarations] gdk_pixbuf_unref(pixbuf_result); ^ In file included from /usr/include/gdk-pixbuf-2.0/gdk-pixbuf/gdk-pixbuf.h:34, from /usr/include/gtk-2.0/gdk/gdkpixbuf.h:37, from /usr/include/gtk-2.0/gdk/gdkcairo.h:28, from /usr/include/gtk-2.0/gdk/gdk.h:33, from /usr/include/gtk-2.0/gtk/gtk.h:32, from callbacks.cc:17: /usr/include/gdk-pixbuf-2.0/gdk-pixbuf/gdk-pixbuf-core.h:232:12: note: declared here void gdk_pixbuf_unref (GdkPixbuf *pixbuf); ^~~~~~~~~~~~~~~~ callbacks.cc:4789:35: warning: 'void gdk_pixbuf_unref(GdkPixbuf*)' is deprecated: Use 'g_object_unref' instead [-Wdeprecated-declarations] gdk_pixbuf_unref(pixbuf_result); ^ In file included from /usr/include/gdk-pixbuf-2.0/gdk-pixbuf/gdk-pixbuf.h:34, from /usr/include/gtk-2.0/gdk/gdkpixbuf.h:37, from /usr/include/gtk-2.0/gdk/gdkcairo.h:28, from /usr/include/gtk-2.0/gdk/gdk.h:33, from /usr/include/gtk-2.0/gtk/gtk.h:32, from callbacks.cc:17: /usr/include/gdk-pixbuf-2.0/gdk-pixbuf/gdk-pixbuf-core.h:232:12: note: declared here void gdk_pixbuf_unref (GdkPixbuf *pixbuf); ^~~~~~~~~~~~~~~~ callbacks.cc:4906:38: warning: 'void gdk_pixbuf_unref(GdkPixbuf*)' is deprecated: Use 'g_object_unref' instead [-Wdeprecated-declarations] gdk_pixbuf_unref(pixbuf_result_tmp); ^ In file included from /usr/include/gdk-pixbuf-2.0/gdk-pixbuf/gdk-pixbuf.h:34, from /usr/include/gtk-2.0/gdk/gdkpixbuf.h:37, from /usr/include/gtk-2.0/gdk/gdkcairo.h:28, from /usr/include/gtk-2.0/gdk/gdk.h:33, from /usr/include/gtk-2.0/gtk/gtk.h:32, from callbacks.cc:17: /usr/include/gdk-pixbuf-2.0/gdk-pixbuf/gdk-pixbuf-core.h:232:12: note: declared here void gdk_pixbuf_unref (GdkPixbuf *pixbuf); ^~~~~~~~~~~~~~~~ callbacks.cc:4906:38: warning: 'void gdk_pixbuf_unref(GdkPixbuf*)' is deprecated: Use 'g_object_unref' instead [-Wdeprecated-declarations] gdk_pixbuf_unref(pixbuf_result_tmp); ^ In file included from /usr/include/gdk-pixbuf-2.0/gdk-pixbuf/gdk-pixbuf.h:34, from /usr/include/gtk-2.0/gdk/gdkpixbuf.h:37, from /usr/include/gtk-2.0/gdk/gdkcairo.h:28, from /usr/include/gtk-2.0/gdk/gdk.h:33, from /usr/include/gtk-2.0/gtk/gtk.h:32, from callbacks.cc:17: /usr/include/gdk-pixbuf-2.0/gdk-pixbuf/gdk-pixbuf-core.h:232:12: note: declared here void gdk_pixbuf_unref (GdkPixbuf *pixbuf); ^~~~~~~~~~~~~~~~ callbacks.cc: In function 'gboolean on_tMatrixEdit_cursor_changed(GtkTreeView*, gpointer)': callbacks.cc:12498:32: warning: format '%i' expects argument of type 'int', but argument 2 has type 'std::vector<_GtkTreeViewColumn*>::size_type' {aka 'long unsigned int'} [-Wformat=] pos_str = g_strdup_printf("%i", i_column + 1 + matrix_edit_columns.size() * gtk_tree_path_get_indices(path)[0]); ^~~~ ~~~~~~~~~~~~~~~~~~~~~~~~~~~~~~~~~~~~~~~~~~~~~~~~~~~~~~~~~~~~~~~~~~~~~~~~~~~~~~ callbacks.cc: In function 'gboolean on_tMatrix_cursor_changed(GtkTreeView*, gpointer)': callbacks.cc:12662:32: warning: format '%i' expects argument of type 'int', but argument 2 has type 'std::vector<_GtkTreeViewColumn*>::size_type' {aka 'long unsigned int'} [-Wformat=] pos_str = g_strdup_printf("%i", i_column + 1 + matrix_columns.size() * gtk_tree_path_get_indices(path)[0]); ^~~~ ~~~~~~~~~~~~~~~~~~~~~~~~~~~~~~~~~~~~~~~~~~~~~~~~~~~~~~~~~~~~~~~~~~~~~~~~~ callbacks.cc: In function 'void* view_proc(void*)': callbacks.cc:4579:8: warning: ignoring return value of 'size_t fread(void*, size_t, size_t, FILE*)', declared with attribute warn_unused_result [-Wunused-result] fread(&scale_n, sizeof(int), 1, view_pipe); ~~~~~^~~~~~~~~~~~~~~~~~~~~~~~~~~~~~~~~~~~~ callbacks.cc:4580:8: warning: ignoring return value of 'size_t fread(void*, size_t, size_t, FILE*)', declared with attribute warn_unused_result [-Wunused-result] fread(&x, sizeof(void*), 1, view_pipe); ~~~~~^~~~~~~~~~~~~~~~~~~~~~~~~~~~~~~~~ callbacks.cc:4583:8: warning: ignoring return value of 'size_t fread(void*, size_t, size_t, FILE*)', declared with attribute warn_unused_result [-Wunused-result] fread(&b_stack, sizeof(bool), 1, view_pipe); ~~~~~^~~~~~~~~~~~~~~~~~~~~~~~~~~~~~~~~~~~~~ callbacks.cc:4584:8: warning: ignoring return value of 'size_t fread(void*, size_t, size_t, FILE*)', declared with attribute warn_unused_result [-Wunused-result] fread(&x, sizeof(void*), 1, view_pipe); ~~~~~^~~~~~~~~~~~~~~~~~~~~~~~~~~~~~~~~ callbacks.cc:4587:9: warning: ignoring return value of 'size_t fread(void*, size_t, size_t, FILE*)', declared with attribute warn_unused_result [-Wunused-result] fread(&x, sizeof(void*), 1, view_pipe); ~~~~~^~~~~~~~~~~~~~~~~~~~~~~~~~~~~~~~~ callbacks.cc:4608:10: warning: ignoring return value of 'size_t fread(void*, size_t, size_t, FILE*)', declared with attribute warn_unused_result [-Wunused-result] fread(&po.is_approximate, sizeof(bool*), 1, view_pipe); ~~~~~^~~~~~~~~~~~~~~~~~~~~~~~~~~~~~~~~~~~~~~~~~~~~~~~~ callbacks.cc:4611:10: warning: ignoring return value of 'size_t fread(void*, size_t, size_t, FILE*)', declared with attribute warn_unused_result [-Wunused-result] fread(&x, sizeof(void*), 1, view_pipe); ~~~~~^~~~~~~~~~~~~~~~~~~~~~~~~~~~~~~~~ callbacks.cc: In function 'void* command_proc(void*)': callbacks.cc:5028:8: warning: ignoring return value of 'size_t fread(void*, size_t, size_t, FILE*)', declared with attribute warn_unused_result [-Wunused-result] fread(&command_type, sizeof(int), 1, command_pipe); ~~~~~^~~~~~~~~~~~~~~~~~~~~~~~~~~~~~~~~~~~~~~~~~~~~ callbacks.cc:5029:8: warning: ignoring return value of 'size_t fread(void*, size_t, size_t, FILE*)', declared with attribute warn_unused_result [-Wunused-result] fread(&x, sizeof(void*), 1, command_pipe); ~~~~~^~~~~~~~~~~~~~~~~~~~~~~~~~~~~~~~~~~~ make[2]: *** [Makefile:346: callbacks.o] Error 1 make[2]: Leaving directory '/tmp/B.TusOH8/BUILD/qalculate-gtk-0.9.7/src' make[2]: *** Waiting for unfinished jobs.... make[2]: Entering directory '/tmp/B.TusOH8/BUILD/qalculate-gtk-0.9.7/src' x86_64-pld-linux-g++ -DHAVE_CONFIG_H -I. -I.. -DPACKAGE_DATA_DIR=\""/usr/share"\" -DPACKAGE_LOCALE_DIR=\""/usr/share/locale"\" -D_REENTRANT -DORBIT2=1 -pthread -I/usr/include/libgnome-2.0 -I/usr/include/gnome-vfs-2.0 -I/usr/lib64/gnome-vfs-2.0/include -I/usr/include/gconf2 -I/usr/include/libmount -I/usr/include/blkid -I/usr/include/uuid -I/usr/include/libbonobo-2.0 -I/usr/include/bonobo-activation-2.0 -I/usr/include/orbit-2.0 -I/usr/include/glib-2.0 -I/usr/lib64/glib-2.0/include -pthread -I/usr/include/libglade-2.0 -I/usr/include/gtk-2.0 -I/usr/lib64/gtk-2.0/include -I/usr/include/pango-1.0 -I/usr/include/gio-unix-2.0/ -I/usr/include/cairo -I/usr/include/atk-1.0 -I/usr/include/cairo -I/usr/include/pixman-1 -I/usr/include/gdk-pixbuf-2.0 -I/usr/include/libmount -I/usr/include/blkid -I/usr/include/pango-1.0 -I/usr/include/fribidi -I/usr/include/uuid -I/usr/include/freetype2 -I/usr/include/libpng16 -I/usr/include/harfbuzz -I/usr/include/glib-2.0 -I/usr/lib64/glib-2.0/include -I/usr/include/libxml2 -I/usr/include/glib-2.0 -I/usr/lib64/glib-2.0/include -I/usr/include/libxml2 -O2 -fwrapv -pipe -Wformat -Werror=format-security -gdwarf-4 -fno-debug-types-section -fvar-tracking-assignments -g2 -Wp,-D_FORTIFY_SOURCE=2 -fstack-protector-strong --param=ssp-buffer-size=4 -fPIC -march=x86-64 -gdwarf-4 -fno-debug-types-section -fvar-tracking-assignments -g2 -MT interface.o -MD -MP -MF .deps/interface.Tpo -c -o interface.o interface.cc mv -f .deps/interface.Tpo .deps/interface.Po make[2]: Leaving directory '/tmp/B.TusOH8/BUILD/qalculate-gtk-0.9.7/src' make[1]: *** [Makefile:322: all-recursive] Error 1 make: *** [Makefile:252: all] Error 2 error: Bad exit status from /tmp/B.TusOH8/BUILD/tmp/rpm-tmp.25529 (%build) RPM build errors: Bad exit status from /tmp/B.TusOH8/BUILD/tmp/rpm-tmp.25529 (%build) ended at: Sun Feb 10 12:06:27 2019, done in 0:00:08.444604 error: No files produced. + chmod -R u+rwX /tmp/B.TusOH8/BUILD + rm -rf /tmp/B.TusOH8/tmp /tmp/B.TusOH8/BUILD + rm -rf /tmp/B.TusOH8 Begin-PLD-Builder-Info Build-Time: user:8.84s sys:1.86s real:10.83s (faults io:0 non-io:886938) End-PLD-Builder-Info
[Back to list of logs] [View rpm -qa of builder]