FailedOk

th/SRPMS[OK]
th/x32[OK]
th/i686[OK]
th/x86_64[OK]

ac/SRPMS[OK]
ac/i386[OK]
ac/i586[OK]
ac/i686[OK]
ac/alpha[OK]
ac/amd64[OK]
ac/athlon[OK]
ac/ppc[OK]
ac/sparc[OK]
ac/sparc64[OK]

Advanced Search
main()
Powered by PLD Linux
(c) 2002-2018 PLD Team
$Revision: 1.37 $
Powered by NSA.
Your IP: 54.92.153.90

ruby ccb97596-fae7-42ba-8b53-0cf3fd75a953

Status:Failed
Source URL:ftp://buildlogs.pld-linux.org/th/x86_64/FAIL/ruby,ccb97596-fae7-42ba-8b53-0cf3fd75a953.bz2
text/plain URL:View!
full text:View!
rpm -qa of builder:View!
Date:2018/05/30 16:44:59
Runtime:0:00:41.579722

Toc:

  • error 1
  • make[1]: *** [uncommon.mk:1086: enc/unicode/data/9.0.0/UnicodeData.txt] Error 1
  • error 2
  • error: Bad exit status from /tmp/B.l8fksb/BUILD/tmp/rpm-tmp.66349 (%build)
  • error 3
  • RPM build errors:
  • error 4
  • error: No files produced.

Content:

config.status: creating ruby-2.4.pc
---
Configuration summary for ruby version 2.4.4

   * Installation prefix: /usr
   * exec prefix:         /usr
   * arch:                x86_64-linux
   * site arch:           ${arch}
   * RUBY_BASE_NAME:      ruby
   * enable shared:       yes
   * ruby lib prefix:     ${exec_prefix}/share/ruby/2.4
   * site libraries path: ${sitearchlibdir}/${RUBY_BASE_NAME}
   * vendor path:         /usr/share/ruby/vendor_ruby
   * target OS:           linux
   * compiler:            x86_64-pld-linux-gcc
   * with pthread:        yes
   * enable shared libs:  yes
   * dynamic library ext: so
   * CFLAGS:              ${optflags} ${debugflags} ${warnflags}
   * LDFLAGS:             -L. -Wl,--as-needed \
                          -Wl,--no-copy-dt-needed-entries -Wl,-z,relro \
                          -Wl,-z,combreloc  -fstack-protector -rdynamic \
                          -Wl,-export-dynamic
   * optflags:            -O3 -fno-fast-math
   * debugflags:          -ggdb3
   * warnflags:           -Wall -Wextra -Wno-unused-parameter \
                          -Wno-parentheses -Wno-long-long \
                          -Wno-missing-field-initializers \
                          -Wno-tautological-compare \
                          -Wno-parentheses-equality \
                          -Wno-constant-logical-operand -Wno-self-assign \
                          -Wunused-variable -Wimplicit-int -Wpointer-arith \
                          -Wwrite-strings -Wdeclaration-after-statement \
                          -Wimplicit-function-declaration \
                          -Wdeprecated-declarations \
                          -Wno-packed-bitfield-compat \
                          -Wsuggest-attribute=noreturn \
                          -Wsuggest-attribute=format \
                          -Wimplicit-fallthrough=0
   * strip command:       strip -S -x
   * install doc:         no
   * man page type:       doc

---
+ /usr/bin/make -Otarget -j9 -j1 main 'COPY=cp -p' 'Q='
	CC = x86_64-pld-linux-gcc
	LD = ld
	LDSHARED = x86_64-pld-linux-gcc -shared
	CFLAGS = -O2 -fwrapv -pipe -Wformat -Werror=format-security -gdwarf-4 -fno-debug-types-section -fvar-tracking-assignments -g2 -Wp,-D_FORTIFY_SOURCE=2 -fstack-protector-strong --param=ssp-buffer-size=4 -fPIC -march=x86-64 -gdwarf-4 -fno-debug-types-section -fvar-tracking-assignments -g2  -fPIC 
	XCFLAGS = -D_FORTIFY_SOURCE=2 -fstack-protector -fno-strict-overflow -fvisibility=hidden -fexcess-precision=standard -DRUBY_EXPORT
	CPPFLAGS =   -I. -I.ext/include/x86_64-linux -I./include -I. -I./enc/unicode/9.0.0
	DLDFLAGS = -Wl,--as-needed -Wl,--no-copy-dt-needed-entries -Wl,-z,relro -Wl,-z,combreloc  -Wl,--compress-debug-sections=zlib -Wl,-soname,libruby.so.2.4 -fstack-protector  
	SOLIBS = -lpthread -lgmp -ldl -lcrypt -lm  
x86_64-pld-linux-gcc (PLD-Linux) 7.3.0 20180125 (release)
Copyright (C) 2017 Free Software Foundation, Inc.
This is free software; see the source for copying conditions.  There is NO
warranty; not even for MERCHANTABILITY or FITNESS FOR A PARTICULAR PURPOSE.

translating probes probes.d
dtrace  -o probes.h.tmp -h -C -I. -I.ext/include/x86_64-linux -I./include -I. -I./enc/unicode/9.0.0 -s probes.d
sed -e 's/RUBY_/RUBY_DTRACE_/g' -e 's/PROBES_H_TMP/RUBY_PROBES_H/' -e 's/(char \*/(const char */g' -e 's/, char \*/, const char */g' probes.h.tmp > probes.h
rm -f probes.h.tmp
generating id.h
/usr/bin/ruby --disable=gems ./tool/generic_erb.rb --output=id.h \
	./template/id.h.tmpl
id.h updated
generating opt_sc.inc
/usr/bin/ruby --disable=gems -Ku ./tool/insns2vm.rb --srcdir="." opt_sc.inc
generating optinsn.inc
/usr/bin/ruby --disable=gems -Ku ./tool/insns2vm.rb --srcdir="." optinsn.inc
generating optunifs.inc
/usr/bin/ruby --disable=gems -Ku ./tool/insns2vm.rb --srcdir="." optunifs.inc
generating insns.inc
/usr/bin/ruby --disable=gems -Ku ./tool/insns2vm.rb --srcdir="." insns.inc
generating insns_info.inc
/usr/bin/ruby --disable=gems -Ku ./tool/insns2vm.rb --srcdir="." insns_info.inc
generating vmtc.inc
/usr/bin/ruby --disable=gems -Ku ./tool/insns2vm.rb --srcdir="." vmtc.inc
generating vm.inc
/usr/bin/ruby --disable=gems -Ku ./tool/insns2vm.rb --srcdir="." vm.inc
generating vm_call_iseq_optimized.inc
/usr/bin/ruby --disable=gems ./tool/mk_call_iseq_optimized.rb > vm_call_iseq_optimized.inc
/usr/bin/ruby --disable=gems ./tool/file2lastrev.rb --revision.h "." > revision.tmp
file2lastrev.rb: does not seem to be under a vcs: .
make: [uncommon.mk:903: .revision.time] Error 1 (ignored)
./tool/ifchange "--timestamp=.revision.time" "./revision.h" revision.tmp
./revision.h unchanged
/usr/bin/make  Q= UNICODE_VERSION=9.0.0 update-unicode
make[1]: Entering directory '/tmp/B.l8fksb/BUILD/ruby-2.4.4'
Downloading Unicode 9.0.0 data files...
/bin/mkdir -p "./enc/unicode/data/9.0.0"
/usr/bin/ruby --disable=gems -C "." tool/downloader.rb -d enc/unicode/data/9.0.0 -p 9.0.0/ucd -e  unicode ./enc/unicode/data/9.0.0/UnicodeData.txt ./enc/unicode/data/9.0.0/CompositionExclusions.txt ./enc/unicode/data/9.0.0/NormalizationTest.txt ./enc/unicode/data/9.0.0/CaseFolding.txt ./enc/unicode/data/9.0.0/SpecialCasing.txt 
downloading 9.0.0/ucd/UnicodeData.txt ... tool/downloader.rb:183:in `rescue in download': failed to download 9.0.0/ucd/UnicodeData.txt (RuntimeError)
Failed to open TCP connection to www.unicode.org:80 (getaddrinfo: Temporary failure in name resolution): http://www.unicode.org/Public/9.0.0/ucd/UnicodeData.txt
	from tool/downloader.rb:125:in `download'
	from tool/downloader.rb:75:in `download'
	from tool/downloader.rb:238:in `block in <main>'
	from tool/downloader.rb:230:in `each'
	from tool/downloader.rb:230:in `<main>'
make[1]: *** [uncommon.mk:1086: enc/unicode/data/9.0.0/UnicodeData.txt] Error 1
make[1]: Leaving directory '/tmp/B.l8fksb/BUILD/ruby-2.4.4'
make: *** [uncommon.mk:1124: enc/unicode/9.0.0/casefold.h] Error 2
error: Bad exit status from /tmp/B.l8fksb/BUILD/tmp/rpm-tmp.66349 (%build)


RPM build errors:
    Bad exit status from /tmp/B.l8fksb/BUILD/tmp/rpm-tmp.66349 (%build)
ended at: Wed May 30 16:44:58 2018, done in 0:00:41.579722
error: No files produced.
mesg: ttyname failed: Inappropriate ioctl for device
+ chmod -R u+rwX /tmp/B.l8fksb/BUILD
+ rm -rf /tmp/B.l8fksb/tmp /tmp/B.l8fksb/BUILD
mesg: ttyname failed: Inappropriate ioctl for device
+ rm -rf /tmp/B.l8fksb
Begin-PLD-Builder-Info
Build-Time: user:24.04s sys:12.78s real:62.32s (faults io:47 non-io:2976275)

End-PLD-Builder-Info
[Back to list of logs] [View rpm -qa of builder]