FailedOk

th/SRPMS[OK]
th/x32[OK]
th/i686[OK]
th/x86_64[OK]

ac/SRPMS[OK]
ac/i386[OK]
ac/i586[OK]
ac/i686[OK]
ac/alpha[OK]
ac/amd64[OK]
ac/athlon[OK]
ac/ppc[OK]
ac/sparc[OK]
ac/sparc64[OK]

Advanced Search
main()
Powered by PLD Linux
(c) 2002-2020 PLD Team
$Revision: 1.37 $
Powered by PDP-11.
Your IP: 3.235.101.141

ruby-re2 d32cb279-231d-45b1-92dc-30a55658f4eb

Status:Failed
Source URL:https://buildlogs.pld-linux.org/pld/th/x86_64/FAIL/ruby-re2,d32cb279-231d-45b1-92dc-30a55658f4eb.bz2
text/plain URL:View!
full text:View!
rpm -qa of builder:View!
Date:2020/09/27 22:27:47
Runtime:0:00:02.713409

Toc:

  • error 1
  • re2.cc:233:37: error: 'const class re2::RE2::Options' has no member named 'utf8'
  • error 2
  • re2.cc:423:35: error: 'const class re2::RE2::Options' has no member named 'utf8'
  • error 3
  • re2.cc:447:33: error: 'const class re2::RE2::Options' has no member named 'utf8'
  • error 4
  • re2.cc:578:29: error: 'const class re2::RE2::Options' has no member named 'utf8'
  • error 5
  • re2.cc:651:19: error: 'class re2::RE2::Options' has no member named 'set_utf8'
  • error 6
  • re2.cc:734:29: error: 'const class re2::RE2::Options' has no member named 'utf8'
  • error 7
  • re2.cc:752:29: error: 'const class re2::RE2::Options' has no member named 'utf8'
  • error 8
  • re2.cc:782:42: error: 'const class re2::RE2::Options' has no member named 'utf8'
  • error 9
  • re2.cc:979:31: error: 'const class re2::RE2::Options' has no member named 'utf8'
  • error 10
  • re2.cc:1010:39: error: 'const class re2::RE2::Options' has no member named 'utf8'
  • error 11
  • re2.cc:1080:33: error: 'const class re2::RE2::Options' has no member named 'utf8'
  • error 12
  • re2.cc:1250:31: error: 'const class re2::RE2::Options' has no member named 'utf8'
  • error 13
  • re2.cc:1287:31: error: 'const class re2::RE2::Options' has no member named 'utf8'
  • error 14
  • error: Bad exit status from /tmp/B.DcJ1kz/BUILD/tmp/rpm-tmp.24566 (%build)
  • error 15
  • RPM build errors:
  • error 16
  • error: No files produced.

Content:

checking if we should skip the build
started at: Sun Sep 27 22:27:41 2020
killing old processes on a builder
sending signal 9 to pid -1
Killed
cleaning up /tmp
fetching https://srcbuilder.pld-linux.org/th//srpms/d32cb279-231d-45b1-92dc-30a55658f4eb/ruby-re2-0.7.0-6.src.rpm
fetched 26897 bytes, 99.1 K/s
installing srpm: ruby-re2-0.7.0-6.src.rpm
+ install -d /tmp/B.DcJ1kz/BUILD /tmp/B.DcJ1kz/RPMS
+ LC_ALL=en_US.UTF-8
+ rpm -qp --changelog ruby-re2-0.7.0-6.src.rpm
* Sun Sep 27 2020 PLD Linux Team <feedback@pld-linux.org>
- For complete changelog see: http://git.pld-linux.org/?p=packages/ruby-re2.git;a=log;h=master
* Fri May 01 2020 Jan Rękorajski <baggins@pld-linux.org> 2e845aa
- release 6 (by relup.sh) * Sat Mar 21 2020 Jan Rękorajski <baggins@pld-linux.org> 69123cd
- release 5 (by relup.sh) + rpm -Uhv --nodeps --define '_topdir /tmp/B.DcJ1kz' --define '_specdir %{_topdir}' --define '_sourcedir %{_specdir}' --define '_rpmdir %{_topdir}/RPMS' --define '_builddir %{_topdir}/BUILD' ruby-re2-0.7.0-6.src.rpm Preparing... ################################################## ruby-re2 ################################################## + rm -f ruby-re2-0.7.0-6.src.rpm + install -m 700 -d /tmp/B.DcJ1kz/BUILD/tmp + TMPDIR=/tmp/B.DcJ1kz/BUILD/tmp + exec nice -n 0 rpmbuild -bp --short-circuit --nodeps --define '_topdir /tmp/B.DcJ1kz' --define '_specdir %{_topdir}' --define '_sourcedir %{_specdir}' --define '_rpmdir %{_topdir}/RPMS' --define '_builddir %{_topdir}/BUILD' --target x86_64-pld-linux --define 'prep exit 0' /tmp/B.DcJ1kz/ruby-re2.spec Building target platforms: x86_64-pld-linux checking BuildConflict-ing packages no BuildConflicts found checking BR rpm: Building target platforms: x86_64-pld-linux no BR needed building RPM using: set -ex; : build-id: d32cb279-231d-45b1-92dc-30a55658f4eb; TMPDIR=/tmp/B.DcJ1kz/BUILD/tmp exec nice -n 0 rpmbuild -bb --define '_smp_mflags -j9' --define '_make_opts -Otarget' --define '_pld_builder 1' --define '_topdir /tmp/B.DcJ1kz' --define '_specdir %{_topdir}' --define '_sourcedir %{_specdir}' --define '_rpmdir %{_topdir}/RPMS' --define '_builddir %{_topdir}/BUILD' --target x86_64-pld-linux /tmp/B.DcJ1kz/ruby-re2.spec + : build-id: d32cb279-231d-45b1-92dc-30a55658f4eb + TMPDIR=/tmp/B.DcJ1kz/BUILD/tmp + exec nice -n 0 rpmbuild -bb --define '_smp_mflags -j9' --define '_make_opts -Otarget' --define '_pld_builder 1' --define '_topdir /tmp/B.DcJ1kz' --define '_specdir %{_topdir}' --define '_sourcedir %{_specdir}' --define '_rpmdir %{_topdir}/RPMS' --define '_builddir %{_topdir}/BUILD' --target x86_64-pld-linux /tmp/B.DcJ1kz/ruby-re2.spec Building target platforms: x86_64-pld-linux Executing(%prep): /bin/sh -e /tmp/B.DcJ1kz/BUILD/tmp/rpm-tmp.24566 + umask 022 + cd /tmp/B.DcJ1kz/BUILD + cd /tmp/B.DcJ1kz/BUILD + rm -rf re2-0.7.0 + /bin/mkdir -p re2-0.7.0 + cd re2-0.7.0 + /bin/tar -xmf /tmp/B.DcJ1kz/re2-0.7.0.gem + '[' -f data.tar.gz ']' + tar -xmf data.tar.gz + /bin/id -u + '[' 1000 '=' 0 ']' + /bin/id -u + '[' 1000 '=' 0 ']' + /bin/chmod -Rf a+rX,u+w,g-w,o-w . + exit 0 Executing(%build): /bin/sh -e /tmp/B.DcJ1kz/BUILD/tmp/rpm-tmp.24566 TMP=/home/users/builder/tmp HOME=/home/users/builder PATH=/home/users/builder/GNUstep/Tools:/bin:/usr/bin:/usr/local/bin:/home/users/builder/bin TMPDIR=/tmp/B.DcJ1kz/BUILD/tmp + umask 022 + cd /tmp/B.DcJ1kz/BUILD + cd re2-0.7.0 + /usr/lib/rpm/gem_helper.rb spec /usr/share/gems/gems/psych-3.1.0/lib/psych.rb:237: warning: already initialized constant Psych::LIBYAML_VERSION /usr/share/ruby/2.6/psych.rb:237: warning: previous definition of LIBYAML_VERSION was here /usr/share/gems/gems/psych-3.1.0/lib/psych.rb:239: warning: already initialized constant Psych::NOT_GIVEN /usr/share/ruby/2.6/psych.rb:239: warning: previous definition of NOT_GIVEN was here Wrote: re2-0.7.0.gemspec + cd ext/re2 + /usr/bin/ruby extconf.rb checking for -lstdc++... yes checking for stdint.h... yes checking for rb_str_sublen()... yes checking for -lre2... yes checking for RE2::Match() with endpos argument... yes creating Makefile + /usr/bin/make -Otarget -j9 'CC=x86_64-pld-linux-gcc' 'LDFLAGS=-Wl,--as-needed -Wl,--no-copy-dt-needed-entries -Wl,-z,relro -Wl,-z,combreloc ' 'CFLAGS=-O2 -fwrapv -pipe -Wformat -Werror=format-security -gdwarf-4 -fno-debug-types-section -fvar-tracking-assignments -g2 -Wp,-D_FORTIFY_SOURCE=2 -fstack-protector-strong --param=ssp-buffer-size=4 -Werror=trampolines -fPIC -march=x86-64 -gdwarf-4 -fno-debug-types-section -fvar-tracking-assignments -g2 -fPIC' x86_64-pld-linux-g++ -I. -I/usr/include/ruby-2.6 -I/usr/include/ruby-2.6/ruby/backward -I/usr/include/ruby-2.6 -I. -DHAVE_STDINT_H -DHAVE_RB_STR_SUBLEN -DHAVE_ENDPOS_ARGUMENT -I/usr/local/include -fPIC -O2 -fwrapv -pipe -Wformat -Werror=format-security -gdwarf-4 -fno-debug-types-section -fvar-tracking-assignments -g2 -Wp,-D_FORTIFY_SOURCE=2 -fstack-protector-strong --param=ssp-buffer-size=4 -Werror=trampolines -fPIC -march=x86-64 -gdwarf-4 -fno-debug-types-section -fvar-tracking-assignments -g2 -o re2.o -c re2.cc re2.cc: In function 'VALUE re2_scanner_scan(VALUE)': re2.cc:233:37: error: 'const class re2::RE2::Options' has no member named 'utf8' 233 | p->pattern->options().utf8() ? "UTF-8" : "ISO-8859-1")); | ^~~~ re2.cc:37:36: note: in definition of macro 'ENCODED_STR_NEW' 37 | int _enc = rb_enc_find_index(encoding); \ | ^~~~~~~~ re2.cc: In function 'VALUE re2_matchdata_to_a(VALUE)': re2.cc:423:35: error: 'const class re2::RE2::Options' has no member named 'utf8' 423 | p->pattern->options().utf8() ? "UTF-8" : "ISO-8859-1")); | ^~~~ re2.cc:37:36: note: in definition of macro 'ENCODED_STR_NEW' 37 | int _enc = rb_enc_find_index(encoding); \ | ^~~~~~~~ re2.cc: In function 'VALUE re2_matchdata_nth_match(int, VALUE)': re2.cc:447:33: error: 'const class re2::RE2::Options' has no member named 'utf8' 447 | p->pattern->options().utf8() ? "UTF-8" : "ISO-8859-1"); | ^~~~ re2.cc:37:36: note: in definition of macro 'ENCODED_STR_NEW' 37 | int _enc = rb_enc_find_index(encoding); \ | ^~~~~~~~ re2.cc: In function 'VALUE re2_matchdata_inspect(VALUE)': re2.cc:578:29: error: 'const class re2::RE2::Options' has no member named 'utf8' 578 | p->pattern->options().utf8() ? "UTF-8" : "ISO-8859-1"); | ^~~~ re2.cc:37:36: note: in definition of macro 'ENCODED_STR_NEW' 37 | int _enc = rb_enc_find_index(encoding); \ | ^~~~~~~~ re2.cc: In function 'VALUE re2_regexp_initialize(int, VALUE*, VALUE)': re2.cc:651:19: error: 'class re2::RE2::Options' has no member named 'set_utf8' 651 | re2_options.set_utf8(RTEST(utf8)); | ^~~~~~~~ re2.cc: In function 'VALUE re2_regexp_inspect(VALUE)': re2.cc:734:29: error: 'const class re2::RE2::Options' has no member named 'utf8' 734 | p->pattern->options().utf8() ? "UTF-8" : "ISO-8859-1"); | ^~~~ re2.cc:37:36: note: in definition of macro 'ENCODED_STR_NEW' 37 | int _enc = rb_enc_find_index(encoding); \ | ^~~~~~~~ re2.cc: In function 'VALUE re2_regexp_to_s(VALUE)': re2.cc:752:29: error: 'const class re2::RE2::Options' has no member named 'utf8' 752 | p->pattern->options().utf8() ? "UTF-8" : "ISO-8859-1"); | ^~~~ re2.cc:37:36: note: in definition of macro 'ENCODED_STR_NEW' 37 | int _enc = rb_enc_find_index(encoding); \ | ^~~~~~~~ re2.cc: In function 'VALUE re2_regexp_utf8(VALUE)': re2.cc:782:42: error: 'const class re2::RE2::Options' has no member named 'utf8' 782 | return BOOL2RUBY(p->pattern->options().utf8()); | ^~~~ re2.cc:21:23: note: in definition of macro 'BOOL2RUBY' 21 | #define BOOL2RUBY(v) (v ? Qtrue : Qfalse) | ^ re2.cc: In function 'VALUE re2_regexp_error_arg(VALUE)': re2.cc:979:31: error: 'const class re2::RE2::Options' has no member named 'utf8' 979 | p->pattern->options().utf8() ? "UTF-8" : "ISO-8859-1"); | ^~~~ re2.cc:37:36: note: in definition of macro 'ENCODED_STR_NEW' 37 | int _enc = rb_enc_find_index(encoding); \ | ^~~~~~~~ re2.cc: In function 'VALUE re2_regexp_options(VALUE)': re2.cc:1010:39: error: 'const class re2::RE2::Options' has no member named 'utf8' 1010 | BOOL2RUBY(p->pattern->options().utf8())); | ^~~~ re2.cc:21:23: note: in definition of macro 'BOOL2RUBY' 21 | #define BOOL2RUBY(v) (v ? Qtrue : Qfalse) | ^ re2.cc: In function 'VALUE re2_regexp_named_capturing_groups(VALUE)': re2.cc:1080:33: error: 'const class re2::RE2::Options' has no member named 'utf8' 1080 | p->pattern->options().utf8() ? "UTF-8" : "ISO-8859-1"), | ^~~~ re2.cc:37:36: note: in definition of macro 'ENCODED_STR_NEW' 37 | int _enc = rb_enc_find_index(encoding); \ | ^~~~~~~~ re2.cc: In function 'VALUE re2_Replace(VALUE, VALUE, VALUE, VALUE)': re2.cc:1250:31: error: 'const class re2::RE2::Options' has no member named 'utf8' 1250 | p->pattern->options().utf8() ? "UTF-8" : "ISO-8859-1"); | ^~~~ re2.cc:37:36: note: in definition of macro 'ENCODED_STR_NEW' 37 | int _enc = rb_enc_find_index(encoding); \ | ^~~~~~~~ re2.cc: In function 'VALUE re2_GlobalReplace(VALUE, VALUE, VALUE, VALUE)': re2.cc:1287:31: error: 'const class re2::RE2::Options' has no member named 'utf8' 1287 | p->pattern->options().utf8() ? "UTF-8" : "ISO-8859-1"); | ^~~~ re2.cc:37:36: note: in definition of macro 'ENCODED_STR_NEW' 37 | int _enc = rb_enc_find_index(encoding); \ | ^~~~~~~~ make: *** [Makefile:213: re2.o] Error 1 error: Bad exit status from /tmp/B.DcJ1kz/BUILD/tmp/rpm-tmp.24566 (%build) RPM build errors: Bad exit status from /tmp/B.DcJ1kz/BUILD/tmp/rpm-tmp.24566 (%build) ended at: Sun Sep 27 22:27:47 2020, done in 0:00:02.713409 error: No files produced. + chmod -R u+rwX /tmp/B.DcJ1kz/BUILD + rm -rf /tmp/B.DcJ1kz/tmp /tmp/B.DcJ1kz/BUILD + rm -rf /tmp/B.DcJ1kz Begin-PLD-Builder-Info Build-Time: user:4.24s sys:0.56s real:5.91s (faults io:2 non-io:215463) End-PLD-Builder-Info
[Back to list of logs] [View rpm -qa of builder]