FailedOk

th/SRPMS[OK]
th/x32[OK]
th/i686[OK]
th/x86_64[OK]

ac/SRPMS[OK]
ac/i386[OK]
ac/i586[OK]
ac/i686[OK]
ac/alpha[OK]
ac/amd64[OK]
ac/athlon[OK]
ac/ppc[OK]
ac/sparc[OK]
ac/sparc64[OK]

Advanced Search
main()
Powered by PLD Linux
(c) 2002-2018 PLD Team
$Revision: 1.37 $
Powered by Ken.
Your IP: 52.201.244.140

rust 7d86571e-f0eb-47f1-b36c-c104fda3d50b

Status:Failed
Source URL:ftp://buildlogs.pld-linux.org/th/x86_64/FAIL/rust,7d86571e-f0eb-47f1-b36c-c104fda3d50b.bz2
text/plain URL:View!
rpm -qa of builder:View!
Date:2018/03/30 11:32:43
Runtime:0:00:45.656302

Toc:

  • prep
  • Executing(%prep): /bin/sh -e /tmp/B.BVCLBx/BUILD/tmp/rpm-tmp.72172
  • build
  • Executing(%build): /bin/sh -e /tmp/B.BVCLBx/BUILD/tmp/rpm-tmp.23971
  • error 1
  • error: aborting due to 13 previous errors
  • error 2
  • error: Could not compile `bootstrap`.
  • error 3
  • error: Bad exit status from /tmp/B.BVCLBx/BUILD/tmp/rpm-tmp.23971 (%build)
  • error 4
  • RPM build errors:
  • error 5
  • error: No files produced.

Content:

request from: baggins
checking if we should skip the build
started at: Fri Mar 30 11:29:56 2018
killing old processes on a builder
mesg: ttyname failed: Inappropriate ioctl for device
sending signal 9 to pid -1
Killed
fetching https://srcbuilder.pld-linux.org/th//srpms/7d86571e-f0eb-47f1-b36c-c104fda3d50b/rust-1.25.0-1.src.rpm
fetched 486193790 bytes, 4391.8 K/s
installing srpm: rust-1.25.0-1.src.rpm
mesg: ttyname failed: Inappropriate ioctl for device
+ install -d /tmp/B.BVCLBx/BUILD /tmp/B.BVCLBx/RPMS
+ LC_ALL=en_US.UTF-8
+ rpm -qp --changelog rust-1.25.0-1.src.rpm
* Fri Mar 30 2018 PLD Linux Team <feedback@pld-linux.org>
- For complete changelog see: http://git.pld-linux.org/?p=packages/rust.git;a=log;h=master
* Thu Mar 29 2018 Jan Palus <atler@pld-linux.org> 9ee62e7
- up to 1.25.0 (adds support for llvm 6) * Mon Nov 20 2017 Jan Rękorajski <baggins@pld-linux.org> 4f353db
- fixed install * Mon Nov 20 2017 Jan Rękorajski <baggins@pld-linux.org> d4b5156
- fixed build * Sun Nov 19 2017 Jan Rękorajski <baggins@pld-linux.org> 5ee06aa
- up to 1.21.0 * Sat Nov 18 2017 Jan Rękorajski <baggins@pld-linux.org> 74eb85a
- remove obsolete patch * Thu Nov 16 2017 Jan Rękorajski <baggins@pld-linux.org> 3391661
- up to 1.19.0 * Thu Jul 20 2017 Jakub Bogusz <qboosh@pld-linux.org> e8f1618
- pl, cleanup, verbose libs in system libdir * Mon Jul 10 2017 Jan Rękorajski <baggins@pld-linux.org> e746fa5
- Revert "rpm4 noarch", PLD uses rpm5 since 2012, stop adding this cruft * Sun Jul 02 2017 Elan Ruusamäe <glen@pld-linux.org> b19b9d5
- rpm4 noarch * Wed Jun 28 2017 Jan Rękorajski <baggins@pld-linux.org> c9b8e3e
- we don't have separate python-lldb, all is in lldb [ackage - rel 2 * Wed Jun 28 2017 Jan Rękorajski <baggins@pld-linux.org> 23edbd5
- rel 1 * Wed Jun 28 2017 Jan Rękorajski <baggins@pld-linux.org> ff5a5e0
- fix build deps * Tue Jun 27 2017 Jan Rękorajski <baggins@pld-linux.org> 18a1004
- ugly libdir hack * Tue Jun 27 2017 Jan Rękorajski <baggins@pld-linux.org> b5eceb5
- cleanup and debuginfo fix from fedora * Tue Jun 27 2017 Jan Rękorajski <baggins@pld-linux.org> ca7850a
- fix non-bootstrap prep * Tue Jun 27 2017 Jan Rękorajski <baggins@pld-linux.org> cace5bf
- rel 0.2, disable tests, they just don't work on builders * Tue Jun 27 2017 Jan Rękorajski <baggins@pld-linux.org> d36946a
- don't lie to ourselves that we support arm * Tue Jun 27 2017 Jan Rękorajski <baggins@pld-linux.org> 8a07321
- cleaned up macro hell a little bit * Tue Jun 27 2017 Jan Rękorajski <baggins@pld-linux.org> 19f9874
- disable so check for llvm lib * Mon Jun 26 2017 Jan Rękorajski <baggins@pld-linux.org> 0edb3b6
- dont generate deps for rust private libs - macro cleanup + rpm -Uhv --nodeps --define '_topdir /tmp/B.BVCLBx' --define '_specdir %{_topdir}' --define '_sourcedir %{_specdir}' --define '_rpmdir %{_topdir}/RPMS' --define '_builddir %{_topdir}/BUILD' --with bootstrap rust-1.25.0-1.src.rpm Preparing... ################################################## rust ################################################## + rm -f rust-1.25.0-1.src.rpm mesg: ttyname failed: Inappropriate ioctl for device + install -m 700 -d /tmp/B.BVCLBx/BUILD/tmp mesg: ttyname failed: Inappropriate ioctl for device + TMPDIR=/tmp/B.BVCLBx/BUILD/tmp + exec nice -n 0 rpmbuild -bp --short-circuit --nodeps --define '_topdir /tmp/B.BVCLBx' --define '_specdir %{_topdir}' --define '_sourcedir %{_specdir}' --define '_rpmdir %{_topdir}/RPMS' --define '_builddir %{_topdir}/BUILD' --with bootstrap --target x86_64-pld-linux --define 'prep exit 0' /tmp/B.BVCLBx/rust.spec Building target platforms: x86_64-pld-linux checking BuildConflict-ing packages no BuildConflicts found checking BR rpm: Building target platforms: x86_64-pld-linux no BR needed building RPM using: set -ex; : build-id: 7d86571e-f0eb-47f1-b36c-c104fda3d50b; TMPDIR=/tmp/B.BVCLBx/BUILD/tmp exec nice -n 0 rpmbuild -bb --define '_smp_mflags -j9' --define '_make_opts -Otarget' --define '_pld_builder 1' --define '_topdir /tmp/B.BVCLBx' --define '_specdir %{_topdir}' --define '_sourcedir %{_specdir}' --define '_rpmdir %{_topdir}/RPMS' --define '_builddir %{_topdir}/BUILD' --with bootstrap --target x86_64-pld-linux /tmp/B.BVCLBx/rust.spec mesg: ttyname failed: Inappropriate ioctl for device + : build-id: 7d86571e-f0eb-47f1-b36c-c104fda3d50b + TMPDIR=/tmp/B.BVCLBx/BUILD/tmp + exec nice -n 0 rpmbuild -bb --define '_smp_mflags -j9' --define '_make_opts -Otarget' --define '_pld_builder 1' --define '_topdir /tmp/B.BVCLBx' --define '_specdir %{_topdir}' --define '_sourcedir %{_specdir}' --define '_rpmdir %{_topdir}/RPMS' --define '_builddir %{_topdir}/BUILD' --with bootstrap --target x86_64-pld-linux /tmp/B.BVCLBx/rust.spec Building target platforms: x86_64-pld-linux Executing(%prep): /bin/sh -e /tmp/B.BVCLBx/BUILD/tmp/rpm-tmp.72172 + umask 022 + cd /tmp/B.BVCLBx/BUILD + cd /tmp/B.BVCLBx/BUILD + rm -rf rustc-1.25.0-src + /usr/bin/gzip -dc /tmp/B.BVCLBx/rustc-1.25.0-src.tar.gz + /bin/tar -xf - + STATUS=0 + '[' 0 -ne 0 ']' + cd rustc-1.25.0-src + /bin/id -u + '[' 1000 '=' 0 ']' + /bin/id -u + '[' 1000 '=' 0 ']' + /bin/chmod -Rf a+rX,u+w,g-w,o-w . + tar xf /tmp/B.BVCLBx/rust-1.24.0-x86_64-unknown-linux-gnu.tar.gz + /bin/mv rust-1.24.0-x86_64-unknown-linux-gnu rust-1.24.0-x86_64-unknown-linux-gnu-root + rust-1.24.0-x86_64-unknown-linux-gnu-root/install.sh '--components=cargo,rustc,rust-std-x86_64-unknown-linux-gnu' '--prefix=/tmp/B.BVCLBx/BUILD/rustc-1.25.0-src/rust-1.24.0-x86_64-unknown-linux-gnu' --disable-ldconfig install: creating uninstall script at /tmp/B.BVCLBx/BUILD/rustc-1.25.0-src/rust-1.24.0-x86_64-unknown-linux-gnu/lib/rustlib/uninstall.sh install: installing component 'cargo' install: installing component 'rustc' install: installing component 'rust-std-x86_64-unknown-linux-gnu' Rust is ready to roll. + test -f /tmp/B.BVCLBx/BUILD/rustc-1.25.0-src/rust-1.24.0-x86_64-unknown-linux-gnu/bin/cargo + test -f /tmp/B.BVCLBx/BUILD/rustc-1.25.0-src/rust-1.24.0-x86_64-unknown-linux-gnu/bin/rustc + /bin/rm '--interactive=never' -r src/llvm/ + cp -p src/rt/hoedown/LICENSE src/rt/hoedown/LICENSE-hoedown + >src/libbacktrace/LICENSE-libbacktrace + sed -e '/*\//q' src/libbacktrace/backtrace.h + sed -i -e 's#DIRECTORY=".*"#DIRECTORY="/usr/share/rust/etc"#' src/etc/rust-gdb + find src/vendor -name .cargo-checksum.json -exec sed -i.uncheck -e 's/"files":{[^}]*}/"files":{ }/' {} + + exit 0 Executing(%build): /bin/sh -e /tmp/B.BVCLBx/BUILD/tmp/rpm-tmp.23971 TMP=/home/users/builder/tmp HOME=/home/users/builder PATH=/home/users/builder/GNUstep/Tools:/usr/local/bin:/usr/bin:/bin:/home/users/builder/bin TMPDIR=/tmp/B.BVCLBx/BUILD/tmp + umask 022 + cd /tmp/B.BVCLBx/BUILD + cd rustc-1.25.0-src + ./configure 'LDFLAGS=-Wl,--as-needed -Wl,--no-copy-dt-needed-entries -Wl,-z,relro -Wl,-z,combreloc ' 'CFLAGS=-O2 -fwrapv -pipe -Wformat -Werror=format-security -gdwarf-4 -fno-debug-types-section -fvar-tracking-assignments -g2 -Wp,-D_FORTIFY_SOURCE=2 -fstack-protector-strong --param=ssp-buffer-size=4 -fPIC -march=x86-64 -gdwarf-4 -fno-debug-types-section -fvar-tracking-assignments -g2 ' 'CXXFLAGS=-O2 -fwrapv -pipe -Wformat -Werror=format-security -gdwarf-4 -fno-debug-types-section -fvar-tracking-assignments -g2 -Wp,-D_FORTIFY_SOURCE=2 -fstack-protector-strong --param=ssp-buffer-size=4 -fPIC -march=x86-64 -gdwarf-4 -fno-debug-types-section -fvar-tracking-assignments -g2 ' 'FFLAGS=-O2 -fwrapv -pipe -Wformat -Werror=format-security -gdwarf-4 -fno-debug-types-section -fvar-tracking-assignments -g2 -Wp,-D_FORTIFY_SOURCE=2 -fstack-protector-strong --param=ssp-buffer-size=4 -fPIC -march=x86-64 -gdwarf-4 -fno-debug-types-section -fvar-tracking-assignments -g2 ' 'FCFLAGS=-O2 -fwrapv -pipe -Wformat -Werror=format-security -gdwarf-4 -fno-debug-types-section -fvar-tracking-assignments -g2 -Wp,-D_FORTIFY_SOURCE=2 -fstack-protector-strong --param=ssp-buffer-size=4 -fPIC -march=x86-64 -gdwarf-4 -fno-debug-types-section -fvar-tracking-assignments -g2 ' 'CPPFLAGS=' 'CC=x86_64-pld-linux-gcc' 'CXX=x86_64-pld-linux-g++' '--host=x86_64-pld-linux' '--build=x86_64-pld-linux' '--prefix=/usr' '--exec-prefix=/usr' '--bindir=/usr/bin' '--sbindir=/usr/sbin' '--sysconfdir=/etc' '--datadir=/usr/share' '--includedir=/usr/include' '--libdir=/usr/lib64' '--libexecdir=/usr/libexec' '--localstatedir=/var' '--sharedstatedir=/var/lib' '--mandir=/usr/share/man' '--infodir=/usr/share/info' '--x-libraries=/usr/lib64' '--build=x86_64-unknown-linux-gnu' '--host=x86_64-unknown-linux-gnu' '--target=x86_64-unknown-linux-gnu' '--libdir=/usr/lib' --disable-codegen-tests --disable-jemalloc --disable-option-checking --disable-rpath --disable-debuginfo-lines --disable-debuginfo-only-std --enable-debuginfo --enable-llvm-link-shared --enable-local-rust '--local-rust-root=/tmp/B.BVCLBx/BUILD/rustc-1.25.0-src/rust-1.24.0-x86_64-unknown-linux-gnu' --enable-vendor '--llvm-root=/usr' '--release-channel=stable' configure: processing command line configure: configure: rust.rpath := False configure: install.localstatedir := /var configure: install.prefix := /usr configure: rust.use-jemalloc := False configure: install.mandir := /usr/share/man configure: install.infodir := /usr/share/info configure: install.libdir := /usr/lib configure: install.datadir := /usr/share configure: rust.debuginfo-lines := False configure: build.build := x86_64-unknown-linux-gnu configure: build.rustc := /tmp/B.BVCLBx/BUILD/rustc-1.25.0-src/rust-1.24 ... configure: build.cargo := /tmp/B.BVCLBx/BUILD/rustc-1.25.0-src/rust-1.24 ... configure: install.bindir := /usr/bin configure: llvm.link-shared := True configure: build.vendor := True configure: rust.debuginfo := True configure: rust.debuginfo-only-std := False configure: build.host := ['x86_64-unknown-linux-gnu'] configure: target.x86_64-unknown-linux-gnu.llvm-config := /usr/bin/llvm-config configure: build.rustc := /usr/bin/rustc configure: build.cargo := /usr/bin/cargo configure: build.target := ['x86_64-unknown-linux-gnu'] configure: rust.channel := stable configure: install.sysconfdir := /etc configure: rust.codegen-tests := False configure: build.configure-args := ['LDFLAGS=-Wl,--as-needed -Wl,--no-copy-dt-nee ... configure: configure: writing `config.toml` in current directory configure: configure: run `python /tmp/B.BVCLBx/BUILD/rustc-1.25.0-src/x.py --help` configure: + ./x.py dist Compiling quote v0.3.15 Compiling cc v1.0.4 Compiling dtoa v0.4.2 Compiling num-traits v0.1.41 Compiling cfg-if v0.1.2 Compiling itoa v0.3.4 Compiling unicode-xid v0.0.4 Compiling serde v1.0.27 Compiling getopts v0.2.15 Compiling libc v0.2.39 Compiling lazy_static v0.2.11 Compiling synom v0.11.3 Compiling syn v0.11.11 Compiling time v0.1.39 Compiling filetime v0.1.15 Compiling num_cpus v1.8.0 Compiling build_helper v0.1.0 (file:///tmp/B.BVCLBx/BUILD/rustc-1.25.0-src/src/build_helper) Compiling cmake v0.1.29 Compiling serde_derive_internals v0.19.0 Compiling serde_derive v1.0.27 Compiling toml v0.4.5 Compiling serde_json v1.0.9 Compiling bootstrap v0.0.0 (file:///tmp/B.BVCLBx/BUILD/rustc-1.25.0-src/src/bootstrap) error[E0277]: the trait bound `std::option::Option<&std::path::PathBuf>: std::ops::Try` is not satisfied --> src/bootstrap/config.rs:571:22 | 571 | let libdir = self.libdir.as_ref()?; | --------------------- | | | the `?` operator can only be used in a function that returns `Result` (or another type that implements `std::ops::Try`) | in this macro invocation | = help: the trait `std::ops::Try` is not implemented for `std::option::Option<&std::path::PathBuf>` = note: required by `std::ops::Try::into_result` error[E0277]: the trait bound `std::option::Option<&std::path::Path>: std::ops::Try` is not satisfied --> src/bootstrap/config.rs:571:22 | 571 | let libdir = self.libdir.as_ref()?; | --------------------- | | | the `?` operator can only be used in a function that returns `Result` (or another type that implements `std::ops::Try`) | in this macro invocation | = help: the trait `std::ops::Try` is not implemented for `std::option::Option<&std::path::Path>` = note: required by `std::ops::Try::from_error` error[E0277]: the trait bound `std::option::Option<&std::path::PathBuf>: std::ops::Try` is not satisfied --> src/bootstrap/config.rs:576:33 | 576 | libdir.strip_prefix(self.prefix.as_ref()?).ok() | --------------------- | | | the `?` operator can only be used in a function that returns `Result` (or another type that implements `std::ops::Try`) | in this macro invocation | = help: the trait `std::ops::Try` is not implemented for `std::option::Option<&std::path::PathBuf>` = note: required by `std::ops::Try::into_result` error[E0277]: the trait bound `std::option::Option<&std::path::Path>: std::ops::Try` is not satisfied --> src/bootstrap/config.rs:576:33 | 576 | libdir.strip_prefix(self.prefix.as_ref()?).ok() | --------------------- | | | the `?` operator can only be used in a function that returns `Result` (or another type that implements `std::ops::Try`) | in this macro invocation | = help: the trait `std::ops::Try` is not implemented for `std::option::Option<&std::path::Path>` = note: required by `std::ops::Try::from_error` error[E0277]: the trait bound `std::option::Option<std::path::PathBuf>: std::ops::Try` is not satisfied --> src/bootstrap/dist.rs:1112:19 | 1112 | let rls = builder.ensure(tool::Rls { | ___________________- | |___________________| | || 1113 | || compiler: builder.compiler(stage, build.build), 1114 | || target 1115 | || }).or_else(|| { println!("Unable to build RLS, skipping dist"); None })?; | || - | ||________________________________________________________________________________| | |_________________________________________________________________________________the `?` operator can only be used in a function that returns `Result` (or another type that implements `std::ops::Try`) | in this macro invocation | = help: the trait `std::ops::Try` is not implemented for `std::option::Option<std::path::PathBuf>` = note: required by `std::ops::Try::into_result` error[E0277]: the trait bound `[u8]: std::marker::Sized` is not satisfied in `std::path::Path` --> src/bootstrap/dist.rs:1112:13 | 1112 | let rls = builder.ensure(tool::Rls { | ^^^ `[u8]` does not have a constant size known at compile-time | = help: within `std::path::Path`, the trait `std::marker::Sized` is not implemented for `[u8]` = note: required because it appears within the type `std::path::Path` = note: all local variables must have a statically known size error[E0277]: the trait bound `[u8]: std::marker::Sized` is not satisfied in `std::path::Path` --> src/bootstrap/dist.rs:1112:19 | 1112 | let rls = builder.ensure(tool::Rls { | ___________________^ 1113 | | compiler: builder.compiler(stage, build.build), 1114 | | target 1115 | | }).or_else(|| { println!("Unable to build RLS, skipping dist"); None })?; | |________________________________________________________________________________^ `[u8]` does not have a constant size known at compile-time | = help: within `std::path::Path`, the trait `std::marker::Sized` is not implemented for `[u8]` = note: required because it appears within the type `std::path::Path` = note: all local variables must have a statically known size error[E0277]: the trait bound `std::option::Option<std::path::PathBuf>: std::ops::Try` is not satisfied --> src/bootstrap/dist.rs:1192:23 | 1192 | let rustfmt = builder.ensure(tool::Rustfmt { | _______________________- | |_______________________| | || 1193 | || compiler: builder.compiler(stage, build.build), 1194 | || target 1195 | || }).or_else(|| { println!("Unable to build Rustfmt, skipping dist"); None })?; | || - | ||____________________________________________________________________________________| | |_____________________________________________________________________________________the `?` operator can only be used in a function that returns `Result` (or another type that implements `std::ops::Try`) | in this macro invocation | = help: the trait `std::ops::Try` is not implemented for `std::option::Option<std::path::PathBuf>` = note: required by `std::ops::Try::into_result` error[E0277]: the trait bound `std::option::Option<std::path::PathBuf>: std::ops::Try` is not satisfied --> src/bootstrap/dist.rs:1196:24 | 1196 | let cargofmt = builder.ensure(tool::Cargofmt { | ________________________- | |________________________| | || 1197 | || compiler: builder.compiler(stage, build.build), 1198 | || target 1199 | || }).or_else(|| { println!("Unable to build Cargofmt, skipping dist"); None })?; | || - | ||_____________________________________________________________________________________| | |______________________________________________________________________________________the `?` operator can only be used in a function that returns `Result` (or another type that implements `std::ops::Try`) | in this macro invocation | = help: the trait `std::ops::Try` is not implemented for `std::option::Option<std::path::PathBuf>` = note: required by `std::ops::Try::into_result` error[E0277]: the trait bound `[u8]: std::marker::Sized` is not satisfied in `std::path::Path` --> src/bootstrap/dist.rs:1192:13 | 1192 | let rustfmt = builder.ensure(tool::Rustfmt { | ^^^^^^^ `[u8]` does not have a constant size known at compile-time | = help: within `std::path::Path`, the trait `std::marker::Sized` is not implemented for `[u8]` = note: required because it appears within the type `std::path::Path` = note: all local variables must have a statically known size error[E0277]: the trait bound `[u8]: std::marker::Sized` is not satisfied in `std::path::Path` --> src/bootstrap/dist.rs:1192:23 | 1192 | let rustfmt = builder.ensure(tool::Rustfmt { | _______________________^ 1193 | | compiler: builder.compiler(stage, build.build), 1194 | | target 1195 | | }).or_else(|| { println!("Unable to build Rustfmt, skipping dist"); None })?; | |____________________________________________________________________________________^ `[u8]` does not have a constant size known at compile-time | = help: within `std::path::Path`, the trait `std::marker::Sized` is not implemented for `[u8]` = note: required because it appears within the type `std::path::Path` = note: all local variables must have a statically known size error[E0277]: the trait bound `[u8]: std::marker::Sized` is not satisfied in `std::path::Path` --> src/bootstrap/dist.rs:1196:13 | 1196 | let cargofmt = builder.ensure(tool::Cargofmt { | ^^^^^^^^ `[u8]` does not have a constant size known at compile-time | = help: within `std::path::Path`, the trait `std::marker::Sized` is not implemented for `[u8]` = note: required because it appears within the type `std::path::Path` = note: all local variables must have a statically known size error[E0277]: the trait bound `[u8]: std::marker::Sized` is not satisfied in `std::path::Path` --> src/bootstrap/dist.rs:1196:24 | 1196 | let cargofmt = builder.ensure(tool::Cargofmt { | ________________________^ 1197 | | compiler: builder.compiler(stage, build.build), 1198 | | target 1199 | | }).or_else(|| { println!("Unable to build Cargofmt, skipping dist"); None })?; | |_____________________________________________________________________________________^ `[u8]` does not have a constant size known at compile-time | = help: within `std::path::Path`, the trait `std::marker::Sized` is not implemented for `[u8]` = note: required because it appears within the type `std::path::Path` = note: all local variables must have a statically known size error: aborting due to 13 previous errors error: Could not compile `bootstrap`. To learn more, run the command again with --verbose. failed to run: /usr/bin/cargo build --manifest-path /tmp/B.BVCLBx/BUILD/rustc-1.25.0-src/src/bootstrap/Cargo.toml --frozen Build completed unsuccessfully in 0:00:29 error: Bad exit status from /tmp/B.BVCLBx/BUILD/tmp/rpm-tmp.23971 (%build) RPM build errors: Bad exit status from /tmp/B.BVCLBx/BUILD/tmp/rpm-tmp.23971 (%build) ended at: Fri Mar 30 11:32:34 2018, done in 0:00:45.656302 error: No files produced. mesg: ttyname failed: Inappropriate ioctl for device + chmod -R u+rwX /tmp/B.BVCLBx/BUILD + rm -rf /tmp/B.BVCLBx/tmp /tmp/B.BVCLBx/BUILD mesg: ttyname failed: Inappropriate ioctl for device + rm -rf /tmp/B.BVCLBx Begin-PLD-Builder-Info Build-Time: user:76.14s sys:14.97s real:166.75s (faults io:915 non-io:1427844) End-PLD-Builder-Info
[Back to list of logs] [View rpm -qa of builder]