FailedOk

th/SRPMS[OK]
th/x32[OK]
th/i686[OK]
th/x86_64[OK]

ac/SRPMS[OK]
ac/i386[OK]
ac/i586[OK]
ac/i686[OK]
ac/alpha[OK]
ac/amd64[OK]
ac/athlon[OK]
ac/ppc[OK]
ac/sparc[OK]
ac/sparc64[OK]

Advanced Search
main()
Powered by PLD Linux
(c) 2002-2021 PLD Team
$Revision: 1.37 $
Powered by The Golden Path.
Your IP: 3.239.236.140

scute 1e16530b-6873-4c9f-82a2-6cfbb6314f3a

Status:Failed
Source URL:https://buildlogs.pld-linux.org/pld/th/x86_64/FAIL/scute,1e16530b-6873-4c9f-82a2-6cfbb6314f3a.bz2
text/plain URL:View!
full text:View!
rpm -qa of builder:View!
Date:2021/01/10 16:12:01
Runtime:0:00:22.659878

Toc:

  • error 1
  • collect2: error: ld returned 1 exit status
  • error 2
  • make[2]: *** [Makefile:836: scute.la] Error 1
  • error 3
  • make[1]: *** [Makefile:453: all-recursive] Error 1
  • error 4
  • error: Bad exit status from /tmp/B.aU5k9w/BUILD/tmp/rpm-tmp.7340 (%build)
  • error 5
  • RPM build errors:
  • error 6
  • error: No files produced.

Content:

make[2]: Leaving directory '/tmp/B.aU5k9w/BUILD/scute-1.7.0/src'
make[2]: Entering directory '/tmp/B.aU5k9w/BUILD/scute-1.7.0/src'
/bin/sh ../libtool  --tag=CC   --mode=compile x86_64-pld-linux-gcc -DHAVE_CONFIG_H -I. -I..  -I./../include -I/usr/include    -Wall -Wno-pointer-sign -Wpointer-arith -O2 -fwrapv -pipe -Wformat -Werror=format-security -gdwarf-4 -fno-debug-types-section -fvar-tracking-assignments -g2 -Wp,-D_FORTIFY_SOURCE=2 -fstack-protector-strong --param=ssp-buffer-size=4 -Werror=trampolines -fPIC -march=x86-64 -gdwarf-4 -fno-debug-types-section -fvar-tracking-assignments -g2  -MT scute_la-p11-setpin.lo -MD -MP -MF .deps/scute_la-p11-setpin.Tpo -c -o scute_la-p11-setpin.lo `test -f 'p11-setpin.c' || echo './'`p11-setpin.c
libtool: compile:  x86_64-pld-linux-gcc -DHAVE_CONFIG_H -I. -I.. -I./../include -I/usr/include -Wall -Wno-pointer-sign -Wpointer-arith -O2 -fwrapv -pipe -Wformat -Werror=format-security -gdwarf-4 -fno-debug-types-section -fvar-tracking-assignments -g2 -Wp,-D_FORTIFY_SOURCE=2 -fstack-protector-strong --param=ssp-buffer-size=4 -Werror=trampolines -fPIC -march=x86-64 -gdwarf-4 -fno-debug-types-section -fvar-tracking-assignments -g2 -MT scute_la-p11-setpin.lo -MD -MP -MF .deps/scute_la-p11-setpin.Tpo -c p11-setpin.c  -fPIC -DPIC -o .libs/scute_la-p11-setpin.o
mv -f .deps/scute_la-p11-setpin.Tpo .deps/scute_la-p11-setpin.Plo
make[2]: Leaving directory '/tmp/B.aU5k9w/BUILD/scute-1.7.0/src'
make[2]: Entering directory '/tmp/B.aU5k9w/BUILD/scute-1.7.0/src'
/bin/sh ../libtool  --tag=CC   --mode=compile x86_64-pld-linux-gcc -DHAVE_CONFIG_H -I. -I..  -I./../include -I/usr/include    -Wall -Wno-pointer-sign -Wpointer-arith -O2 -fwrapv -pipe -Wformat -Werror=format-security -gdwarf-4 -fno-debug-types-section -fvar-tracking-assignments -g2 -Wp,-D_FORTIFY_SOURCE=2 -fstack-protector-strong --param=ssp-buffer-size=4 -Werror=trampolines -fPIC -march=x86-64 -gdwarf-4 -fno-debug-types-section -fvar-tracking-assignments -g2  -MT scute_la-p11-sign.lo -MD -MP -MF .deps/scute_la-p11-sign.Tpo -c -o scute_la-p11-sign.lo `test -f 'p11-sign.c' || echo './'`p11-sign.c
libtool: compile:  x86_64-pld-linux-gcc -DHAVE_CONFIG_H -I. -I.. -I./../include -I/usr/include -Wall -Wno-pointer-sign -Wpointer-arith -O2 -fwrapv -pipe -Wformat -Werror=format-security -gdwarf-4 -fno-debug-types-section -fvar-tracking-assignments -g2 -Wp,-D_FORTIFY_SOURCE=2 -fstack-protector-strong --param=ssp-buffer-size=4 -Werror=trampolines -fPIC -march=x86-64 -gdwarf-4 -fno-debug-types-section -fvar-tracking-assignments -g2 -MT scute_la-p11-sign.lo -MD -MP -MF .deps/scute_la-p11-sign.Tpo -c p11-sign.c  -fPIC -DPIC -o .libs/scute_la-p11-sign.o
mv -f .deps/scute_la-p11-sign.Tpo .deps/scute_la-p11-sign.Plo
make[2]: Leaving directory '/tmp/B.aU5k9w/BUILD/scute-1.7.0/src'
make[2]: Entering directory '/tmp/B.aU5k9w/BUILD/scute-1.7.0/src'
/bin/sh ../libtool  --tag=CC   --mode=compile x86_64-pld-linux-gcc -DHAVE_CONFIG_H -I. -I..  -I./../include -I/usr/include    -Wall -Wno-pointer-sign -Wpointer-arith -O2 -fwrapv -pipe -Wformat -Werror=format-security -gdwarf-4 -fno-debug-types-section -fvar-tracking-assignments -g2 -Wp,-D_FORTIFY_SOURCE=2 -fstack-protector-strong --param=ssp-buffer-size=4 -Werror=trampolines -fPIC -march=x86-64 -gdwarf-4 -fno-debug-types-section -fvar-tracking-assignments -g2  -MT scute_la-p11-signfinal.lo -MD -MP -MF .deps/scute_la-p11-signfinal.Tpo -c -o scute_la-p11-signfinal.lo `test -f 'p11-signfinal.c' || echo './'`p11-signfinal.c
libtool: compile:  x86_64-pld-linux-gcc -DHAVE_CONFIG_H -I. -I.. -I./../include -I/usr/include -Wall -Wno-pointer-sign -Wpointer-arith -O2 -fwrapv -pipe -Wformat -Werror=format-security -gdwarf-4 -fno-debug-types-section -fvar-tracking-assignments -g2 -Wp,-D_FORTIFY_SOURCE=2 -fstack-protector-strong --param=ssp-buffer-size=4 -Werror=trampolines -fPIC -march=x86-64 -gdwarf-4 -fno-debug-types-section -fvar-tracking-assignments -g2 -MT scute_la-p11-signfinal.lo -MD -MP -MF .deps/scute_la-p11-signfinal.Tpo -c p11-signfinal.c  -fPIC -DPIC -o .libs/scute_la-p11-signfinal.o
mv -f .deps/scute_la-p11-signfinal.Tpo .deps/scute_la-p11-signfinal.Plo
make[2]: Leaving directory '/tmp/B.aU5k9w/BUILD/scute-1.7.0/src'
make[2]: Entering directory '/tmp/B.aU5k9w/BUILD/scute-1.7.0/src'
/bin/sh ../libtool  --tag=CC   --mode=compile x86_64-pld-linux-gcc -DHAVE_CONFIG_H -I. -I..  -I./../include -I/usr/include    -Wall -Wno-pointer-sign -Wpointer-arith -O2 -fwrapv -pipe -Wformat -Werror=format-security -gdwarf-4 -fno-debug-types-section -fvar-tracking-assignments -g2 -Wp,-D_FORTIFY_SOURCE=2 -fstack-protector-strong --param=ssp-buffer-size=4 -Werror=trampolines -fPIC -march=x86-64 -gdwarf-4 -fno-debug-types-section -fvar-tracking-assignments -g2  -MT scute_la-p11-signencryptupdate.lo -MD -MP -MF .deps/scute_la-p11-signencryptupdate.Tpo -c -o scute_la-p11-signencryptupdate.lo `test -f 'p11-signencryptupdate.c' || echo './'`p11-signencryptupdate.c
libtool: compile:  x86_64-pld-linux-gcc -DHAVE_CONFIG_H -I. -I.. -I./../include -I/usr/include -Wall -Wno-pointer-sign -Wpointer-arith -O2 -fwrapv -pipe -Wformat -Werror=format-security -gdwarf-4 -fno-debug-types-section -fvar-tracking-assignments -g2 -Wp,-D_FORTIFY_SOURCE=2 -fstack-protector-strong --param=ssp-buffer-size=4 -Werror=trampolines -fPIC -march=x86-64 -gdwarf-4 -fno-debug-types-section -fvar-tracking-assignments -g2 -MT scute_la-p11-signencryptupdate.lo -MD -MP -MF .deps/scute_la-p11-signencryptupdate.Tpo -c p11-signencryptupdate.c  -fPIC -DPIC -o .libs/scute_la-p11-signencryptupdate.o
mv -f .deps/scute_la-p11-signencryptupdate.Tpo .deps/scute_la-p11-signencryptupdate.Plo
make[2]: Leaving directory '/tmp/B.aU5k9w/BUILD/scute-1.7.0/src'
make[2]: Entering directory '/tmp/B.aU5k9w/BUILD/scute-1.7.0/src'
/bin/sh ../libtool  --tag=CC   --mode=compile x86_64-pld-linux-gcc -DHAVE_CONFIG_H -I. -I..  -I./../include -I/usr/include    -Wall -Wno-pointer-sign -Wpointer-arith -O2 -fwrapv -pipe -Wformat -Werror=format-security -gdwarf-4 -fno-debug-types-section -fvar-tracking-assignments -g2 -Wp,-D_FORTIFY_SOURCE=2 -fstack-protector-strong --param=ssp-buffer-size=4 -Werror=trampolines -fPIC -march=x86-64 -gdwarf-4 -fno-debug-types-section -fvar-tracking-assignments -g2  -MT scute_la-p11-signrecover.lo -MD -MP -MF .deps/scute_la-p11-signrecover.Tpo -c -o scute_la-p11-signrecover.lo `test -f 'p11-signrecover.c' || echo './'`p11-signrecover.c
libtool: compile:  x86_64-pld-linux-gcc -DHAVE_CONFIG_H -I. -I.. -I./../include -I/usr/include -Wall -Wno-pointer-sign -Wpointer-arith -O2 -fwrapv -pipe -Wformat -Werror=format-security -gdwarf-4 -fno-debug-types-section -fvar-tracking-assignments -g2 -Wp,-D_FORTIFY_SOURCE=2 -fstack-protector-strong --param=ssp-buffer-size=4 -Werror=trampolines -fPIC -march=x86-64 -gdwarf-4 -fno-debug-types-section -fvar-tracking-assignments -g2 -MT scute_la-p11-signrecover.lo -MD -MP -MF .deps/scute_la-p11-signrecover.Tpo -c p11-signrecover.c  -fPIC -DPIC -o .libs/scute_la-p11-signrecover.o
mv -f .deps/scute_la-p11-signrecover.Tpo .deps/scute_la-p11-signrecover.Plo
make[2]: Leaving directory '/tmp/B.aU5k9w/BUILD/scute-1.7.0/src'
make[2]: Entering directory '/tmp/B.aU5k9w/BUILD/scute-1.7.0/src'
/bin/sh ../libtool  --tag=CC   --mode=compile x86_64-pld-linux-gcc -DHAVE_CONFIG_H -I. -I..  -I./../include -I/usr/include    -Wall -Wno-pointer-sign -Wpointer-arith -O2 -fwrapv -pipe -Wformat -Werror=format-security -gdwarf-4 -fno-debug-types-section -fvar-tracking-assignments -g2 -Wp,-D_FORTIFY_SOURCE=2 -fstack-protector-strong --param=ssp-buffer-size=4 -Werror=trampolines -fPIC -march=x86-64 -gdwarf-4 -fno-debug-types-section -fvar-tracking-assignments -g2  -MT scute_la-p11-signrecoverinit.lo -MD -MP -MF .deps/scute_la-p11-signrecoverinit.Tpo -c -o scute_la-p11-signrecoverinit.lo `test -f 'p11-signrecoverinit.c' || echo './'`p11-signrecoverinit.c
libtool: compile:  x86_64-pld-linux-gcc -DHAVE_CONFIG_H -I. -I.. -I./../include -I/usr/include -Wall -Wno-pointer-sign -Wpointer-arith -O2 -fwrapv -pipe -Wformat -Werror=format-security -gdwarf-4 -fno-debug-types-section -fvar-tracking-assignments -g2 -Wp,-D_FORTIFY_SOURCE=2 -fstack-protector-strong --param=ssp-buffer-size=4 -Werror=trampolines -fPIC -march=x86-64 -gdwarf-4 -fno-debug-types-section -fvar-tracking-assignments -g2 -MT scute_la-p11-signrecoverinit.lo -MD -MP -MF .deps/scute_la-p11-signrecoverinit.Tpo -c p11-signrecoverinit.c  -fPIC -DPIC -o .libs/scute_la-p11-signrecoverinit.o
mv -f .deps/scute_la-p11-signrecoverinit.Tpo .deps/scute_la-p11-signrecoverinit.Plo
make[2]: Leaving directory '/tmp/B.aU5k9w/BUILD/scute-1.7.0/src'
make[2]: Entering directory '/tmp/B.aU5k9w/BUILD/scute-1.7.0/src'
/bin/sh ../libtool  --tag=CC   --mode=compile x86_64-pld-linux-gcc -DHAVE_CONFIG_H -I. -I..  -I./../include -I/usr/include    -Wall -Wno-pointer-sign -Wpointer-arith -O2 -fwrapv -pipe -Wformat -Werror=format-security -gdwarf-4 -fno-debug-types-section -fvar-tracking-assignments -g2 -Wp,-D_FORTIFY_SOURCE=2 -fstack-protector-strong --param=ssp-buffer-size=4 -Werror=trampolines -fPIC -march=x86-64 -gdwarf-4 -fno-debug-types-section -fvar-tracking-assignments -g2  -MT scute_la-p11-signupdate.lo -MD -MP -MF .deps/scute_la-p11-signupdate.Tpo -c -o scute_la-p11-signupdate.lo `test -f 'p11-signupdate.c' || echo './'`p11-signupdate.c
libtool: compile:  x86_64-pld-linux-gcc -DHAVE_CONFIG_H -I. -I.. -I./../include -I/usr/include -Wall -Wno-pointer-sign -Wpointer-arith -O2 -fwrapv -pipe -Wformat -Werror=format-security -gdwarf-4 -fno-debug-types-section -fvar-tracking-assignments -g2 -Wp,-D_FORTIFY_SOURCE=2 -fstack-protector-strong --param=ssp-buffer-size=4 -Werror=trampolines -fPIC -march=x86-64 -gdwarf-4 -fno-debug-types-section -fvar-tracking-assignments -g2 -MT scute_la-p11-signupdate.lo -MD -MP -MF .deps/scute_la-p11-signupdate.Tpo -c p11-signupdate.c  -fPIC -DPIC -o .libs/scute_la-p11-signupdate.o
mv -f .deps/scute_la-p11-signupdate.Tpo .deps/scute_la-p11-signupdate.Plo
make[2]: Leaving directory '/tmp/B.aU5k9w/BUILD/scute-1.7.0/src'
make[2]: Entering directory '/tmp/B.aU5k9w/BUILD/scute-1.7.0/src'
/bin/sh ../libtool  --tag=CC   --mode=compile x86_64-pld-linux-gcc -DHAVE_CONFIG_H -I. -I..  -I./../include -I/usr/include    -Wall -Wno-pointer-sign -Wpointer-arith -O2 -fwrapv -pipe -Wformat -Werror=format-security -gdwarf-4 -fno-debug-types-section -fvar-tracking-assignments -g2 -Wp,-D_FORTIFY_SOURCE=2 -fstack-protector-strong --param=ssp-buffer-size=4 -Werror=trampolines -fPIC -march=x86-64 -gdwarf-4 -fno-debug-types-section -fvar-tracking-assignments -g2  -MT scute_la-p11-verify.lo -MD -MP -MF .deps/scute_la-p11-verify.Tpo -c -o scute_la-p11-verify.lo `test -f 'p11-verify.c' || echo './'`p11-verify.c
libtool: compile:  x86_64-pld-linux-gcc -DHAVE_CONFIG_H -I. -I.. -I./../include -I/usr/include -Wall -Wno-pointer-sign -Wpointer-arith -O2 -fwrapv -pipe -Wformat -Werror=format-security -gdwarf-4 -fno-debug-types-section -fvar-tracking-assignments -g2 -Wp,-D_FORTIFY_SOURCE=2 -fstack-protector-strong --param=ssp-buffer-size=4 -Werror=trampolines -fPIC -march=x86-64 -gdwarf-4 -fno-debug-types-section -fvar-tracking-assignments -g2 -MT scute_la-p11-verify.lo -MD -MP -MF .deps/scute_la-p11-verify.Tpo -c p11-verify.c  -fPIC -DPIC -o .libs/scute_la-p11-verify.o
mv -f .deps/scute_la-p11-verify.Tpo .deps/scute_la-p11-verify.Plo
make[2]: Leaving directory '/tmp/B.aU5k9w/BUILD/scute-1.7.0/src'
make[2]: Entering directory '/tmp/B.aU5k9w/BUILD/scute-1.7.0/src'
/bin/sh ../libtool  --tag=CC   --mode=compile x86_64-pld-linux-gcc -DHAVE_CONFIG_H -I. -I..  -I./../include -I/usr/include    -Wall -Wno-pointer-sign -Wpointer-arith -O2 -fwrapv -pipe -Wformat -Werror=format-security -gdwarf-4 -fno-debug-types-section -fvar-tracking-assignments -g2 -Wp,-D_FORTIFY_SOURCE=2 -fstack-protector-strong --param=ssp-buffer-size=4 -Werror=trampolines -fPIC -march=x86-64 -gdwarf-4 -fno-debug-types-section -fvar-tracking-assignments -g2  -MT scute_la-p11-signinit.lo -MD -MP -MF .deps/scute_la-p11-signinit.Tpo -c -o scute_la-p11-signinit.lo `test -f 'p11-signinit.c' || echo './'`p11-signinit.c
libtool: compile:  x86_64-pld-linux-gcc -DHAVE_CONFIG_H -I. -I.. -I./../include -I/usr/include -Wall -Wno-pointer-sign -Wpointer-arith -O2 -fwrapv -pipe -Wformat -Werror=format-security -gdwarf-4 -fno-debug-types-section -fvar-tracking-assignments -g2 -Wp,-D_FORTIFY_SOURCE=2 -fstack-protector-strong --param=ssp-buffer-size=4 -Werror=trampolines -fPIC -march=x86-64 -gdwarf-4 -fno-debug-types-section -fvar-tracking-assignments -g2 -MT scute_la-p11-signinit.lo -MD -MP -MF .deps/scute_la-p11-signinit.Tpo -c p11-signinit.c  -fPIC -DPIC -o .libs/scute_la-p11-signinit.o
mv -f .deps/scute_la-p11-signinit.Tpo .deps/scute_la-p11-signinit.Plo
make[2]: Leaving directory '/tmp/B.aU5k9w/BUILD/scute-1.7.0/src'
make[2]: Entering directory '/tmp/B.aU5k9w/BUILD/scute-1.7.0/src'
/bin/sh ../libtool  --tag=CC   --mode=compile x86_64-pld-linux-gcc -DHAVE_CONFIG_H -I. -I..  -I./../include -I/usr/include    -Wall -Wno-pointer-sign -Wpointer-arith -O2 -fwrapv -pipe -Wformat -Werror=format-security -gdwarf-4 -fno-debug-types-section -fvar-tracking-assignments -g2 -Wp,-D_FORTIFY_SOURCE=2 -fstack-protector-strong --param=ssp-buffer-size=4 -Werror=trampolines -fPIC -march=x86-64 -gdwarf-4 -fno-debug-types-section -fvar-tracking-assignments -g2  -MT scute_la-p11-unwrapkey.lo -MD -MP -MF .deps/scute_la-p11-unwrapkey.Tpo -c -o scute_la-p11-unwrapkey.lo `test -f 'p11-unwrapkey.c' || echo './'`p11-unwrapkey.c
libtool: compile:  x86_64-pld-linux-gcc -DHAVE_CONFIG_H -I. -I.. -I./../include -I/usr/include -Wall -Wno-pointer-sign -Wpointer-arith -O2 -fwrapv -pipe -Wformat -Werror=format-security -gdwarf-4 -fno-debug-types-section -fvar-tracking-assignments -g2 -Wp,-D_FORTIFY_SOURCE=2 -fstack-protector-strong --param=ssp-buffer-size=4 -Werror=trampolines -fPIC -march=x86-64 -gdwarf-4 -fno-debug-types-section -fvar-tracking-assignments -g2 -MT scute_la-p11-unwrapkey.lo -MD -MP -MF .deps/scute_la-p11-unwrapkey.Tpo -c p11-unwrapkey.c  -fPIC -DPIC -o .libs/scute_la-p11-unwrapkey.o
mv -f .deps/scute_la-p11-unwrapkey.Tpo .deps/scute_la-p11-unwrapkey.Plo
make[2]: Leaving directory '/tmp/B.aU5k9w/BUILD/scute-1.7.0/src'
make[2]: Entering directory '/tmp/B.aU5k9w/BUILD/scute-1.7.0/src'
/bin/sh ../libtool  --tag=CC   --mode=compile x86_64-pld-linux-gcc -DHAVE_CONFIG_H -I. -I..  -I./../include -I/usr/include    -Wall -Wno-pointer-sign -Wpointer-arith -O2 -fwrapv -pipe -Wformat -Werror=format-security -gdwarf-4 -fno-debug-types-section -fvar-tracking-assignments -g2 -Wp,-D_FORTIFY_SOURCE=2 -fstack-protector-strong --param=ssp-buffer-size=4 -Werror=trampolines -fPIC -march=x86-64 -gdwarf-4 -fno-debug-types-section -fvar-tracking-assignments -g2  -MT scute_la-p11-verifyfinal.lo -MD -MP -MF .deps/scute_la-p11-verifyfinal.Tpo -c -o scute_la-p11-verifyfinal.lo `test -f 'p11-verifyfinal.c' || echo './'`p11-verifyfinal.c
libtool: compile:  x86_64-pld-linux-gcc -DHAVE_CONFIG_H -I. -I.. -I./../include -I/usr/include -Wall -Wno-pointer-sign -Wpointer-arith -O2 -fwrapv -pipe -Wformat -Werror=format-security -gdwarf-4 -fno-debug-types-section -fvar-tracking-assignments -g2 -Wp,-D_FORTIFY_SOURCE=2 -fstack-protector-strong --param=ssp-buffer-size=4 -Werror=trampolines -fPIC -march=x86-64 -gdwarf-4 -fno-debug-types-section -fvar-tracking-assignments -g2 -MT scute_la-p11-verifyfinal.lo -MD -MP -MF .deps/scute_la-p11-verifyfinal.Tpo -c p11-verifyfinal.c  -fPIC -DPIC -o .libs/scute_la-p11-verifyfinal.o
mv -f .deps/scute_la-p11-verifyfinal.Tpo .deps/scute_la-p11-verifyfinal.Plo
make[2]: Leaving directory '/tmp/B.aU5k9w/BUILD/scute-1.7.0/src'
make[2]: Entering directory '/tmp/B.aU5k9w/BUILD/scute-1.7.0/src'
/bin/sh ../libtool  --tag=CC   --mode=compile x86_64-pld-linux-gcc -DHAVE_CONFIG_H -I. -I..  -I./../include -I/usr/include    -Wall -Wno-pointer-sign -Wpointer-arith -O2 -fwrapv -pipe -Wformat -Werror=format-security -gdwarf-4 -fno-debug-types-section -fvar-tracking-assignments -g2 -Wp,-D_FORTIFY_SOURCE=2 -fstack-protector-strong --param=ssp-buffer-size=4 -Werror=trampolines -fPIC -march=x86-64 -gdwarf-4 -fno-debug-types-section -fvar-tracking-assignments -g2  -MT scute_la-p11-verifyrecover.lo -MD -MP -MF .deps/scute_la-p11-verifyrecover.Tpo -c -o scute_la-p11-verifyrecover.lo `test -f 'p11-verifyrecover.c' || echo './'`p11-verifyrecover.c
libtool: compile:  x86_64-pld-linux-gcc -DHAVE_CONFIG_H -I. -I.. -I./../include -I/usr/include -Wall -Wno-pointer-sign -Wpointer-arith -O2 -fwrapv -pipe -Wformat -Werror=format-security -gdwarf-4 -fno-debug-types-section -fvar-tracking-assignments -g2 -Wp,-D_FORTIFY_SOURCE=2 -fstack-protector-strong --param=ssp-buffer-size=4 -Werror=trampolines -fPIC -march=x86-64 -gdwarf-4 -fno-debug-types-section -fvar-tracking-assignments -g2 -MT scute_la-p11-verifyrecover.lo -MD -MP -MF .deps/scute_la-p11-verifyrecover.Tpo -c p11-verifyrecover.c  -fPIC -DPIC -o .libs/scute_la-p11-verifyrecover.o
mv -f .deps/scute_la-p11-verifyrecover.Tpo .deps/scute_la-p11-verifyrecover.Plo
make[2]: Leaving directory '/tmp/B.aU5k9w/BUILD/scute-1.7.0/src'
make[2]: Entering directory '/tmp/B.aU5k9w/BUILD/scute-1.7.0/src'
/bin/sh ../libtool  --tag=CC   --mode=compile x86_64-pld-linux-gcc -DHAVE_CONFIG_H -I. -I..  -I./../include -I/usr/include    -Wall -Wno-pointer-sign -Wpointer-arith -O2 -fwrapv -pipe -Wformat -Werror=format-security -gdwarf-4 -fno-debug-types-section -fvar-tracking-assignments -g2 -Wp,-D_FORTIFY_SOURCE=2 -fstack-protector-strong --param=ssp-buffer-size=4 -Werror=trampolines -fPIC -march=x86-64 -gdwarf-4 -fno-debug-types-section -fvar-tracking-assignments -g2  -MT scute_la-p11-verifyinit.lo -MD -MP -MF .deps/scute_la-p11-verifyinit.Tpo -c -o scute_la-p11-verifyinit.lo `test -f 'p11-verifyinit.c' || echo './'`p11-verifyinit.c
libtool: compile:  x86_64-pld-linux-gcc -DHAVE_CONFIG_H -I. -I.. -I./../include -I/usr/include -Wall -Wno-pointer-sign -Wpointer-arith -O2 -fwrapv -pipe -Wformat -Werror=format-security -gdwarf-4 -fno-debug-types-section -fvar-tracking-assignments -g2 -Wp,-D_FORTIFY_SOURCE=2 -fstack-protector-strong --param=ssp-buffer-size=4 -Werror=trampolines -fPIC -march=x86-64 -gdwarf-4 -fno-debug-types-section -fvar-tracking-assignments -g2 -MT scute_la-p11-verifyinit.lo -MD -MP -MF .deps/scute_la-p11-verifyinit.Tpo -c p11-verifyinit.c  -fPIC -DPIC -o .libs/scute_la-p11-verifyinit.o
mv -f .deps/scute_la-p11-verifyinit.Tpo .deps/scute_la-p11-verifyinit.Plo
make[2]: Leaving directory '/tmp/B.aU5k9w/BUILD/scute-1.7.0/src'
make[2]: Entering directory '/tmp/B.aU5k9w/BUILD/scute-1.7.0/src'
/bin/sh ../libtool  --tag=CC   --mode=compile x86_64-pld-linux-gcc -DHAVE_CONFIG_H -I. -I..  -I./../include -I/usr/include    -Wall -Wno-pointer-sign -Wpointer-arith -O2 -fwrapv -pipe -Wformat -Werror=format-security -gdwarf-4 -fno-debug-types-section -fvar-tracking-assignments -g2 -Wp,-D_FORTIFY_SOURCE=2 -fstack-protector-strong --param=ssp-buffer-size=4 -Werror=trampolines -fPIC -march=x86-64 -gdwarf-4 -fno-debug-types-section -fvar-tracking-assignments -g2  -MT scute_la-p11-verifyupdate.lo -MD -MP -MF .deps/scute_la-p11-verifyupdate.Tpo -c -o scute_la-p11-verifyupdate.lo `test -f 'p11-verifyupdate.c' || echo './'`p11-verifyupdate.c
libtool: compile:  x86_64-pld-linux-gcc -DHAVE_CONFIG_H -I. -I.. -I./../include -I/usr/include -Wall -Wno-pointer-sign -Wpointer-arith -O2 -fwrapv -pipe -Wformat -Werror=format-security -gdwarf-4 -fno-debug-types-section -fvar-tracking-assignments -g2 -Wp,-D_FORTIFY_SOURCE=2 -fstack-protector-strong --param=ssp-buffer-size=4 -Werror=trampolines -fPIC -march=x86-64 -gdwarf-4 -fno-debug-types-section -fvar-tracking-assignments -g2 -MT scute_la-p11-verifyupdate.lo -MD -MP -MF .deps/scute_la-p11-verifyupdate.Tpo -c p11-verifyupdate.c  -fPIC -DPIC -o .libs/scute_la-p11-verifyupdate.o
mv -f .deps/scute_la-p11-verifyupdate.Tpo .deps/scute_la-p11-verifyupdate.Plo
make[2]: Leaving directory '/tmp/B.aU5k9w/BUILD/scute-1.7.0/src'
make[2]: Entering directory '/tmp/B.aU5k9w/BUILD/scute-1.7.0/src'
/bin/sh ../libtool  --tag=CC   --mode=compile x86_64-pld-linux-gcc -DHAVE_CONFIG_H -I. -I..  -I./../include -I/usr/include    -Wall -Wno-pointer-sign -Wpointer-arith -O2 -fwrapv -pipe -Wformat -Werror=format-security -gdwarf-4 -fno-debug-types-section -fvar-tracking-assignments -g2 -Wp,-D_FORTIFY_SOURCE=2 -fstack-protector-strong --param=ssp-buffer-size=4 -Werror=trampolines -fPIC -march=x86-64 -gdwarf-4 -fno-debug-types-section -fvar-tracking-assignments -g2  -MT scute_la-p11-verifyrecoverinit.lo -MD -MP -MF .deps/scute_la-p11-verifyrecoverinit.Tpo -c -o scute_la-p11-verifyrecoverinit.lo `test -f 'p11-verifyrecoverinit.c' || echo './'`p11-verifyrecoverinit.c
libtool: compile:  x86_64-pld-linux-gcc -DHAVE_CONFIG_H -I. -I.. -I./../include -I/usr/include -Wall -Wno-pointer-sign -Wpointer-arith -O2 -fwrapv -pipe -Wformat -Werror=format-security -gdwarf-4 -fno-debug-types-section -fvar-tracking-assignments -g2 -Wp,-D_FORTIFY_SOURCE=2 -fstack-protector-strong --param=ssp-buffer-size=4 -Werror=trampolines -fPIC -march=x86-64 -gdwarf-4 -fno-debug-types-section -fvar-tracking-assignments -g2 -MT scute_la-p11-verifyrecoverinit.lo -MD -MP -MF .deps/scute_la-p11-verifyrecoverinit.Tpo -c p11-verifyrecoverinit.c  -fPIC -DPIC -o .libs/scute_la-p11-verifyrecoverinit.o
mv -f .deps/scute_la-p11-verifyrecoverinit.Tpo .deps/scute_la-p11-verifyrecoverinit.Plo
make[2]: Leaving directory '/tmp/B.aU5k9w/BUILD/scute-1.7.0/src'
make[2]: Entering directory '/tmp/B.aU5k9w/BUILD/scute-1.7.0/src'
/bin/sh ../libtool  --tag=CC   --mode=compile x86_64-pld-linux-gcc -DHAVE_CONFIG_H -I. -I..  -I./../include -I/usr/include    -Wall -Wno-pointer-sign -Wpointer-arith -O2 -fwrapv -pipe -Wformat -Werror=format-security -gdwarf-4 -fno-debug-types-section -fvar-tracking-assignments -g2 -Wp,-D_FORTIFY_SOURCE=2 -fstack-protector-strong --param=ssp-buffer-size=4 -Werror=trampolines -fPIC -march=x86-64 -gdwarf-4 -fno-debug-types-section -fvar-tracking-assignments -g2  -MT scute_la-p11-waitforslotevent.lo -MD -MP -MF .deps/scute_la-p11-waitforslotevent.Tpo -c -o scute_la-p11-waitforslotevent.lo `test -f 'p11-waitforslotevent.c' || echo './'`p11-waitforslotevent.c
libtool: compile:  x86_64-pld-linux-gcc -DHAVE_CONFIG_H -I. -I.. -I./../include -I/usr/include -Wall -Wno-pointer-sign -Wpointer-arith -O2 -fwrapv -pipe -Wformat -Werror=format-security -gdwarf-4 -fno-debug-types-section -fvar-tracking-assignments -g2 -Wp,-D_FORTIFY_SOURCE=2 -fstack-protector-strong --param=ssp-buffer-size=4 -Werror=trampolines -fPIC -march=x86-64 -gdwarf-4 -fno-debug-types-section -fvar-tracking-assignments -g2 -MT scute_la-p11-waitforslotevent.lo -MD -MP -MF .deps/scute_la-p11-waitforslotevent.Tpo -c p11-waitforslotevent.c  -fPIC -DPIC -o .libs/scute_la-p11-waitforslotevent.o
mv -f .deps/scute_la-p11-waitforslotevent.Tpo .deps/scute_la-p11-waitforslotevent.Plo
make[2]: Leaving directory '/tmp/B.aU5k9w/BUILD/scute-1.7.0/src'
make[2]: Entering directory '/tmp/B.aU5k9w/BUILD/scute-1.7.0/src'
/bin/sh ../libtool  --tag=CC   --mode=compile x86_64-pld-linux-gcc -DHAVE_CONFIG_H -I. -I..  -I./../include -I/usr/include    -Wall -Wno-pointer-sign -Wpointer-arith -O2 -fwrapv -pipe -Wformat -Werror=format-security -gdwarf-4 -fno-debug-types-section -fvar-tracking-assignments -g2 -Wp,-D_FORTIFY_SOURCE=2 -fstack-protector-strong --param=ssp-buffer-size=4 -Werror=trampolines -fPIC -march=x86-64 -gdwarf-4 -fno-debug-types-section -fvar-tracking-assignments -g2  -MT scute_la-p11-wrapkey.lo -MD -MP -MF .deps/scute_la-p11-wrapkey.Tpo -c -o scute_la-p11-wrapkey.lo `test -f 'p11-wrapkey.c' || echo './'`p11-wrapkey.c
libtool: compile:  x86_64-pld-linux-gcc -DHAVE_CONFIG_H -I. -I.. -I./../include -I/usr/include -Wall -Wno-pointer-sign -Wpointer-arith -O2 -fwrapv -pipe -Wformat -Werror=format-security -gdwarf-4 -fno-debug-types-section -fvar-tracking-assignments -g2 -Wp,-D_FORTIFY_SOURCE=2 -fstack-protector-strong --param=ssp-buffer-size=4 -Werror=trampolines -fPIC -march=x86-64 -gdwarf-4 -fno-debug-types-section -fvar-tracking-assignments -g2 -MT scute_la-p11-wrapkey.lo -MD -MP -MF .deps/scute_la-p11-wrapkey.Tpo -c p11-wrapkey.c  -fPIC -DPIC -o .libs/scute_la-p11-wrapkey.o
mv -f .deps/scute_la-p11-wrapkey.Tpo .deps/scute_la-p11-wrapkey.Plo
make[2]: Leaving directory '/tmp/B.aU5k9w/BUILD/scute-1.7.0/src'
make[2]: Entering directory '/tmp/B.aU5k9w/BUILD/scute-1.7.0/src'
/bin/sh ../libtool  --tag=CC   --mode=link x86_64-pld-linux-gcc  -Wall -Wno-pointer-sign -Wpointer-arith -O2 -fwrapv -pipe -Wformat -Werror=format-security -gdwarf-4 -fno-debug-types-section -fvar-tracking-assignments -g2 -Wp,-D_FORTIFY_SOURCE=2 -fstack-protector-strong --param=ssp-buffer-size=4 -Werror=trampolines -fPIC -march=x86-64 -gdwarf-4 -fno-debug-types-section -fvar-tracking-assignments -g2    -module -avoid-version  -Wl,--version-script=./libscute.vers -version-info 0:5:0 -Wl,--as-needed -Wl,--no-copy-dt-needed-entries -Wl,-z,relro -Wl,-z,combreloc  -o scute.la -rpath /usr/lib64 scute_la-debug.lo scute_la-readconf.lo scute_la-locking.lo scute_la-error-mapping.lo scute_la-get-path.lo scute_la-agent.lo scute_la-slots.lo scute_la-table.lo scute_la-cert-gpgsm.lo scute_la-cert-object.lo scute_la-gpgsm.lo scute_la-p11-cancelfunction.lo scute_la-p11-closeallsessions.lo scute_la-p11-closesession.lo scute_la-p11-copyobject.lo scute_la-p11-createobject.lo scute_la-p11-decrypt.lo scute_la-p11-decryptdigestupdate.lo scute_la-p11-decryptfinal.lo scute_la-p11-decryptinit.lo scute_la-p11-decryptupdate.lo scute_la-p11-decryptverifyupdate.lo scute_la-p11-derivekey.lo scute_la-p11-destroyobject.lo scute_la-p11-digest.lo scute_la-p11-digestencryptupdate.lo scute_la-p11-digestfinal.lo scute_la-p11-digestinit.lo scute_la-p11-digestkey.lo scute_la-p11-digestupdate.lo scute_la-p11-encrypt.lo scute_la-p11-encryptfinal.lo scute_la-p11-encryptinit.lo scute_la-p11-encryptupdate.lo scute_la-p11-finalize.lo scute_la-p11-findobjects.lo scute_la-p11-findobjectsfinal.lo scute_la-p11-findobjectsinit.lo scute_la-p11-generatekey.lo scute_la-p11-generatekeypair.lo scute_la-p11-generaterandom.lo scute_la-p11-getattributevalue.lo scute_la-p11-getfunctionlist.lo scute_la-p11-getfunctionstatus.lo scute_la-p11-getinfo.lo scute_la-p11-getmechanisminfo.lo scute_la-p11-getmechanismlist.lo scute_la-p11-getobjectsize.lo scute_la-p11-getoperationstate.lo scute_la-p11-getsessioninfo.lo scute_la-p11-getslotinfo.lo scute_la-p11-getslotlist.lo scute_la-p11-gettokeninfo.lo scute_la-p11-initialize.lo scute_la-p11-initpin.lo scute_la-p11-inittoken.lo scute_la-p11-login.lo scute_la-p11-logout.lo scute_la-p11-opensession.lo scute_la-p11-seedrandom.lo scute_la-p11-setattributevalue.lo scute_la-p11-setoperationstate.lo scute_la-p11-setpin.lo scute_la-p11-sign.lo scute_la-p11-signencryptupdate.lo scute_la-p11-signfinal.lo scute_la-p11-signinit.lo scute_la-p11-signrecover.lo scute_la-p11-signrecoverinit.lo scute_la-p11-signupdate.lo scute_la-p11-unwrapkey.lo scute_la-p11-verify.lo scute_la-p11-verifyfinal.lo scute_la-p11-verifyinit.lo scute_la-p11-verifyrecover.lo scute_la-p11-verifyrecoverinit.lo scute_la-p11-verifyupdate.lo scute_la-p11-waitforslotevent.lo scute_la-p11-wrapkey.lo  -L/usr/lib64 -lassuan -lgpg-error  
libtool: link: x86_64-pld-linux-gcc -shared  -fPIC -DPIC  -O2 -gdwarf-4 -g2 -fstack-protector-strong -march=x86-64 -gdwarf-4 -g2 -Wl,--version-script=./libscute.vers -Wl,--as-needed -Wl,--no-copy-dt-needed-entries -Wl,-z -Wl,relro -Wl,-z -Wl,combreloc    .libs/scute_la-debug.o .libs/scute_la-readconf.o .libs/scute_la-locking.o .libs/scute_la-error-mapping.o .libs/scute_la-get-path.o .libs/scute_la-agent.o .libs/scute_la-slots.o .libs/scute_la-table.o .libs/scute_la-cert-gpgsm.o .libs/scute_la-cert-object.o .libs/scute_la-gpgsm.o .libs/scute_la-p11-cancelfunction.o .libs/scute_la-p11-closeallsessions.o .libs/scute_la-p11-closesession.o .libs/scute_la-p11-copyobject.o .libs/scute_la-p11-createobject.o .libs/scute_la-p11-decrypt.o .libs/scute_la-p11-decryptdigestupdate.o .libs/scute_la-p11-decryptfinal.o .libs/scute_la-p11-decryptinit.o .libs/scute_la-p11-decryptupdate.o .libs/scute_la-p11-decryptverifyupdate.o .libs/scute_la-p11-derivekey.o .libs/scute_la-p11-destroyobject.o .libs/scute_la-p11-digest.o .libs/scute_la-p11-digestencryptupdate.o .libs/scute_la-p11-digestfinal.o .libs/scute_la-p11-digestinit.o .libs/scute_la-p11-digestkey.o .libs/scute_la-p11-digestupdate.o .libs/scute_la-p11-encrypt.o .libs/scute_la-p11-encryptfinal.o .libs/scute_la-p11-encryptinit.o .libs/scute_la-p11-encryptupdate.o .libs/scute_la-p11-finalize.o .libs/scute_la-p11-findobjects.o .libs/scute_la-p11-findobjectsfinal.o .libs/scute_la-p11-findobjectsinit.o .libs/scute_la-p11-generatekey.o .libs/scute_la-p11-generatekeypair.o .libs/scute_la-p11-generaterandom.o .libs/scute_la-p11-getattributevalue.o .libs/scute_la-p11-getfunctionlist.o .libs/scute_la-p11-getfunctionstatus.o .libs/scute_la-p11-getinfo.o .libs/scute_la-p11-getmechanisminfo.o .libs/scute_la-p11-getmechanismlist.o .libs/scute_la-p11-getobjectsize.o .libs/scute_la-p11-getoperationstate.o .libs/scute_la-p11-getsessioninfo.o .libs/scute_la-p11-getslotinfo.o .libs/scute_la-p11-getslotlist.o .libs/scute_la-p11-gettokeninfo.o .libs/scute_la-p11-initialize.o .libs/scute_la-p11-initpin.o .libs/scute_la-p11-inittoken.o .libs/scute_la-p11-login.o .libs/scute_la-p11-logout.o .libs/scute_la-p11-opensession.o .libs/scute_la-p11-seedrandom.o .libs/scute_la-p11-setattributevalue.o .libs/scute_la-p11-setoperationstate.o .libs/scute_la-p11-setpin.o .libs/scute_la-p11-sign.o .libs/scute_la-p11-signencryptupdate.o .libs/scute_la-p11-signfinal.o .libs/scute_la-p11-signinit.o .libs/scute_la-p11-signrecover.o .libs/scute_la-p11-signrecoverinit.o .libs/scute_la-p11-signupdate.o .libs/scute_la-p11-unwrapkey.o .libs/scute_la-p11-verify.o .libs/scute_la-p11-verifyfinal.o .libs/scute_la-p11-verifyinit.o .libs/scute_la-p11-verifyrecover.o .libs/scute_la-p11-verifyrecoverinit.o .libs/scute_la-p11-verifyupdate.o .libs/scute_la-p11-waitforslotevent.o .libs/scute_la-p11-wrapkey.o   -L/usr/lib64 /usr/lib64/libassuan.so /usr/lib64/libgpg-error.so -Wl,-soname -Wl,scute.so -o .libs/scute.so
/usr/bin/ld: .libs/scute_la-readconf.o:/tmp/B.aU5k9w/BUILD/scute-1.7.0/src/options.h:28: multiple definition of `_scute_opt'; .libs/scute_la-debug.o:/tmp/B.aU5k9w/BUILD/scute-1.7.0/src/options.h:28: first defined here
/usr/bin/ld: .libs/scute_la-error-mapping.o:/tmp/B.aU5k9w/BUILD/scute-1.7.0/src/options.h:28: multiple definition of `_scute_opt'; .libs/scute_la-debug.o:/tmp/B.aU5k9w/BUILD/scute-1.7.0/src/options.h:28: first defined here
/usr/bin/ld: .libs/scute_la-get-path.o:/tmp/B.aU5k9w/BUILD/scute-1.7.0/src/options.h:28: multiple definition of `_scute_opt'; .libs/scute_la-debug.o:/tmp/B.aU5k9w/BUILD/scute-1.7.0/src/options.h:28: first defined here
/usr/bin/ld: .libs/scute_la-agent.o:/tmp/B.aU5k9w/BUILD/scute-1.7.0/src/options.h:28: multiple definition of `_scute_opt'; .libs/scute_la-debug.o:/tmp/B.aU5k9w/BUILD/scute-1.7.0/src/options.h:28: first defined here
/usr/bin/ld: .libs/scute_la-slots.o:/tmp/B.aU5k9w/BUILD/scute-1.7.0/src/options.h:28: multiple definition of `_scute_opt'; .libs/scute_la-debug.o:/tmp/B.aU5k9w/BUILD/scute-1.7.0/src/options.h:28: first defined here
/usr/bin/ld: .libs/scute_la-cert-gpgsm.o:/tmp/B.aU5k9w/BUILD/scute-1.7.0/src/options.h:28: multiple definition of `_scute_opt'; .libs/scute_la-debug.o:/tmp/B.aU5k9w/BUILD/scute-1.7.0/src/options.h:28: first defined here
/usr/bin/ld: .libs/scute_la-cert-object.o:/tmp/B.aU5k9w/BUILD/scute-1.7.0/src/options.h:28: multiple definition of `_scute_opt'; .libs/scute_la-debug.o:/tmp/B.aU5k9w/BUILD/scute-1.7.0/src/options.h:28: first defined here
/usr/bin/ld: .libs/scute_la-gpgsm.o:/tmp/B.aU5k9w/BUILD/scute-1.7.0/src/options.h:28: multiple definition of `_scute_opt'; .libs/scute_la-debug.o:/tmp/B.aU5k9w/BUILD/scute-1.7.0/src/options.h:28: first defined here
/usr/bin/ld: .libs/scute_la-p11-findobjectsinit.o:/tmp/B.aU5k9w/BUILD/scute-1.7.0/src/options.h:28: multiple definition of `_scute_opt'; .libs/scute_la-debug.o:/tmp/B.aU5k9w/BUILD/scute-1.7.0/src/options.h:28: first defined here
/usr/bin/ld: .libs/scute_la-p11-initialize.o:/tmp/B.aU5k9w/BUILD/scute-1.7.0/src/options.h:28: multiple definition of `_scute_opt'; .libs/scute_la-debug.o:/tmp/B.aU5k9w/BUILD/scute-1.7.0/src/options.h:28: first defined here
collect2: error: ld returned 1 exit status
make[2]: *** [Makefile:836: scute.la] Error 1
make[2]: Leaving directory '/tmp/B.aU5k9w/BUILD/scute-1.7.0/src'
make[1]: *** [Makefile:453: all-recursive] Error 1
make: *** [Makefile:385: all] Error 2
error: Bad exit status from /tmp/B.aU5k9w/BUILD/tmp/rpm-tmp.7340 (%build)


RPM build errors:
    Bad exit status from /tmp/B.aU5k9w/BUILD/tmp/rpm-tmp.7340 (%build)
ended at: Sun Jan 10 16:12:01 2021, done in 0:00:22.659878
error: No files produced.
+ chmod -R u+rwX /tmp/B.aU5k9w/BUILD
+ rm -rf /tmp/B.aU5k9w/tmp /tmp/B.aU5k9w/BUILD
+ rm -rf /tmp/B.aU5k9w
Begin-PLD-Builder-Info
Build-Time: user:26.21s sys:8.34s real:24.96s (faults io:35 non-io:2475834)

End-PLD-Builder-Info
[Back to list of logs] [View rpm -qa of builder]