FailedOk

th/SRPMS[OK]
th/x32[OK]
th/i686[OK]
th/x86_64[OK]

ac/SRPMS[OK]
ac/i386[OK]
ac/i586[OK]
ac/i686[OK]
ac/alpha[OK]
ac/amd64[OK]
ac/athlon[OK]
ac/ppc[OK]
ac/sparc[OK]
ac/sparc64[OK]

Advanced Search
main()
Powered by PLD Linux
(c) 2002-2018 PLD Team
$Revision: 1.37 $
Powered by Real Operating System.
Your IP: 54.80.87.62

seed a9477dba-55f8-438f-93cf-da8d183f6d8f

Status:Failed
Source URL:ftp://buildlogs.pld-linux.org/th/x86_64/FAIL/seed,a9477dba-55f8-438f-93cf-da8d183f6d8f.bz2
text/plain URL:View!
full text:View!
rpm -qa of builder:View!
Date:2018/07/29 00:49:58
Runtime:0:00:37.906882

Toc:

  • error 1
  • make[4]: *** [Makefile:598: readline-funcs.xml] Error 139
  • error 2
  • make[3]: *** [Makefile:503: all-recursive] Error 1
  • error 3
  • make[2]: *** [Makefile:515: all-recursive] Error 1
  • error 4
  • make[1]: *** [Makefile:633: all-recursive] Error 1
  • error 5
  • error: Bad exit status from /tmp/B.IN3tK9/BUILD/tmp/rpm-tmp.20315 (%build)
  • error 6
  • RPM build errors:
  • error 7
  • error: No files produced.

Content:

mv -f .deps/seed-mpfr-trig.Tpo .deps/seed-mpfr-trig.Plo
make[3]: Leaving directory '/tmp/B.IN3tK9/BUILD/seed-3.8.1/modules/mpfr'
make[3]: Entering directory '/tmp/B.IN3tK9/BUILD/seed-3.8.1/modules/mpfr'
/bin/sh ../../libtool  --tag=CC   --mode=link x86_64-pld-linux-gcc  -O2 -fwrapv -pipe -Wformat -Werror=format-security -gdwarf-4 -fno-debug-types-section -fvar-tracking-assignments -g2 -Wp,-D_FORTIFY_SOURCE=2 -fstack-protector-strong --param=ssp-buffer-size=4 -fPIC -march=x86-64 -gdwarf-4 -fno-debug-types-section -fvar-tracking-assignments -g2  -Wall -module -avoid-version  -Wl,--as-needed -Wl,--no-copy-dt-needed-entries -Wl,-z,relro -Wl,-z,combreloc  -o libseed_mpfr.la -rpath /usr/lib64/seed-gtk3 seed-mpfr.lo seed-mpfr-trig.lo seed-mpfr-arithmetic.lo seed-mpfr-cmp.lo -lmpfr -lgmp ../../libseed/libseed-gtk3.la  
libtool: link: x86_64-pld-linux-gcc -shared  -fPIC -DPIC  -O2 -gdwarf-4 -g2 -fstack-protector-strong -march=x86-64 -gdwarf-4 -g2 -Wl,--as-needed -Wl,--no-copy-dt-needed-entries -Wl,-z -Wl,relro -Wl,-z -Wl,combreloc   -pthread  .libs/seed-mpfr.o .libs/seed-mpfr-trig.o .libs/seed-mpfr-arithmetic.o .libs/seed-mpfr-cmp.o   -Wl,-rpath -Wl,/tmp/B.IN3tK9/BUILD/seed-3.8.1/libseed/.libs -lmpfr /usr/lib64/libgmp.so ../../libseed/.libs/libseed-gtk3.so -L/usr/lib64 -lgirepository-1.0 -ljavascriptcoregtk-3.0 /usr/lib64/libgio-2.0.so /usr/lib64/libgmodule-2.0.so -lz -lselinux -lresolv -lmount /usr/lib64/libgobject-2.0.so /usr/lib64/libglib-2.0.so /usr/lib64/libpcre.so -lpthread /usr/lib64/libffi.so -ldl -Wl,-soname -Wl,libseed_mpfr.so -o .libs/libseed_mpfr.so
libtool: link: ar cru .libs/libseed_mpfr.a  seed-mpfr.o seed-mpfr-trig.o seed-mpfr-arithmetic.o seed-mpfr-cmp.o
libtool: link: ranlib .libs/libseed_mpfr.a
libtool: link: ( cd ".libs" && rm -f "libseed_mpfr.la" && ln -s "../libseed_mpfr.la" "libseed_mpfr.la" )
make[3]: Leaving directory '/tmp/B.IN3tK9/BUILD/seed-3.8.1/modules/mpfr'
Making all in ffi
make[3]: Entering directory '/tmp/B.IN3tK9/BUILD/seed-3.8.1/modules/ffi'
/bin/sh ../../libtool  --tag=CC   --mode=compile x86_64-pld-linux-gcc -DHAVE_CONFIG_H -I. -I../..    -I../../libseed/ -Wall -pthread -I/usr/include/gobject-introspection-1.0 -I/usr/lib64/libffi-3.2.1/include -I/usr/include/glib-2.0 -I/usr/lib64/glib-2.0/include -DG_DISABLE_ASSERT -DG_DISABLE_CHECKS -DG_DISABLE_CAST_CHECKS  -I/usr/lib64/libffi-3.2.1/include -O2 -fwrapv -pipe -Wformat -Werror=format-security -gdwarf-4 -fno-debug-types-section -fvar-tracking-assignments -g2 -Wp,-D_FORTIFY_SOURCE=2 -fstack-protector-strong --param=ssp-buffer-size=4 -fPIC -march=x86-64 -gdwarf-4 -fno-debug-types-section -fvar-tracking-assignments -g2  -Wall -MT libseed_ffi_la-seed-ffi.lo -MD -MP -MF .deps/libseed_ffi_la-seed-ffi.Tpo -c -o libseed_ffi_la-seed-ffi.lo `test -f 'seed-ffi.c' || echo './'`seed-ffi.c
libtool: compile:  x86_64-pld-linux-gcc -DHAVE_CONFIG_H -I. -I../.. -I../../libseed/ -Wall -pthread -I/usr/include/gobject-introspection-1.0 -I/usr/lib64/libffi-3.2.1/include -I/usr/include/glib-2.0 -I/usr/lib64/glib-2.0/include -DG_DISABLE_ASSERT -DG_DISABLE_CHECKS -DG_DISABLE_CAST_CHECKS -I/usr/lib64/libffi-3.2.1/include -O2 -fwrapv -pipe -Wformat -Werror=format-security -gdwarf-4 -fno-debug-types-section -fvar-tracking-assignments -g2 -Wp,-D_FORTIFY_SOURCE=2 -fstack-protector-strong --param=ssp-buffer-size=4 -fPIC -march=x86-64 -gdwarf-4 -fno-debug-types-section -fvar-tracking-assignments -g2 -Wall -MT libseed_ffi_la-seed-ffi.lo -MD -MP -MF .deps/libseed_ffi_la-seed-ffi.Tpo -c seed-ffi.c  -fPIC -DPIC -o .libs/libseed_ffi_la-seed-ffi.o
libtool: compile:  x86_64-pld-linux-gcc -DHAVE_CONFIG_H -I. -I../.. -I../../libseed/ -Wall -pthread -I/usr/include/gobject-introspection-1.0 -I/usr/lib64/libffi-3.2.1/include -I/usr/include/glib-2.0 -I/usr/lib64/glib-2.0/include -DG_DISABLE_ASSERT -DG_DISABLE_CHECKS -DG_DISABLE_CAST_CHECKS -I/usr/lib64/libffi-3.2.1/include -O2 -fwrapv -pipe -Wformat -Werror=format-security -gdwarf-4 -fno-debug-types-section -fvar-tracking-assignments -g2 -Wp,-D_FORTIFY_SOURCE=2 -fstack-protector-strong --param=ssp-buffer-size=4 -fPIC -march=x86-64 -gdwarf-4 -fno-debug-types-section -fvar-tracking-assignments -g2 -Wall -MT libseed_ffi_la-seed-ffi.lo -MD -MP -MF .deps/libseed_ffi_la-seed-ffi.Tpo -c seed-ffi.c -o libseed_ffi_la-seed-ffi.o >/dev/null 2>&1
mv -f .deps/libseed_ffi_la-seed-ffi.Tpo .deps/libseed_ffi_la-seed-ffi.Plo
make[3]: Leaving directory '/tmp/B.IN3tK9/BUILD/seed-3.8.1/modules/ffi'
make[3]: Entering directory '/tmp/B.IN3tK9/BUILD/seed-3.8.1/modules/ffi'
/bin/sh ../../libtool  --tag=CC   --mode=link x86_64-pld-linux-gcc -I../../libseed/ -Wall -pthread -I/usr/include/gobject-introspection-1.0 -I/usr/lib64/libffi-3.2.1/include -I/usr/include/glib-2.0 -I/usr/lib64/glib-2.0/include -DG_DISABLE_ASSERT -DG_DISABLE_CHECKS -DG_DISABLE_CAST_CHECKS  -I/usr/lib64/libffi-3.2.1/include -O2 -fwrapv -pipe -Wformat -Werror=format-security -gdwarf-4 -fno-debug-types-section -fvar-tracking-assignments -g2 -Wp,-D_FORTIFY_SOURCE=2 -fstack-protector-strong --param=ssp-buffer-size=4 -fPIC -march=x86-64 -gdwarf-4 -fno-debug-types-section -fvar-tracking-assignments -g2  -Wall -module -avoid-version   -Wl,--as-needed -Wl,--no-copy-dt-needed-entries -Wl,-z,relro -Wl,-z,combreloc  -o libseed_ffi.la -rpath /usr/lib64/seed-gtk3 libseed_ffi_la-seed-ffi.lo ../../libseed/libseed-gtk3.la  
libtool: link: x86_64-pld-linux-gcc -shared  -fPIC -DPIC  -pthread -O2 -gdwarf-4 -g2 -fstack-protector-strong -march=x86-64 -gdwarf-4 -g2 -Wl,--as-needed -Wl,--no-copy-dt-needed-entries -Wl,-z -Wl,relro -Wl,-z -Wl,combreloc   -pthread  .libs/libseed_ffi_la-seed-ffi.o   -Wl,-rpath -Wl,/tmp/B.IN3tK9/BUILD/seed-3.8.1/libseed/.libs ../../libseed/.libs/libseed-gtk3.so -L/usr/lib64 -lgirepository-1.0 -ljavascriptcoregtk-3.0 /usr/lib64/libgio-2.0.so /usr/lib64/libgmodule-2.0.so -lz -lselinux -lresolv -lmount /usr/lib64/libgobject-2.0.so /usr/lib64/libglib-2.0.so /usr/lib64/libpcre.so -lpthread /usr/lib64/libffi.so -ldl -Wl,-soname -Wl,libseed_ffi.so -o .libs/libseed_ffi.so
libtool: link: ar cru .libs/libseed_ffi.a  libseed_ffi_la-seed-ffi.o
libtool: link: ranlib .libs/libseed_ffi.a
libtool: link: ( cd ".libs" && rm -f "libseed_ffi.la" && ln -s "../libseed_ffi.la" "libseed_ffi.la" )
make[3]: Leaving directory '/tmp/B.IN3tK9/BUILD/seed-3.8.1/modules/ffi'
Making all in DynamicObject
make[3]: Entering directory '/tmp/B.IN3tK9/BUILD/seed-3.8.1/modules/DynamicObject'
/bin/sh ../../libtool  --tag=CC   --mode=compile x86_64-pld-linux-gcc -DHAVE_CONFIG_H -I. -I../..  -I../../libseed/ -pthread -I/usr/include/gobject-introspection-1.0 -I/usr/lib64/libffi-3.2.1/include -I/usr/include/glib-2.0 -I/usr/lib64/glib-2.0/include -DG_DISABLE_ASSERT -DG_DISABLE_CHECKS -DG_DISABLE_CAST_CHECKS    -O2 -fwrapv -pipe -Wformat -Werror=format-security -gdwarf-4 -fno-debug-types-section -fvar-tracking-assignments -g2 -Wp,-D_FORTIFY_SOURCE=2 -fstack-protector-strong --param=ssp-buffer-size=4 -fPIC -march=x86-64 -gdwarf-4 -fno-debug-types-section -fvar-tracking-assignments -g2  -Wall -MT seed-DynamicObject.lo -MD -MP -MF .deps/seed-DynamicObject.Tpo -c -o seed-DynamicObject.lo seed-DynamicObject.c
libtool: compile:  x86_64-pld-linux-gcc -DHAVE_CONFIG_H -I. -I../.. -I../../libseed/ -pthread -I/usr/include/gobject-introspection-1.0 -I/usr/lib64/libffi-3.2.1/include -I/usr/include/glib-2.0 -I/usr/lib64/glib-2.0/include -DG_DISABLE_ASSERT -DG_DISABLE_CHECKS -DG_DISABLE_CAST_CHECKS -O2 -fwrapv -pipe -Wformat -Werror=format-security -gdwarf-4 -fno-debug-types-section -fvar-tracking-assignments -g2 -Wp,-D_FORTIFY_SOURCE=2 -fstack-protector-strong --param=ssp-buffer-size=4 -fPIC -march=x86-64 -gdwarf-4 -fno-debug-types-section -fvar-tracking-assignments -g2 -Wall -MT seed-DynamicObject.lo -MD -MP -MF .deps/seed-DynamicObject.Tpo -c seed-DynamicObject.c  -fPIC -DPIC -o .libs/seed-DynamicObject.o
libtool: compile:  x86_64-pld-linux-gcc -DHAVE_CONFIG_H -I. -I../.. -I../../libseed/ -pthread -I/usr/include/gobject-introspection-1.0 -I/usr/lib64/libffi-3.2.1/include -I/usr/include/glib-2.0 -I/usr/lib64/glib-2.0/include -DG_DISABLE_ASSERT -DG_DISABLE_CHECKS -DG_DISABLE_CAST_CHECKS -O2 -fwrapv -pipe -Wformat -Werror=format-security -gdwarf-4 -fno-debug-types-section -fvar-tracking-assignments -g2 -Wp,-D_FORTIFY_SOURCE=2 -fstack-protector-strong --param=ssp-buffer-size=4 -fPIC -march=x86-64 -gdwarf-4 -fno-debug-types-section -fvar-tracking-assignments -g2 -Wall -MT seed-DynamicObject.lo -MD -MP -MF .deps/seed-DynamicObject.Tpo -c seed-DynamicObject.c -o seed-DynamicObject.o >/dev/null 2>&1
mv -f .deps/seed-DynamicObject.Tpo .deps/seed-DynamicObject.Plo
make[3]: Leaving directory '/tmp/B.IN3tK9/BUILD/seed-3.8.1/modules/DynamicObject'
make[3]: Entering directory '/tmp/B.IN3tK9/BUILD/seed-3.8.1/modules/DynamicObject'
/bin/sh ../../libtool  --tag=CC   --mode=link x86_64-pld-linux-gcc  -O2 -fwrapv -pipe -Wformat -Werror=format-security -gdwarf-4 -fno-debug-types-section -fvar-tracking-assignments -g2 -Wp,-D_FORTIFY_SOURCE=2 -fstack-protector-strong --param=ssp-buffer-size=4 -fPIC -march=x86-64 -gdwarf-4 -fno-debug-types-section -fvar-tracking-assignments -g2  -Wall -module -avoid-version   -Wl,--as-needed -Wl,--no-copy-dt-needed-entries -Wl,-z,relro -Wl,-z,combreloc  -o libseed_DynamicObject.la -rpath /usr/lib64/seed-gtk3 seed-DynamicObject.lo  
libtool: link: x86_64-pld-linux-gcc -shared  -fPIC -DPIC  -O2 -gdwarf-4 -g2 -fstack-protector-strong -march=x86-64 -gdwarf-4 -g2 -Wl,--as-needed -Wl,--no-copy-dt-needed-entries -Wl,-z -Wl,relro -Wl,-z -Wl,combreloc    .libs/seed-DynamicObject.o   -Wl,-soname -Wl,libseed_DynamicObject.so -o .libs/libseed_DynamicObject.so
libtool: link: ar cru .libs/libseed_DynamicObject.a  seed-DynamicObject.o
libtool: link: ranlib .libs/libseed_DynamicObject.a
libtool: link: ( cd ".libs" && rm -f "libseed_DynamicObject.la" && ln -s "../libseed_DynamicObject.la" "libseed_DynamicObject.la" )
make[3]: Leaving directory '/tmp/B.IN3tK9/BUILD/seed-3.8.1/modules/DynamicObject'
Making all in xorg
make[3]: Entering directory '/tmp/B.IN3tK9/BUILD/seed-3.8.1/modules/xorg'
/bin/sh ../../libtool  --tag=CC   --mode=compile x86_64-pld-linux-gcc -DHAVE_CONFIG_H -I. -I../..    -I../../libseed/ -pthread -I/usr/include/gobject-introspection-1.0 -I/usr/lib64/libffi-3.2.1/include -I/usr/include/glib-2.0 -I/usr/lib64/glib-2.0/include  -DG_DISABLE_ASSERT -DG_DISABLE_CHECKS -DG_DISABLE_CAST_CHECKS  -O2 -fwrapv -pipe -Wformat -Werror=format-security -gdwarf-4 -fno-debug-types-section -fvar-tracking-assignments -g2 -Wp,-D_FORTIFY_SOURCE=2 -fstack-protector-strong --param=ssp-buffer-size=4 -fPIC -march=x86-64 -gdwarf-4 -fno-debug-types-section -fvar-tracking-assignments -g2  -Wall -MT libseed_xorg_la-seed-xorg.lo -MD -MP -MF .deps/libseed_xorg_la-seed-xorg.Tpo -c -o libseed_xorg_la-seed-xorg.lo `test -f 'seed-xorg.c' || echo './'`seed-xorg.c
libtool: compile:  x86_64-pld-linux-gcc -DHAVE_CONFIG_H -I. -I../.. -I../../libseed/ -pthread -I/usr/include/gobject-introspection-1.0 -I/usr/lib64/libffi-3.2.1/include -I/usr/include/glib-2.0 -I/usr/lib64/glib-2.0/include -DG_DISABLE_ASSERT -DG_DISABLE_CHECKS -DG_DISABLE_CAST_CHECKS -O2 -fwrapv -pipe -Wformat -Werror=format-security -gdwarf-4 -fno-debug-types-section -fvar-tracking-assignments -g2 -Wp,-D_FORTIFY_SOURCE=2 -fstack-protector-strong --param=ssp-buffer-size=4 -fPIC -march=x86-64 -gdwarf-4 -fno-debug-types-section -fvar-tracking-assignments -g2 -Wall -MT libseed_xorg_la-seed-xorg.lo -MD -MP -MF .deps/libseed_xorg_la-seed-xorg.Tpo -c seed-xorg.c  -fPIC -DPIC -o .libs/libseed_xorg_la-seed-xorg.o
libtool: compile:  x86_64-pld-linux-gcc -DHAVE_CONFIG_H -I. -I../.. -I../../libseed/ -pthread -I/usr/include/gobject-introspection-1.0 -I/usr/lib64/libffi-3.2.1/include -I/usr/include/glib-2.0 -I/usr/lib64/glib-2.0/include -DG_DISABLE_ASSERT -DG_DISABLE_CHECKS -DG_DISABLE_CAST_CHECKS -O2 -fwrapv -pipe -Wformat -Werror=format-security -gdwarf-4 -fno-debug-types-section -fvar-tracking-assignments -g2 -Wp,-D_FORTIFY_SOURCE=2 -fstack-protector-strong --param=ssp-buffer-size=4 -fPIC -march=x86-64 -gdwarf-4 -fno-debug-types-section -fvar-tracking-assignments -g2 -Wall -MT libseed_xorg_la-seed-xorg.lo -MD -MP -MF .deps/libseed_xorg_la-seed-xorg.Tpo -c seed-xorg.c -o libseed_xorg_la-seed-xorg.o >/dev/null 2>&1
mv -f .deps/libseed_xorg_la-seed-xorg.Tpo .deps/libseed_xorg_la-seed-xorg.Plo
make[3]: Leaving directory '/tmp/B.IN3tK9/BUILD/seed-3.8.1/modules/xorg'
make[3]: Entering directory '/tmp/B.IN3tK9/BUILD/seed-3.8.1/modules/xorg'
/bin/sh ../../libtool  --tag=CC   --mode=link x86_64-pld-linux-gcc -I../../libseed/ -pthread -I/usr/include/gobject-introspection-1.0 -I/usr/lib64/libffi-3.2.1/include -I/usr/include/glib-2.0 -I/usr/lib64/glib-2.0/include  -DG_DISABLE_ASSERT -DG_DISABLE_CHECKS -DG_DISABLE_CAST_CHECKS  -O2 -fwrapv -pipe -Wformat -Werror=format-security -gdwarf-4 -fno-debug-types-section -fvar-tracking-assignments -g2 -Wp,-D_FORTIFY_SOURCE=2 -fstack-protector-strong --param=ssp-buffer-size=4 -fPIC -march=x86-64 -gdwarf-4 -fno-debug-types-section -fvar-tracking-assignments -g2  -Wall -module -avoid-version    -Wl,--as-needed -Wl,--no-copy-dt-needed-entries -Wl,-z,relro -Wl,-z,combreloc  -o libseed_xorg.la -rpath /usr/lib64/seed-gtk3 libseed_xorg_la-seed-xorg.lo ../../libseed/libseed-gtk3.la -lXss  
libtool: link: x86_64-pld-linux-gcc -shared  -fPIC -DPIC  -pthread -O2 -gdwarf-4 -g2 -fstack-protector-strong -march=x86-64 -gdwarf-4 -g2 -Wl,--as-needed -Wl,--no-copy-dt-needed-entries -Wl,-z -Wl,relro -Wl,-z -Wl,combreloc   -pthread  .libs/libseed_xorg_la-seed-xorg.o   -Wl,-rpath -Wl,/tmp/B.IN3tK9/BUILD/seed-3.8.1/libseed/.libs ../../libseed/.libs/libseed-gtk3.so -L/usr/lib64 -lgirepository-1.0 -ljavascriptcoregtk-3.0 /usr/lib64/libgio-2.0.so /usr/lib64/libgmodule-2.0.so -lz -lselinux -lresolv -lmount /usr/lib64/libgobject-2.0.so /usr/lib64/libglib-2.0.so /usr/lib64/libpcre.so -lpthread /usr/lib64/libffi.so /usr/lib64/libXss.so /usr/lib64/libXext.so /usr/lib64/libX11.so /usr/lib64/libxcb.so /usr/lib64/libXau.so /usr/lib64/libXdmcp.so -ldl -Wl,-soname -Wl,libseed_xorg.so -o .libs/libseed_xorg.so
libtool: link: ar cru .libs/libseed_xorg.a  libseed_xorg_la-seed-xorg.o
libtool: link: ranlib .libs/libseed_xorg.a
libtool: link: ( cd ".libs" && rm -f "libseed_xorg.la" && ln -s "../libseed_xorg.la" "libseed_xorg.la" )
make[3]: Leaving directory '/tmp/B.IN3tK9/BUILD/seed-3.8.1/modules/xorg'
make[3]: Nothing to be done for 'all-am'.
Making all in tests
Making all in javascript
Making all in gtypes
make[4]: Nothing to be done for 'all'.
Making all in signals
make[4]: Nothing to be done for 'all'.
Making all in structs
make[4]: Nothing to be done for 'all'.
make[4]: Nothing to be done for 'all-am'.
Making all in c
make[3]: Entering directory '/tmp/B.IN3tK9/BUILD/seed-3.8.1/tests/c'
x86_64-pld-linux-gcc -DHAVE_CONFIG_H -I. -I../..    -Wall -pthread -I/usr/include/gobject-introspection-1.0 -I/usr/lib64/libffi-3.2.1/include -I/usr/include/glib-2.0 -I/usr/lib64/glib-2.0/include -O2 -fwrapv -pipe -Wformat -Werror=format-security -gdwarf-4 -fno-debug-types-section -fvar-tracking-assignments -g2 -Wp,-D_FORTIFY_SOURCE=2 -fstack-protector-strong --param=ssp-buffer-size=4 -fPIC -march=x86-64 -gdwarf-4 -fno-debug-types-section -fvar-tracking-assignments -g2  -Wall -MT test-basic.o -MD -MP -MF .deps/test-basic.Tpo -c -o test-basic.o `test -f 'basic.c' || echo './'`basic.c
mv -f .deps/test-basic.Tpo .deps/test-basic.Po
make[3]: Leaving directory '/tmp/B.IN3tK9/BUILD/seed-3.8.1/tests/c'
make[3]: Entering directory '/tmp/B.IN3tK9/BUILD/seed-3.8.1/tests/c'
x86_64-pld-linux-gcc -DHAVE_CONFIG_H -I. -I../..    -Wall -pthread -I/usr/include/gobject-introspection-1.0 -I/usr/lib64/libffi-3.2.1/include -I/usr/include/glib-2.0 -I/usr/lib64/glib-2.0/include -O2 -fwrapv -pipe -Wformat -Werror=format-security -gdwarf-4 -fno-debug-types-section -fvar-tracking-assignments -g2 -Wp,-D_FORTIFY_SOURCE=2 -fstack-protector-strong --param=ssp-buffer-size=4 -fPIC -march=x86-64 -gdwarf-4 -fno-debug-types-section -fvar-tracking-assignments -g2  -Wall -MT test-main.o -MD -MP -MF .deps/test-main.Tpo -c -o test-main.o `test -f 'main.c' || echo './'`main.c
mv -f .deps/test-main.Tpo .deps/test-main.Po
make[3]: Leaving directory '/tmp/B.IN3tK9/BUILD/seed-3.8.1/tests/c'
make[3]: Entering directory '/tmp/B.IN3tK9/BUILD/seed-3.8.1/tests/c'
x86_64-pld-linux-gcc -DHAVE_CONFIG_H -I. -I../..    -Wall -pthread -I/usr/include/gobject-introspection-1.0 -I/usr/lib64/libffi-3.2.1/include -I/usr/include/glib-2.0 -I/usr/lib64/glib-2.0/include -O2 -fwrapv -pipe -Wformat -Werror=format-security -gdwarf-4 -fno-debug-types-section -fvar-tracking-assignments -g2 -Wp,-D_FORTIFY_SOURCE=2 -fstack-protector-strong --param=ssp-buffer-size=4 -fPIC -march=x86-64 -gdwarf-4 -fno-debug-types-section -fvar-tracking-assignments -g2  -Wall -MT test-api-js-signal-from-c.o -MD -MP -MF .deps/test-api-js-signal-from-c.Tpo -c -o test-api-js-signal-from-c.o `test -f 'api-js-signal-from-c.c' || echo './'`api-js-signal-from-c.c
mv -f .deps/test-api-js-signal-from-c.Tpo .deps/test-api-js-signal-from-c.Po
make[3]: Leaving directory '/tmp/B.IN3tK9/BUILD/seed-3.8.1/tests/c'
make[3]: Entering directory '/tmp/B.IN3tK9/BUILD/seed-3.8.1/tests/c'
x86_64-pld-linux-gcc -DHAVE_CONFIG_H -I. -I../..    -Wall -pthread -I/usr/include/gobject-introspection-1.0 -I/usr/lib64/libffi-3.2.1/include -I/usr/include/glib-2.0 -I/usr/lib64/glib-2.0/include -O2 -fwrapv -pipe -Wformat -Werror=format-security -gdwarf-4 -fno-debug-types-section -fvar-tracking-assignments -g2 -Wp,-D_FORTIFY_SOURCE=2 -fstack-protector-strong --param=ssp-buffer-size=4 -fPIC -march=x86-64 -gdwarf-4 -fno-debug-types-section -fvar-tracking-assignments -g2  -Wall -MT test-api-closure.o -MD -MP -MF .deps/test-api-closure.Tpo -c -o test-api-closure.o `test -f 'api-closure.c' || echo './'`api-closure.c
mv -f .deps/test-api-closure.Tpo .deps/test-api-closure.Po
make[3]: Leaving directory '/tmp/B.IN3tK9/BUILD/seed-3.8.1/tests/c'
make[3]: Entering directory '/tmp/B.IN3tK9/BUILD/seed-3.8.1/tests/c'
x86_64-pld-linux-gcc -DHAVE_CONFIG_H -I. -I../..    -Wall -pthread -I/usr/include/gobject-introspection-1.0 -I/usr/lib64/libffi-3.2.1/include -I/usr/include/glib-2.0 -I/usr/lib64/glib-2.0/include -O2 -fwrapv -pipe -Wformat -Werror=format-security -gdwarf-4 -fno-debug-types-section -fvar-tracking-assignments -g2 -Wp,-D_FORTIFY_SOURCE=2 -fstack-protector-strong --param=ssp-buffer-size=4 -fPIC -march=x86-64 -gdwarf-4 -fno-debug-types-section -fvar-tracking-assignments -g2  -Wall -MT test-api-types.o -MD -MP -MF .deps/test-api-types.Tpo -c -o test-api-types.o `test -f 'api-types.c' || echo './'`api-types.c
mv -f .deps/test-api-types.Tpo .deps/test-api-types.Po
make[3]: Leaving directory '/tmp/B.IN3tK9/BUILD/seed-3.8.1/tests/c'
make[3]: Entering directory '/tmp/B.IN3tK9/BUILD/seed-3.8.1/tests/c'
/bin/sh ../../libtool  --tag=CC   --mode=link x86_64-pld-linux-gcc -Wall -pthread -I/usr/include/gobject-introspection-1.0 -I/usr/lib64/libffi-3.2.1/include -I/usr/include/glib-2.0 -I/usr/lib64/glib-2.0/include -O2 -fwrapv -pipe -Wformat -Werror=format-security -gdwarf-4 -fno-debug-types-section -fvar-tracking-assignments -g2 -Wp,-D_FORTIFY_SOURCE=2 -fstack-protector-strong --param=ssp-buffer-size=4 -fPIC -march=x86-64 -gdwarf-4 -fno-debug-types-section -fvar-tracking-assignments -g2  -Wall -lgirepository-1.0 -lgobject-2.0 -lglib-2.0 -Wl,--as-needed -Wl,--no-copy-dt-needed-entries -Wl,-z,relro -Wl,-z,combreloc  -o test test-main.o test-basic.o test-api-types.o test-api-closure.o test-api-js-signal-from-c.o ../../libseed/libseed-gtk3.la 
libtool: link: x86_64-pld-linux-gcc -Wall -pthread -I/usr/include/gobject-introspection-1.0 -I/usr/lib64/libffi-3.2.1/include -I/usr/include/glib-2.0 -I/usr/lib64/glib-2.0/include -O2 -fwrapv -pipe -Wformat -Werror=format-security -gdwarf-4 -fno-debug-types-section -fvar-tracking-assignments -g2 -Wp,-D_FORTIFY_SOURCE=2 -fstack-protector-strong --param=ssp-buffer-size=4 -fPIC -march=x86-64 -gdwarf-4 -fno-debug-types-section -fvar-tracking-assignments -g2 -Wall -Wl,--as-needed -Wl,--no-copy-dt-needed-entries -Wl,-z -Wl,relro -Wl,-z -Wl,combreloc -o .libs/test test-main.o test-basic.o test-api-types.o test-api-closure.o test-api-js-signal-from-c.o  ../../libseed/.libs/libseed-gtk3.so -lgirepository-1.0 -ljavascriptcoregtk-3.0 /usr/lib64/libgio-2.0.so /usr/lib64/libgmodule-2.0.so -lz -lselinux -lresolv -lmount /usr/lib64/libgobject-2.0.so /usr/lib64/libglib-2.0.so /usr/lib64/libpcre.so -lpthread /usr/lib64/libffi.so -ldl -pthread
make[3]: Leaving directory '/tmp/B.IN3tK9/BUILD/seed-3.8.1/tests/c'
make[3]: Nothing to be done for 'all-am'.
Making all in doc
Making all in tutorial-standalone
make[3]: Nothing to be done for 'all'.
Making all in modules
Making all in canvas
make[4]: Nothing to be done for 'all'.
Making all in multiprocessing
make[4]: Nothing to be done for 'all'.
Making all in readline
make[4]: Entering directory '/tmp/B.IN3tK9/BUILD/seed-3.8.1/doc/modules/readline'
../../../src/seed ../../../doc/modules/make-functions.js ../../../doc/modules/readline/readline.js > ../../../doc/modules/readline/readline-funcs.xml
Segmentation fault 
make[4]: *** [Makefile:598: readline-funcs.xml] Error 139
make[4]: Leaving directory '/tmp/B.IN3tK9/BUILD/seed-3.8.1/doc/modules/readline'
make[3]: *** [Makefile:503: all-recursive] Error 1
make[2]: *** [Makefile:515: all-recursive] Error 1
make[1]: *** [Makefile:633: all-recursive] Error 1
make: *** [Makefile:478: all] Error 2
error: Bad exit status from /tmp/B.IN3tK9/BUILD/tmp/rpm-tmp.20315 (%build)


RPM build errors:
    Bad exit status from /tmp/B.IN3tK9/BUILD/tmp/rpm-tmp.20315 (%build)
ended at: Sun Jul 29 00:49:57 2018, done in 0:00:37.906882
error: No files produced.
mesg: ttyname failed: Inappropriate ioctl for device
+ chmod -R u+rwX /tmp/B.IN3tK9/BUILD
+ rm -rf /tmp/B.IN3tK9/tmp /tmp/B.IN3tK9/BUILD
mesg: ttyname failed: Inappropriate ioctl for device
+ rm -rf /tmp/B.IN3tK9
Begin-PLD-Builder-Info
Build-Time: user:35.54s sys:9.35s real:41.57s (faults io:0 non-io:4345283)

End-PLD-Builder-Info
[Back to list of logs] [View rpm -qa of builder]