FailedOk

th/SRPMS[OK]
th/x32[OK]
th/i686[OK]
th/x86_64[OK]

ac/SRPMS[OK]
ac/i386[OK]
ac/i586[OK]
ac/i686[OK]
ac/alpha[OK]
ac/amd64[OK]
ac/athlon[OK]
ac/ppc[OK]
ac/sparc[OK]
ac/sparc64[OK]

Advanced Search
main()
Powered by PLD Linux
(c) 2002-2017 PLD Team
$Revision: 1.37 $
Powered by overclock.
Your IP: 54.225.15.88

sphinx-pdg 925bc507-0b24-457c-9f5f-fe14f1600172

Status:Failed
Source URL:ftp://buildlogs.pld-linux.org/th/x86_64/FAIL/sphinx-pdg,925bc507-0b24-457c-9f5f-fe14f1600172.bz2
text/plain URL:View!
full text:View!
rpm -qa of builder:View!
Date:2017/04/17 09:46:26
Runtime:0:02:01.060320

Toc:

  • error 1
  • /tmp/B.LL6W7F/BUILD/Sphinx-1.5.5/tests/build/linkcheck/links.txt:5: ERROR: Unknown target name: "http://www.sphinx-doc.org/en/1.4.8/tutorial.html#install-sphinx".
  • error 2
  • /tmp/B.LL6W7F/BUILD/Sphinx-1.5.5/tests/build/linkcheck/links.txt:5: ERROR: Unknown target name: "http://www.sphinx-doc.org/en/1.4.8/tutorial.html#install-sphinx".
  • error 3
  • ! LaTeX Error: File `utf8x.def' not found.
  • error 4
  • ! LaTeX Error: File `utf8x.def' not found.
  • error 5
  • error: Bad exit status from /tmp/B.LL6W7F/BUILD/tmp/rpm-tmp.76567 (%build)
  • error 6
  • RPM build errors:
  • error 7
  • error: No files produced.

Content:

tests/test_directive_only.py .
tests/test_docutilsconf.py .......
tests/test_domain_cpp.py .............
tests/test_domain_js.py ...
tests/test_domain_py.py ....
tests/test_domain_rst.py .
tests/test_domain_std.py ..
tests/test_environment.py .....
tests/test_environment_indexentries.py ......
tests/test_environment_toctree.py .........
tests/test_ext_autodoc.py .
tests/test_ext_autosectionlabel.py .
tests/test_ext_autosummary.py ...
tests/test_ext_coverage.py .
tests/test_ext_doctest.py .
tests/test_ext_githubpages.py .
tests/test_ext_graphviz.py ...
tests/test_ext_ifconfig.py .
tests/test_ext_inheritance_diagram.py ...
tests/test_ext_intersphinx.py ..............
tests/test_ext_math.py .FF...
tests/test_ext_napoleon.py ................
tests/test_ext_napoleon_docstring.py ......................
tests/test_ext_napoleon_iterators.py ................
tests/test_ext_todo.py ..
tests/test_ext_viewcode.py ..
tests/test_highlighting.py ......
tests/test_intl.py ...........................................
tests/test_markup.py ................
tests/test_metadata.py .
tests/test_quickstart.py .........
tests/test_search.py ........
tests/test_searchadapters.py ss
tests/test_setup_command.py .....
tests/test_templating.py ..
tests/test_theming.py ...
tests/test_toctree.py ..
tests/test_util.py ...
tests/test_util_fileutil.py ..
tests/test_util_inspect.py ....
tests/test_util_jsdump.py .
tests/test_util_logging.py .
tests/test_util_matching.py ..
tests/test_util_nodes.py ........
tests/test_util_rst.py .
tests/test_versioning.py ..........
tests/test_websupport.py ...........
tests/test_writer_latex.py .

=================================== FAILURES ===================================
________________________________ test_defaults _________________________________

app = <SphinxTestApp buildername='linkcheck'>
status = <StringIO.StringIO instance at 0x7f7130715a70>
warning = <StringIO.StringIO instance at 0x7f7130715dd0>

    @pytest.mark.sphinx('linkcheck', testroot='linkcheck', freshenv=True)
    def test_defaults(app, status, warning):
        app.builder.build_all()
    
        assert (app.outdir / 'output.txt').exists()
        content = (app.outdir / 'output.txt').text()
    
        print(content)
        # looking for #top should fail
>       assert "Anchor 'top' not found" in content
E       assert "Anchor 'top' not found" in "links.txt:3: [broken] https://www.w3.org/TR/2006/REC-xml-names-20060816/#defaulting: HTTPSConnectionPool(host='www.w3... object at 0x7f71309e0f10>: Failed to establish a new connection: [Errno -3] Temporary failure in name resolution',))\n"

tests/test_build_linkcheck.py:25: AssertionError
----------------------------- Captured stdout call -----------------------------
links.txt:3: [broken] https://www.w3.org/TR/2006/REC-xml-names-20060816/#defaulting: HTTPSConnectionPool(host='www.w3.org', port=443): Max retries exceeded with url: /TR/2006/REC-xml-names-20060816/ (Caused by NewConnectionError('<requests.packages.urllib3.connection.VerifiedHTTPSConnection object at 0x7f71309e0c90>: Failed to establish a new connection: [Errno -3] Temporary failure in name resolution',))
links.txt:9: [broken] http://example.com/#!bar: HTTPConnectionPool(host='example.com', port=80): Max retries exceeded with url: / (Caused by NewConnectionError('<requests.packages.urllib3.connection.HTTPConnection object at 0x7f71309e0b50>: Failed to establish a new connection: [Errno -3] Temporary failure in name resolution',))
links.txt:11: [broken] http://example.com/#top: HTTPConnectionPool(host='example.com', port=80): Max retries exceeded with url: / (Caused by NewConnectionError('<requests.packages.urllib3.connection.HTTPConnection object at 0x7f71309e0110>: Failed to establish a new connection: [Errno -3] Temporary failure in name resolution',))
links.txt:10: [broken] http://example.com#!bar: HTTPConnectionPool(host='example.com', port=80): Max retries exceeded with url: / (Caused by NewConnectionError('<requests.packages.urllib3.connection.HTTPConnection object at 0x7f71309e0f10>: Failed to establish a new connection: [Errno -3] Temporary failure in name resolution',))

--------------------------- Captured stdout teardown ---------------------------
# testroot: linkcheck
# builder: linkcheck
# srcdir: /tmp/B.LL6W7F/BUILD/Sphinx-1.5.5/tests/build/linkcheck
# outdir: /tmp/B.LL6W7F/BUILD/Sphinx-1.5.5/tests/build/linkcheck/_build/linkcheck
# status: 
Running Sphinx v1.5.5
building [linkcheck]: all source files
updating environment: 1 added, 0 changed, 0 removed
reading sources... [100%] links                                                
looking for now-outdated files... none found
pickling environment... done
checking consistency... done
preparing documents... done
writing output... [100%] links                                                 
(line    3) broken    https://www.w3.org/TR/2006/REC-xml-names-20060816/#defaulting - HTTPSConnectionPool(host='www.w3.org', port=443): Max retries exceeded with url: /TR/2006/REC-xml-names-20060816/ (Caused by NewConnectionError('<requests.packages.urllib3.connection.VerifiedHTTPSConnection object at 0x7f71309e0c90>: Failed to establish a new connection: [Errno -3] Temporary failure in name resolution',))
(line    9) broken    http://example.com/#!bar - HTTPConnectionPool(host='example.com', port=80): Max retries exceeded with url: / (Caused by NewConnectionError('<requests.packages.urllib3.connection.HTTPConnection object at 0x7f71309e0b50>: Failed to establish a new connection: [Errno -3] Temporary failure in name resolution',))
(line   11) broken    http://example.com/#top - HTTPConnectionPool(host='example.com', port=80): Max retries exceeded with url: / (Caused by NewConnectionError('<requests.packages.urllib3.connection.HTTPConnection object at 0x7f71309e0110>: Failed to establish a new connection: [Errno -3] Temporary failure in name resolution',))
(line   10) broken    http://example.com#!bar - HTTPConnectionPool(host='example.com', port=80): Max retries exceeded with url: / (Caused by NewConnectionError('<requests.packages.urllib3.connection.HTTPConnection object at 0x7f71309e0f10>: Failed to establish a new connection: [Errno -3] Temporary failure in name resolution',))


# warning: 
/tmp/B.LL6W7F/BUILD/Sphinx-1.5.5/tests/build/linkcheck/links.txt:9: WARNING: Duplicate explicit target name: "example bar invalid".
/tmp/B.LL6W7F/BUILD/Sphinx-1.5.5/tests/build/linkcheck/links.txt:9: WARNING: Duplicate explicit target name: "example bar invalid".
/tmp/B.LL6W7F/BUILD/Sphinx-1.5.5/tests/build/linkcheck/links.txt:5: ERROR: Unknown target name: "http://www.sphinx-doc.org/en/1.4.8/tutorial.html#install-sphinx".

_____________________________ test_anchors_ignored _____________________________

app = <SphinxTestApp buildername='linkcheck'>
status = <StringIO.StringIO instance at 0x7f712fb0bfc8>
warning = <StringIO.StringIO instance at 0x7f712fb0bf38>

    @pytest.mark.sphinx(
        'linkcheck', testroot='linkcheck', freshenv=True,
        confoverrides={'linkcheck_anchors_ignore': ["^!", "^top$"]})
    def test_anchors_ignored(app, status, warning):
        app.builder.build_all()
    
        assert (app.outdir / 'output.txt').exists()
        content = (app.outdir / 'output.txt').text()
    
        # expect all ok when excluding #top
>       assert not content
E       assert not "links.txt:3: [broken] https://www.w3.org/TR/2006/REC-xml-names-20060816/#defaulting: HTTPSConnectionPool(host='www.w3... object at 0x7f713042ef90>: Failed to establish a new connection: [Errno -3] Temporary failure in name resolution',))\n"

tests/test_build_linkcheck.py:39: AssertionError
--------------------------- Captured stdout teardown ---------------------------
# testroot: linkcheck
# builder: linkcheck
# srcdir: /tmp/B.LL6W7F/BUILD/Sphinx-1.5.5/tests/build/linkcheck
# outdir: /tmp/B.LL6W7F/BUILD/Sphinx-1.5.5/tests/build/linkcheck/_build/linkcheck
# status: 
Running Sphinx v1.5.5
building [linkcheck]: all source files
updating environment: 1 added, 0 changed, 0 removed
reading sources... [100%] links                                                
looking for now-outdated files... none found
pickling environment... done
checking consistency... done
preparing documents... done
writing output... [100%] links                                                 
(line    3) broken    https://www.w3.org/TR/2006/REC-xml-names-20060816/#defaulting - HTTPSConnectionPool(host='www.w3.org', port=443): Max retries exceeded with url: /TR/2006/REC-xml-names-20060816/ (Caused by NewConnectionError('<requests.packages.urllib3.connection.VerifiedHTTPSConnection object at 0x7f71306780d0>: Failed to establish a new connection: [Errno -3] Temporary failure in name resolution',))
(line    9) broken    http://example.com/#!bar - HTTPConnectionPool(host='example.com', port=80): Max retries exceeded with url: / (Caused by NewConnectionError('<requests.packages.urllib3.connection.HTTPConnection object at 0x7f7130678090>: Failed to establish a new connection: [Errno -3] Temporary failure in name resolution',))
(line   11) broken    http://example.com/#top - HTTPConnectionPool(host='example.com', port=80): Max retries exceeded with url: / (Caused by NewConnectionError('<requests.packages.urllib3.connection.HTTPConnection object at 0x7f71305891d0>: Failed to establish a new connection: [Errno -3] Temporary failure in name resolution',))
(line   10) broken    http://example.com#!bar - HTTPConnectionPool(host='example.com', port=80): Max retries exceeded with url: / (Caused by NewConnectionError('<requests.packages.urllib3.connection.HTTPConnection object at 0x7f713042ef90>: Failed to establish a new connection: [Errno -3] Temporary failure in name resolution',))


# warning: 
/tmp/B.LL6W7F/BUILD/Sphinx-1.5.5/tests/build/linkcheck/links.txt:9: WARNING: Duplicate explicit target name: "example bar invalid".
/tmp/B.LL6W7F/BUILD/Sphinx-1.5.5/tests/build/linkcheck/links.txt:9: WARNING: Duplicate explicit target name: "example bar invalid".
/tmp/B.LL6W7F/BUILD/Sphinx-1.5.5/tests/build/linkcheck/links.txt:5: ERROR: Unknown target name: "http://www.sphinx-doc.org/en/1.4.8/tutorial.html#install-sphinx".

_______________________________ test_imgmath_png _______________________________

app = <SphinxTestApp buildername='html'>
status = <StringIO.StringIO instance at 0x7f71305728c0>
warning = <StringIO.StringIO instance at 0x7f7130572998>

    @pytest.mark.sphinx('html', testroot='ext-math-simple',
                        confoverrides = {'extensions': ['sphinx.ext.imgmath']})
    def test_imgmath_png(app, status, warning):
        app.builder.build_all()
        if "LaTeX command 'latex' cannot be run" in warning.getvalue():
            raise SkipTest('LaTeX command "latex" is not available')
        if "dvipng command 'dvipng' cannot be run" in warning.getvalue():
            raise SkipTest('dvipng command "dvipng" is not available')
    
        content = (app.outdir / 'index.html').text()
        html = ('<div class="math">\s*<p>\s*<img src="_images/math/\w+.png"'
                '\s*alt="a\^2\+b\^2=c\^2"/>\s*</p>\s*</div>')
>       assert re.search(html, content, re.S)
E       assert None
E        +  where None = <function search at 0x7f71426f5de8>('<div class="math">\\s*<p>\\s*<img src="_images/math/\\w+.png"\\s*alt="a\\^2\\+b\\^2=c\\^2"/>\\s*</p>\\s*</div>', '<!DOCTYPE html PUBLIC "-//W3C//DTD XHTML 1.0 Transitional//EN"\n  "http://www.w3.org/TR/xhtml1/DTD/xhtml1-transitional...    <a href="_sources/index.rst.txt"\n          rel="nofollow">Page source</a>\n    </div>\n\n    \n\n    \n  </body>\n</html>', 16)
E        +    where <function search at 0x7f71426f5de8> = re.search
E        +    and   16 = re.S

tests/test_ext_math.py:50: AssertionError
--------------------------- Captured stdout teardown ---------------------------
# testroot: ext-math-simple
# builder: html
# srcdir: /tmp/B.LL6W7F/BUILD/Sphinx-1.5.5/tests/build/ext-math-simple
# outdir: /tmp/B.LL6W7F/BUILD/Sphinx-1.5.5/tests/build/ext-math-simple/_build/html
# status: 
Running Sphinx v1.5.5
loading pickled environment... not yet created
building [html]: all source files
updating environment: 1 added, 0 changed, 0 removed
reading sources... [100%] index                                                
looking for now-outdated files... none found
pickling environment... done
checking consistency... done
preparing documents... done
writing output... [100%] index                                                 
generating indices... genindex
writing additional pages... search
copying static files... done
copying extra files... done
dumping search index in English (code: en) ... done
dumping object inventory... done

# warning: 
WARNING: inline latex u'a^2+b^2=c^2\n\n': latex exited with error
[stdout]
This is pdfTeXk, Version 3.1415926-1.40.9 (Web2C 7.5.7)
 %&-line parsing enabled.
entering extended mode
(./math.tex
LaTeX2e <2005/12/01>
Babel <v3.8l> and hyphenation patterns for english, usenglishmax, dumylang, noh
yphenation, german-x-2008-06-18, ngerman-x-2008-06-18, ancientgreek, ibycus, ar
abic, basque, bulgarian, catalan, pinyin, coptic, croatian, czech, danish, dutc
h, esperanto, estonian, farsi, finnish, french, galician, german, ngerman, mono
greek, greek, hungarian, icelandic, indonesian, interlingua, irish, italian, la
tin, mongolian, mongolian2a, bokmal, nynorsk, polish, portuguese, romanian, rus
sian, sanskrit, serbian, slovak, slovenian, spanish, swedish, turkish, ukenglis
h, ukrainian, uppersorbian, welsh, loaded.
(/usr/share/texmf-dist/tex/latex/base/article.cls
Document Class: article 2005/09/16 v1.4f Standard LaTeX document class
(/usr/share/texmf-dist/tex/latex/base/size12.clo))
(/usr/share/texmf-dist/tex/latex/base/inputenc.sty

! LaTeX Error: File `utf8x.def' not found.

Type X to quit or <RETURN> to proceed,
or enter new name. (Default extension: def)

Enter file name: 
! Emergency stop.
<read *> 
         
l.128 \endinput
               ^^M
No pages of output.
Transcript written on math.log.


_______________________________ test_imgmath_svg _______________________________

app = <SphinxTestApp buildername='html'>
status = <StringIO.StringIO instance at 0x7f713083a7e8>
warning = <StringIO.StringIO instance at 0x7f713083a320>

    @pytest.mark.sphinx('html', testroot='ext-math-simple',
                        confoverrides={'extensions': ['sphinx.ext.imgmath'],
                                       'imgmath_image_format': 'svg'})
    def test_imgmath_svg(app, status, warning):
        app.builder.build_all()
        if "LaTeX command 'latex' cannot be run" in warning.getvalue():
            raise SkipTest('LaTeX command "latex" is not available')
        if "dvisvgm command 'dvisvgm' cannot be run" in warning.getvalue():
            raise SkipTest('dvisvgm command "dvisvgm" is not available')
    
        content = (app.outdir / 'index.html').text()
        html = ('<div class="math">\s*<p>\s*<img src="_images/math/\w+.svg"'
                '\s*alt="a\^2\+b\^2=c\^2"/>\s*</p>\s*</div>')
>       assert re.search(html, content, re.S)
E       assert None
E        +  where None = <function search at 0x7f71426f5de8>('<div class="math">\\s*<p>\\s*<img src="_images/math/\\w+.svg"\\s*alt="a\\^2\\+b\\^2=c\\^2"/>\\s*</p>\\s*</div>', '<!DOCTYPE html PUBLIC "-//W3C//DTD XHTML 1.0 Transitional//EN"\n  "http://www.w3.org/TR/xhtml1/DTD/xhtml1-transitional...    <a href="_sources/index.rst.txt"\n          rel="nofollow">Page source</a>\n    </div>\n\n    \n\n    \n  </body>\n</html>', 16)
E        +    where <function search at 0x7f71426f5de8> = re.search
E        +    and   16 = re.S

tests/test_ext_math.py:66: AssertionError
--------------------------- Captured stdout teardown ---------------------------
# testroot: ext-math-simple
# builder: html
# srcdir: /tmp/B.LL6W7F/BUILD/Sphinx-1.5.5/tests/build/ext-math-simple
# outdir: /tmp/B.LL6W7F/BUILD/Sphinx-1.5.5/tests/build/ext-math-simple/_build/html
# status: 
Running Sphinx v1.5.5
loading pickled environment... done
building [html]: all source files
updating environment: 0 added, 0 changed, 0 removed
looking for now-outdated files... none found
preparing documents... done
writing output... [100%] index                                                 
generating indices... genindex
writing additional pages... search
copying static files... done
copying extra files... done
dumping search index in English (code: en) ... done
dumping object inventory... done

# warning: 
WARNING: inline latex u'a^2+b^2=c^2\n\n': latex exited with error
[stdout]
This is pdfTeXk, Version 3.1415926-1.40.9 (Web2C 7.5.7)
 %&-line parsing enabled.
entering extended mode
(./math.tex
LaTeX2e <2005/12/01>
Babel <v3.8l> and hyphenation patterns for english, usenglishmax, dumylang, noh
yphenation, german-x-2008-06-18, ngerman-x-2008-06-18, ancientgreek, ibycus, ar
abic, basque, bulgarian, catalan, pinyin, coptic, croatian, czech, danish, dutc
h, esperanto, estonian, farsi, finnish, french, galician, german, ngerman, mono
greek, greek, hungarian, icelandic, indonesian, interlingua, irish, italian, la
tin, mongolian, mongolian2a, bokmal, nynorsk, polish, portuguese, romanian, rus
sian, sanskrit, serbian, slovak, slovenian, spanish, swedish, turkish, ukenglis
h, ukrainian, uppersorbian, welsh, loaded.
(/usr/share/texmf-dist/tex/latex/base/article.cls
Document Class: article 2005/09/16 v1.4f Standard LaTeX document class
(/usr/share/texmf-dist/tex/latex/base/size12.clo))
(/usr/share/texmf-dist/tex/latex/base/inputenc.sty

! LaTeX Error: File `utf8x.def' not found.

Type X to quit or <RETURN> to proceed,
or enter new name. (Default extension: def)

Enter file name: 
! Emergency stop.
<read *> 
         
l.128 \endinput
               ^^M
No pages of output.
Transcript written on math.log.


============== 4 failed, 849 passed, 3 skipped in 117.85 seconds ===============
error: Bad exit status from /tmp/B.LL6W7F/BUILD/tmp/rpm-tmp.76567 (%build)


RPM build errors:
    Bad exit status from /tmp/B.LL6W7F/BUILD/tmp/rpm-tmp.76567 (%build)
ended at: Mon Apr 17 09:46:25 2017, done in 0:02:01.060320
error: No files produced.
mesg: ttyname failed: Inappropriate ioctl for device
+ chmod -R u+rwX /tmp/B.LL6W7F/BUILD
+ rm -rf /tmp/B.LL6W7F/tmp /tmp/B.LL6W7F/BUILD
mesg: ttyname failed: Inappropriate ioctl for device
+ rm -rf /tmp/B.LL6W7F
Begin-PLD-Builder-Info
Build-Time: user:99.38s sys:3.39s real:124.87s (faults io:0 non-io:430160)

End-PLD-Builder-Info
[Back to list of logs] [View rpm -qa of builder]