FailedOk

th/SRPMS[OK]
th/x32[OK]
th/i686[OK]
th/x86_64[OK]

ac/SRPMS[OK]
ac/i386[OK]
ac/i586[OK]
ac/i686[OK]
ac/alpha[OK]
ac/amd64[OK]
ac/athlon[OK]
ac/ppc[OK]
ac/sparc[OK]
ac/sparc64[OK]

Advanced Search
main()
Powered by PLD Linux
(c) 2002-2017 PLD Team
$Revision: 1.37 $
Powered by Unix conspiracy.
Your IP: 54.234.255.29

sphinx-pdg be445acd-f94b-432c-b869-c35e5457ac25

Status:Failed
Source URL:ftp://buildlogs.pld-linux.org/th/x86_64/FAIL/sphinx-pdg,be445acd-f94b-432c-b869-c35e5457ac25.bz2
text/plain URL:View!
rpm -qa of builder:View!
Date:2017/11/28 10:07:05
Runtime:0:02:01.983347

Toc:

  • prep
  • Executing(%prep): /bin/sh -e /tmp/B.p6BCGZ/BUILD/tmp/rpm-tmp.12083
  • build
  • Executing(%build): /bin/sh -e /tmp/B.p6BCGZ/BUILD/tmp/rpm-tmp.12083
  • error 1
  • /tmp/B.p6BCGZ/BUILD/Sphinx-1.5.5/tests/build/linkcheck/links.txt:5: ERROR: Unknown target name: "http://www.sphinx-doc.org/en/1.4.8/tutorial.html#install-sphinx".
  • error 2
  • /tmp/B.p6BCGZ/BUILD/Sphinx-1.5.5/tests/build/linkcheck/links.txt:5: ERROR: Unknown target name: "http://www.sphinx-doc.org/en/1.4.8/tutorial.html#install-sphinx".
  • error 3
  • error: Bad exit status from /tmp/B.p6BCGZ/BUILD/tmp/rpm-tmp.12083 (%build)
  • error 4
  • RPM build errors:
  • error 5
  • error: No files produced.

Content:

request from: baggins
checking if we should skip the build
started at: Tue Nov 28 10:04:56 2017
fetching https://srcbuilder.pld-linux.org/th//srpms/be445acd-f94b-432c-b869-c35e5457ac25/sphinx-pdg-1.5.5-1.src.rpm
fetched 4431527 bytes, 1045.4 K/s
installing srpm: sphinx-pdg-1.5.5-1.src.rpm
mesg: ttyname failed: Inappropriate ioctl for device
+ install -d /tmp/B.p6BCGZ/BUILD /tmp/B.p6BCGZ/RPMS
+ LC_ALL=en_US.UTF-8
+ rpm -qp --changelog sphinx-pdg-1.5.5-1.src.rpm
* Tue Nov 28 2017 PLD Linux Team <feedback@pld-linux.org>
- For complete changelog see: http://git.pld-linux.org/?p=packages/sphinx-pdg.git;a=log;h=master
* Mon Apr 24 2017 Jakub Bogusz <qboosh@pld-linux.org> af5ad52
- adjusted mock patch to prefer standalone module or strange py.test failures can happen if standalone mock is installed - more test BRs * Sun Apr 16 2017 Jakub Bogusz <qboosh@pld-linux.org> 4c3893b
- updated to 1.5.5 - removed obsolete docutils-0.13 patch - added deps patch (don't require mock and simplejson when not really required) - added tests patch (skip python3.5+ patch when running with python 2) - added mock patch (use unittest.mock instead of external module under python 3) - added tests bcond * Fri Jan 27 2017 Jan Rękorajski <baggins@pld-linux.org> 45b57c9
- fix interoperability with docutils 0.13 (https://github.com/sphinx-doc/sphinx/issues/3212) - rel 3 * Wed Dec 28 2016 Arkadiusz Miśkiewicz <arekm@maven.pl> fe6961e
- python 3.6 - release 2 (by relup.sh) + rpm -Uhv --nodeps --define '_topdir /tmp/B.p6BCGZ' --define '_specdir %{_topdir}' --define '_sourcedir %{_specdir}' --define '_rpmdir %{_topdir}/RPMS' --define '_builddir %{_topdir}/BUILD' sphinx-pdg-1.5.5-1.src.rpm Preparing... ################################################## sphinx-pdg ################################################## + rm -f sphinx-pdg-1.5.5-1.src.rpm mesg: ttyname failed: Inappropriate ioctl for device + install -m 700 -d /tmp/B.p6BCGZ/BUILD/tmp mesg: ttyname failed: Inappropriate ioctl for device + TMPDIR=/tmp/B.p6BCGZ/BUILD/tmp + exec nice -n 0 rpmbuild -bp --short-circuit --nodeps --define '_topdir /tmp/B.p6BCGZ' --define '_specdir %{_topdir}' --define '_sourcedir %{_specdir}' --define '_rpmdir %{_topdir}/RPMS' --define '_builddir %{_topdir}/BUILD' --target x86_64-pld-linux --define 'prep exit 0' /tmp/B.p6BCGZ/sphinx-pdg.spec Building target platforms: x86_64-pld-linux checking BuildConflict-ing packages no BuildConflicts found checking BR rpm: Building target platforms: x86_64-pld-linux no BR needed building RPM using: set -ex; : build-id: be445acd-f94b-432c-b869-c35e5457ac25; TMPDIR=/tmp/B.p6BCGZ/BUILD/tmp exec nice -n 0 rpmbuild -bb --define '_smp_mflags -j5' --define '_make_opts -Otarget' --define '_pld_builder 1' --define '_topdir /tmp/B.p6BCGZ' --define '_specdir %{_topdir}' --define '_sourcedir %{_specdir}' --define '_rpmdir %{_topdir}/RPMS' --define '_builddir %{_topdir}/BUILD' --target x86_64-pld-linux /tmp/B.p6BCGZ/sphinx-pdg.spec mesg: ttyname failed: Inappropriate ioctl for device + : build-id: be445acd-f94b-432c-b869-c35e5457ac25 + TMPDIR=/tmp/B.p6BCGZ/BUILD/tmp + exec nice -n 0 rpmbuild -bb --define '_smp_mflags -j5' --define '_make_opts -Otarget' --define '_pld_builder 1' --define '_topdir /tmp/B.p6BCGZ' --define '_specdir %{_topdir}' --define '_sourcedir %{_specdir}' --define '_rpmdir %{_topdir}/RPMS' --define '_builddir %{_topdir}/BUILD' --target x86_64-pld-linux /tmp/B.p6BCGZ/sphinx-pdg.spec Building target platforms: x86_64-pld-linux Executing(%prep): /bin/sh -e /tmp/B.p6BCGZ/BUILD/tmp/rpm-tmp.12083 + umask 022 + cd /tmp/B.p6BCGZ/BUILD + cd /tmp/B.p6BCGZ/BUILD + rm -rf Sphinx-1.5.5 + /usr/bin/gzip -dc /tmp/B.p6BCGZ/Sphinx-1.5.5.tar.gz + /bin/tar -xf - + STATUS=0 + '[' 0 -ne 0 ']' + cd Sphinx-1.5.5 + /bin/id -u + '[' 1000 '=' 0 ']' + /bin/id -u + '[' 1000 '=' 0 ']' + /bin/chmod -Rf a+rX,u+w,g-w,o-w . + echo 'Patch #0 (float-ver.patch):' Patch #0 (float-ver.patch): + '[' -f /tmp/B.p6BCGZ/float-ver.patch ']' + /bin/cat /tmp/B.p6BCGZ/float-ver.patch + /usr/bin/patch -s -p1 + echo 'Patch #1 (sphinx-pdg-deps.patch):' Patch #1 (sphinx-pdg-deps.patch): + '[' -f /tmp/B.p6BCGZ/sphinx-pdg-deps.patch ']' + /bin/cat /tmp/B.p6BCGZ/sphinx-pdg-deps.patch + /usr/bin/patch -s -p1 + echo 'Patch #2 (sphinx-pdg-tests.patch):' Patch #2 (sphinx-pdg-tests.patch): + '[' -f /tmp/B.p6BCGZ/sphinx-pdg-tests.patch ']' + /bin/cat /tmp/B.p6BCGZ/sphinx-pdg-tests.patch + /usr/bin/patch -s -p1 + echo 'Patch #3 (sphinx-pdg-mock.patch):' Patch #3 (sphinx-pdg-mock.patch): + '[' -f /tmp/B.p6BCGZ/sphinx-pdg-mock.patch ']' + /bin/cat /tmp/B.p6BCGZ/sphinx-pdg-mock.patch + /usr/bin/patch -s -p1 + /bin/rm '--interactive=never' tests/test_util_i18n.py + /bin/rm '--interactive=never' tests/test_build_latex.py + exit 0 Executing(%build): /bin/sh -e /tmp/B.p6BCGZ/BUILD/tmp/rpm-tmp.12083 TMP=/home/users/builder/tmp HOME=/home/users/builder PATH=/home/users/builder/GNUstep/Tools:/usr/local/bin:/usr/bin:/bin:/home/users/builder/bin TMPDIR=/tmp/B.p6BCGZ/BUILD/tmp + umask 022 + cd /tmp/B.p6BCGZ/BUILD + cd Sphinx-1.5.5 + LDFLAGS='-Wl,--as-needed -Wl,--no-copy-dt-needed-entries -Wl,-z,relro -Wl,-z,combreloc ' + export LDFLAGS + CFLAGS=' -O2 -fwrapv -pipe -Wformat -Werror=format-security -gdwarf-4 -fno-debug-types-section -fvar-tracking-assignments -g2 -Wp,-D_FORTIFY_SOURCE=2 -fstack-protector-strong --param=ssp-buffer-size=4 -fPIC -march=x86-64 -gdwarf-4 -fno-debug-types-section -fvar-tracking-assignments -g2 ' + export CFLAGS + CXXFLAGS=' -O2 -fwrapv -pipe -Wformat -Werror=format-security -gdwarf-4 -fno-debug-types-section -fvar-tracking-assignments -g2 -Wp,-D_FORTIFY_SOURCE=2 -fstack-protector-strong --param=ssp-buffer-size=4 -fPIC -march=x86-64 -gdwarf-4 -fno-debug-types-section -fvar-tracking-assignments -g2 ' + export CXXFLAGS + CC=x86_64-pld-linux-gcc + export CC + CXX=x86_64-pld-linux-g++ + export CXX + /usr/bin/python2 setup.py build '--build-base=build-2' running build running build_py creating build-2 creating build-2/lib creating build-2/lib/sphinx copying sphinx/__init__.py -> build-2/lib/sphinx copying sphinx/__main__.py -> build-2/lib/sphinx copying sphinx/addnodes.py -> build-2/lib/sphinx copying sphinx/apidoc.py -> build-2/lib/sphinx copying sphinx/application.py -> build-2/lib/sphinx copying sphinx/cmdline.py -> build-2/lib/sphinx copying sphinx/config.py -> build-2/lib/sphinx copying sphinx/deprecation.py -> build-2/lib/sphinx copying sphinx/errors.py -> build-2/lib/sphinx copying sphinx/highlighting.py -> build-2/lib/sphinx copying sphinx/io.py -> build-2/lib/sphinx copying sphinx/jinja2glue.py -> build-2/lib/sphinx copying sphinx/make_mode.py -> build-2/lib/sphinx copying sphinx/parsers.py -> build-2/lib/sphinx copying sphinx/pygments_styles.py -> build-2/lib/sphinx copying sphinx/quickstart.py -> build-2/lib/sphinx copying sphinx/roles.py -> build-2/lib/sphinx copying sphinx/setup_command.py -> build-2/lib/sphinx copying sphinx/theming.py -> build-2/lib/sphinx copying sphinx/versioning.py -> build-2/lib/sphinx creating build-2/lib/sphinx/builders copying sphinx/builders/__init__.py -> build-2/lib/sphinx/builders copying sphinx/builders/applehelp.py -> build-2/lib/sphinx/builders copying sphinx/builders/changes.py -> build-2/lib/sphinx/builders copying sphinx/builders/devhelp.py -> build-2/lib/sphinx/builders copying sphinx/builders/dummy.py -> build-2/lib/sphinx/builders copying sphinx/builders/epub.py -> build-2/lib/sphinx/builders copying sphinx/builders/epub3.py -> build-2/lib/sphinx/builders copying sphinx/builders/gettext.py -> build-2/lib/sphinx/builders copying sphinx/builders/html.py -> build-2/lib/sphinx/builders copying sphinx/builders/htmlhelp.py -> build-2/lib/sphinx/builders copying sphinx/builders/latex.py -> build-2/lib/sphinx/builders copying sphinx/builders/linkcheck.py -> build-2/lib/sphinx/builders copying sphinx/builders/manpage.py -> build-2/lib/sphinx/builders copying sphinx/builders/qthelp.py -> build-2/lib/sphinx/builders copying sphinx/builders/texinfo.py -> build-2/lib/sphinx/builders copying sphinx/builders/text.py -> build-2/lib/sphinx/builders copying sphinx/builders/websupport.py -> build-2/lib/sphinx/builders copying sphinx/builders/xml.py -> build-2/lib/sphinx/builders creating build-2/lib/sphinx/directives copying sphinx/directives/__init__.py -> build-2/lib/sphinx/directives copying sphinx/directives/code.py -> build-2/lib/sphinx/directives copying sphinx/directives/other.py -> build-2/lib/sphinx/directives copying sphinx/directives/patches.py -> build-2/lib/sphinx/directives creating build-2/lib/sphinx/domains copying sphinx/domains/__init__.py -> build-2/lib/sphinx/domains copying sphinx/domains/c.py -> build-2/lib/sphinx/domains copying sphinx/domains/cpp.py -> build-2/lib/sphinx/domains copying sphinx/domains/javascript.py -> build-2/lib/sphinx/domains copying sphinx/domains/python.py -> build-2/lib/sphinx/domains copying sphinx/domains/rst.py -> build-2/lib/sphinx/domains copying sphinx/domains/std.py -> build-2/lib/sphinx/domains creating build-2/lib/sphinx/environment copying sphinx/environment/__init__.py -> build-2/lib/sphinx/environment creating build-2/lib/sphinx/ext copying sphinx/ext/__init__.py -> build-2/lib/sphinx/ext copying sphinx/ext/autodoc.py -> build-2/lib/sphinx/ext copying sphinx/ext/autosectionlabel.py -> build-2/lib/sphinx/ext copying sphinx/ext/coverage.py -> build-2/lib/sphinx/ext copying sphinx/ext/doctest.py -> build-2/lib/sphinx/ext copying sphinx/ext/extlinks.py -> build-2/lib/sphinx/ext copying sphinx/ext/githubpages.py -> build-2/lib/sphinx/ext copying sphinx/ext/graphviz.py -> build-2/lib/sphinx/ext copying sphinx/ext/ifconfig.py -> build-2/lib/sphinx/ext copying sphinx/ext/imgmath.py -> build-2/lib/sphinx/ext copying sphinx/ext/inheritance_diagram.py -> build-2/lib/sphinx/ext copying sphinx/ext/intersphinx.py -> build-2/lib/sphinx/ext copying sphinx/ext/jsmath.py -> build-2/lib/sphinx/ext copying sphinx/ext/linkcode.py -> build-2/lib/sphinx/ext copying sphinx/ext/mathbase.py -> build-2/lib/sphinx/ext copying sphinx/ext/mathjax.py -> build-2/lib/sphinx/ext copying sphinx/ext/pngmath.py -> build-2/lib/sphinx/ext copying sphinx/ext/todo.py -> build-2/lib/sphinx/ext copying sphinx/ext/viewcode.py -> build-2/lib/sphinx/ext creating build-2/lib/sphinx/locale copying sphinx/locale/__init__.py -> build-2/lib/sphinx/locale creating build-2/lib/sphinx/pycode copying sphinx/pycode/__init__.py -> build-2/lib/sphinx/pycode copying sphinx/pycode/nodes.py -> build-2/lib/sphinx/pycode creating build-2/lib/sphinx/search copying sphinx/search/__init__.py -> build-2/lib/sphinx/search copying sphinx/search/da.py -> build-2/lib/sphinx/search copying sphinx/search/de.py -> build-2/lib/sphinx/search copying sphinx/search/en.py -> build-2/lib/sphinx/search copying sphinx/search/es.py -> build-2/lib/sphinx/search copying sphinx/search/fi.py -> build-2/lib/sphinx/search copying sphinx/search/fr.py -> build-2/lib/sphinx/search copying sphinx/search/hu.py -> build-2/lib/sphinx/search copying sphinx/search/it.py -> build-2/lib/sphinx/search copying sphinx/search/ja.py -> build-2/lib/sphinx/search copying sphinx/search/jssplitter.py -> build-2/lib/sphinx/search copying sphinx/search/nl.py -> build-2/lib/sphinx/search copying sphinx/search/no.py -> build-2/lib/sphinx/search copying sphinx/search/pt.py -> build-2/lib/sphinx/search copying sphinx/search/ro.py -> build-2/lib/sphinx/search copying sphinx/search/ru.py -> build-2/lib/sphinx/search copying sphinx/search/sv.py -> build-2/lib/sphinx/search copying sphinx/search/tr.py -> build-2/lib/sphinx/search copying sphinx/search/zh.py -> build-2/lib/sphinx/search creating build-2/lib/sphinx/transforms copying sphinx/transforms/__init__.py -> build-2/lib/sphinx/transforms copying sphinx/transforms/compact_bullet_list.py -> build-2/lib/sphinx/transforms copying sphinx/transforms/i18n.py -> build-2/lib/sphinx/transforms creating build-2/lib/sphinx/util copying sphinx/util/__init__.py -> build-2/lib/sphinx/util copying sphinx/util/compat.py -> build-2/lib/sphinx/util copying sphinx/util/console.py -> build-2/lib/sphinx/util copying sphinx/util/docfields.py -> build-2/lib/sphinx/util copying sphinx/util/docstrings.py -> build-2/lib/sphinx/util copying sphinx/util/docutils.py -> build-2/lib/sphinx/util copying sphinx/util/fileutil.py -> build-2/lib/sphinx/util copying sphinx/util/i18n.py -> build-2/lib/sphinx/util copying sphinx/util/images.py -> build-2/lib/sphinx/util copying sphinx/util/inspect.py -> build-2/lib/sphinx/util copying sphinx/util/jsdump.py -> build-2/lib/sphinx/util copying sphinx/util/jsonimpl.py -> build-2/lib/sphinx/util copying sphinx/util/logging.py -> build-2/lib/sphinx/util copying sphinx/util/matching.py -> build-2/lib/sphinx/util copying sphinx/util/nodes.py -> build-2/lib/sphinx/util copying sphinx/util/osutil.py -> build-2/lib/sphinx/util copying sphinx/util/parallel.py -> build-2/lib/sphinx/util copying sphinx/util/png.py -> build-2/lib/sphinx/util copying sphinx/util/pycompat.py -> build-2/lib/sphinx/util copying sphinx/util/requests.py -> build-2/lib/sphinx/util copying sphinx/util/rst.py -> build-2/lib/sphinx/util copying sphinx/util/smartypants.py -> build-2/lib/sphinx/util copying sphinx/util/stemmer.py -> build-2/lib/sphinx/util copying sphinx/util/tags.py -> build-2/lib/sphinx/util copying sphinx/util/template.py -> build-2/lib/sphinx/util copying sphinx/util/texescape.py -> build-2/lib/sphinx/util copying sphinx/util/websupport.py -> build-2/lib/sphinx/util creating build-2/lib/sphinx/websupport copying sphinx/websupport/__init__.py -> build-2/lib/sphinx/websupport copying sphinx/websupport/errors.py -> build-2/lib/sphinx/websupport creating build-2/lib/sphinx/writers copying sphinx/writers/__init__.py -> build-2/lib/sphinx/writers copying sphinx/writers/html.py -> build-2/lib/sphinx/writers copying sphinx/writers/latex.py -> build-2/lib/sphinx/writers copying sphinx/writers/manpage.py -> build-2/lib/sphinx/writers copying sphinx/writers/texinfo.py -> build-2/lib/sphinx/writers copying sphinx/writers/text.py -> build-2/lib/sphinx/writers copying sphinx/writers/websupport.py -> build-2/lib/sphinx/writers copying sphinx/writers/xml.py -> build-2/lib/sphinx/writers creating build-2/lib/sphinx/environment/managers copying sphinx/environment/managers/__init__.py -> build-2/lib/sphinx/environment/managers copying sphinx/environment/managers/indexentries.py -> build-2/lib/sphinx/environment/managers copying sphinx/environment/managers/toctree.py -> build-2/lib/sphinx/environment/managers creating build-2/lib/sphinx/ext/autosummary copying sphinx/ext/autosummary/__init__.py -> build-2/lib/sphinx/ext/autosummary copying sphinx/ext/autosummary/generate.py -> build-2/lib/sphinx/ext/autosummary creating build-2/lib/sphinx/ext/napoleon copying sphinx/ext/napoleon/__init__.py -> build-2/lib/sphinx/ext/napoleon copying sphinx/ext/napoleon/docstring.py -> build-2/lib/sphinx/ext/napoleon copying sphinx/ext/napoleon/iterators.py -> build-2/lib/sphinx/ext/napoleon creating build-2/lib/sphinx/pycode/pgen2 copying sphinx/pycode/pgen2/__init__.py -> build-2/lib/sphinx/pycode/pgen2 copying sphinx/pycode/pgen2/driver.py -> build-2/lib/sphinx/pycode/pgen2 copying sphinx/pycode/pgen2/grammar.py -> build-2/lib/sphinx/pycode/pgen2 copying sphinx/pycode/pgen2/literals.py -> build-2/lib/sphinx/pycode/pgen2 copying sphinx/pycode/pgen2/parse.py -> build-2/lib/sphinx/pycode/pgen2 copying sphinx/pycode/pgen2/pgen.py -> build-2/lib/sphinx/pycode/pgen2 copying sphinx/pycode/pgen2/token.py -> build-2/lib/sphinx/pycode/pgen2 copying sphinx/pycode/pgen2/tokenize.py -> build-2/lib/sphinx/pycode/pgen2 creating build-2/lib/sphinx/websupport/search copying sphinx/websupport/search/__init__.py -> build-2/lib/sphinx/websupport/search copying sphinx/websupport/search/nullsearch.py -> build-2/lib/sphinx/websupport/search copying sphinx/websupport/search/whooshsearch.py -> build-2/lib/sphinx/websupport/search copying sphinx/websupport/search/xapiansearch.py -> build-2/lib/sphinx/websupport/search creating build-2/lib/sphinx/websupport/storage copying sphinx/websupport/storage/__init__.py -> build-2/lib/sphinx/websupport/storage copying sphinx/websupport/storage/differ.py -> build-2/lib/sphinx/websupport/storage copying sphinx/websupport/storage/sqlalchemy_db.py -> build-2/lib/sphinx/websupport/storage copying sphinx/websupport/storage/sqlalchemystorage.py -> build-2/lib/sphinx/websupport/storage running egg_info writing requirements to Sphinx.egg-info/requires.txt writing Sphinx.egg-info/PKG-INFO writing top-level names to Sphinx.egg-info/top_level.txt writing dependency_links to Sphinx.egg-info/dependency_links.txt writing entry points to Sphinx.egg-info/entry_points.txt reading manifest file 'Sphinx.egg-info/SOURCES.txt' 'tests/roots/test-image-glob/testimäge.png' not ANSI_X3.4-1968 encodable -- skipping reading manifest template 'MANIFEST.in' warning: no files found matching 'sphinx/locale/.tx/config' 'tests/roots/test-image-glob/testimäge.png' not ANSI_X3.4-1968 encodable -- skipping no previously-included directories found matching 'doc/_build' no previously-included directories found matching 'sphinx/locale/.tx' writing manifest file 'Sphinx.egg-info/SOURCES.txt' creating build-2/lib/sphinx/templates creating build-2/lib/sphinx/templates/latex copying sphinx/templates/latex/content.tex_t -> build-2/lib/sphinx/templates/latex creating build-2/lib/sphinx/templates/quickstart copying sphinx/templates/quickstart/Makefile.new_t -> build-2/lib/sphinx/templates/quickstart copying sphinx/templates/quickstart/Makefile_t -> build-2/lib/sphinx/templates/quickstart copying sphinx/templates/quickstart/conf.py_t -> build-2/lib/sphinx/templates/quickstart copying sphinx/templates/quickstart/make.bat.new_t -> build-2/lib/sphinx/templates/quickstart copying sphinx/templates/quickstart/make.bat_t -> build-2/lib/sphinx/templates/quickstart copying sphinx/templates/quickstart/master_doc.rst_t -> build-2/lib/sphinx/templates/quickstart creating build-2/lib/sphinx/texinputs copying sphinx/texinputs/Makefile_t -> build-2/lib/sphinx/texinputs copying sphinx/texinputs/footnotehyper-sphinx.sty -> build-2/lib/sphinx/texinputs copying sphinx/texinputs/needspace.sty -> build-2/lib/sphinx/texinputs copying sphinx/texinputs/python.ist -> build-2/lib/sphinx/texinputs copying sphinx/texinputs/sphinx.sty -> build-2/lib/sphinx/texinputs copying sphinx/texinputs/sphinxhowto.cls -> build-2/lib/sphinx/texinputs copying sphinx/texinputs/sphinxmanual.cls -> build-2/lib/sphinx/texinputs creating build-2/lib/sphinx/themes creating build-2/lib/sphinx/themes/agogo copying sphinx/themes/agogo/layout.html -> build-2/lib/sphinx/themes/agogo copying sphinx/themes/agogo/theme.conf -> build-2/lib/sphinx/themes/agogo creating build-2/lib/sphinx/themes/agogo/static copying sphinx/themes/agogo/static/agogo.css_t -> build-2/lib/sphinx/themes/agogo/static copying sphinx/themes/agogo/static/bgfooter.png -> build-2/lib/sphinx/themes/agogo/static copying sphinx/themes/agogo/static/bgtop.png -> build-2/lib/sphinx/themes/agogo/static creating build-2/lib/sphinx/themes/basic copying sphinx/themes/basic/defindex.html -> build-2/lib/sphinx/themes/basic copying sphinx/themes/basic/domainindex.html -> build-2/lib/sphinx/themes/basic copying sphinx/themes/basic/genindex-single.html -> build-2/lib/sphinx/themes/basic copying sphinx/themes/basic/genindex-split.html -> build-2/lib/sphinx/themes/basic copying sphinx/themes/basic/genindex.html -> build-2/lib/sphinx/themes/basic copying sphinx/themes/basic/globaltoc.html -> build-2/lib/sphinx/themes/basic copying sphinx/themes/basic/layout.html -> build-2/lib/sphinx/themes/basic copying sphinx/themes/basic/localtoc.html -> build-2/lib/sphinx/themes/basic copying sphinx/themes/basic/opensearch.xml -> build-2/lib/sphinx/themes/basic copying sphinx/themes/basic/page.html -> build-2/lib/sphinx/themes/basic copying sphinx/themes/basic/relations.html -> build-2/lib/sphinx/themes/basic copying sphinx/themes/basic/search.html -> build-2/lib/sphinx/themes/basic copying sphinx/themes/basic/searchbox.html -> build-2/lib/sphinx/themes/basic copying sphinx/themes/basic/searchresults.html -> build-2/lib/sphinx/themes/basic copying sphinx/themes/basic/sourcelink.html -> build-2/lib/sphinx/themes/basic copying sphinx/themes/basic/theme.conf -> build-2/lib/sphinx/themes/basic creating build-2/lib/sphinx/themes/basic/changes copying sphinx/themes/basic/changes/frameset.html -> build-2/lib/sphinx/themes/basic/changes copying sphinx/themes/basic/changes/rstsource.html -> build-2/lib/sphinx/themes/basic/changes copying sphinx/themes/basic/changes/versionchanges.html -> build-2/lib/sphinx/themes/basic/changes creating build-2/lib/sphinx/themes/basic/static copying sphinx/themes/basic/static/ajax-loader.gif -> build-2/lib/sphinx/themes/basic/static copying sphinx/themes/basic/static/basic.css_t -> build-2/lib/sphinx/themes/basic/static copying sphinx/themes/basic/static/comment-bright.png -> build-2/lib/sphinx/themes/basic/static copying sphinx/themes/basic/static/comment-close.png -> build-2/lib/sphinx/themes/basic/static copying sphinx/themes/basic/static/comment.png -> build-2/lib/sphinx/themes/basic/static copying sphinx/themes/basic/static/doctools.js_t -> build-2/lib/sphinx/themes/basic/static copying sphinx/themes/basic/static/down-pressed.png -> build-2/lib/sphinx/themes/basic/static copying sphinx/themes/basic/static/down.png -> build-2/lib/sphinx/themes/basic/static copying sphinx/themes/basic/static/file.png -> build-2/lib/sphinx/themes/basic/static copying sphinx/themes/basic/static/jquery-3.1.0.js -> build-2/lib/sphinx/themes/basic/static copying sphinx/themes/basic/static/jquery.js -> build-2/lib/sphinx/themes/basic/static copying sphinx/themes/basic/static/minus.png -> build-2/lib/sphinx/themes/basic/static copying sphinx/themes/basic/static/plus.png -> build-2/lib/sphinx/themes/basic/static copying sphinx/themes/basic/static/searchtools.js_t -> build-2/lib/sphinx/themes/basic/static copying sphinx/themes/basic/static/underscore-1.3.1.js -> build-2/lib/sphinx/themes/basic/static copying sphinx/themes/basic/static/underscore.js -> build-2/lib/sphinx/themes/basic/static copying sphinx/themes/basic/static/up-pressed.png -> build-2/lib/sphinx/themes/basic/static copying sphinx/themes/basic/static/up.png -> build-2/lib/sphinx/themes/basic/static copying sphinx/themes/basic/static/websupport.js -> build-2/lib/sphinx/themes/basic/static creating build-2/lib/sphinx/themes/bizstyle copying sphinx/themes/bizstyle/layout.html -> build-2/lib/sphinx/themes/bizstyle copying sphinx/themes/bizstyle/theme.conf -> build-2/lib/sphinx/themes/bizstyle creating build-2/lib/sphinx/themes/bizstyle/static copying sphinx/themes/bizstyle/static/background_b01.png -> build-2/lib/sphinx/themes/bizstyle/static copying sphinx/themes/bizstyle/static/bizstyle.css_t -> build-2/lib/sphinx/themes/bizstyle/static copying sphinx/themes/bizstyle/static/bizstyle.js_t -> build-2/lib/sphinx/themes/bizstyle/static copying sphinx/themes/bizstyle/static/css3-mediaqueries.js -> build-2/lib/sphinx/themes/bizstyle/static copying sphinx/themes/bizstyle/static/css3-mediaqueries_src.js -> build-2/lib/sphinx/themes/bizstyle/static creating build-2/lib/sphinx/themes/classic copying sphinx/themes/classic/layout.html -> build-2/lib/sphinx/themes/classic copying sphinx/themes/classic/theme.conf -> build-2/lib/sphinx/themes/classic creating build-2/lib/sphinx/themes/classic/static copying sphinx/themes/classic/static/classic.css_t -> build-2/lib/sphinx/themes/classic/static copying sphinx/themes/classic/static/sidebar.js_t -> build-2/lib/sphinx/themes/classic/static creating build-2/lib/sphinx/themes/default copying sphinx/themes/default/theme.conf -> build-2/lib/sphinx/themes/default creating build-2/lib/sphinx/themes/default/static copying sphinx/themes/default/static/default.css -> build-2/lib/sphinx/themes/default/static creating build-2/lib/sphinx/themes/epub copying sphinx/themes/epub/epub-cover.html -> build-2/lib/sphinx/themes/epub copying sphinx/themes/epub/layout.html -> build-2/lib/sphinx/themes/epub copying sphinx/themes/epub/theme.conf -> build-2/lib/sphinx/themes/epub creating build-2/lib/sphinx/themes/epub/static copying sphinx/themes/epub/static/epub.css_t -> build-2/lib/sphinx/themes/epub/static creating build-2/lib/sphinx/themes/haiku copying sphinx/themes/haiku/layout.html -> build-2/lib/sphinx/themes/haiku copying sphinx/themes/haiku/theme.conf -> build-2/lib/sphinx/themes/haiku creating build-2/lib/sphinx/themes/haiku/static copying sphinx/themes/haiku/static/alert_info_32.png -> build-2/lib/sphinx/themes/haiku/static copying sphinx/themes/haiku/static/alert_warning_32.png -> build-2/lib/sphinx/themes/haiku/static copying sphinx/themes/haiku/static/bg-page.png -> build-2/lib/sphinx/themes/haiku/static copying sphinx/themes/haiku/static/bullet_orange.png -> build-2/lib/sphinx/themes/haiku/static copying sphinx/themes/haiku/static/haiku.css_t -> build-2/lib/sphinx/themes/haiku/static creating build-2/lib/sphinx/themes/nature copying sphinx/themes/nature/theme.conf -> build-2/lib/sphinx/themes/nature creating build-2/lib/sphinx/themes/nature/static copying sphinx/themes/nature/static/nature.css_t -> build-2/lib/sphinx/themes/nature/static creating build-2/lib/sphinx/themes/nonav copying sphinx/themes/nonav/layout.html -> build-2/lib/sphinx/themes/nonav copying sphinx/themes/nonav/theme.conf -> build-2/lib/sphinx/themes/nonav creating build-2/lib/sphinx/themes/nonav/static copying sphinx/themes/nonav/static/nonav.css -> build-2/lib/sphinx/themes/nonav/static creating build-2/lib/sphinx/themes/pyramid copying sphinx/themes/pyramid/layout.html -> build-2/lib/sphinx/themes/pyramid copying sphinx/themes/pyramid/theme.conf -> build-2/lib/sphinx/themes/pyramid creating build-2/lib/sphinx/themes/pyramid/static copying sphinx/themes/pyramid/static/dialog-note.png -> build-2/lib/sphinx/themes/pyramid/static copying sphinx/themes/pyramid/static/dialog-seealso.png -> build-2/lib/sphinx/themes/pyramid/static copying sphinx/themes/pyramid/static/dialog-todo.png -> build-2/lib/sphinx/themes/pyramid/static copying sphinx/themes/pyramid/static/dialog-topic.png -> build-2/lib/sphinx/themes/pyramid/static copying sphinx/themes/pyramid/static/dialog-warning.png -> build-2/lib/sphinx/themes/pyramid/static copying sphinx/themes/pyramid/static/epub.css -> build-2/lib/sphinx/themes/pyramid/static copying sphinx/themes/pyramid/static/footerbg.png -> build-2/lib/sphinx/themes/pyramid/static copying sphinx/themes/pyramid/static/headerbg.png -> build-2/lib/sphinx/themes/pyramid/static copying sphinx/themes/pyramid/static/ie6.css -> build-2/lib/sphinx/themes/pyramid/static copying sphinx/themes/pyramid/static/middlebg.png -> build-2/lib/sphinx/themes/pyramid/static copying sphinx/themes/pyramid/static/pyramid.css_t -> build-2/lib/sphinx/themes/pyramid/static copying sphinx/themes/pyramid/static/transparent.gif -> build-2/lib/sphinx/themes/pyramid/static creating build-2/lib/sphinx/themes/scrolls copying sphinx/themes/scrolls/layout.html -> build-2/lib/sphinx/themes/scrolls copying sphinx/themes/scrolls/theme.conf -> build-2/lib/sphinx/themes/scrolls creating build-2/lib/sphinx/themes/scrolls/artwork copying sphinx/themes/scrolls/artwork/logo.svg -> build-2/lib/sphinx/themes/scrolls/artwork creating build-2/lib/sphinx/themes/scrolls/static copying sphinx/themes/scrolls/static/darkmetal.png -> build-2/lib/sphinx/themes/scrolls/static copying sphinx/themes/scrolls/static/headerbg.png -> build-2/lib/sphinx/themes/scrolls/static copying sphinx/themes/scrolls/static/logo.png -> build-2/lib/sphinx/themes/scrolls/static copying sphinx/themes/scrolls/static/metal.png -> build-2/lib/sphinx/themes/scrolls/static copying sphinx/themes/scrolls/static/navigation.png -> build-2/lib/sphinx/themes/scrolls/static copying sphinx/themes/scrolls/static/print.css -> build-2/lib/sphinx/themes/scrolls/static copying sphinx/themes/scrolls/static/scrolls.css_t -> build-2/lib/sphinx/themes/scrolls/static copying sphinx/themes/scrolls/static/theme_extras.js -> build-2/lib/sphinx/themes/scrolls/static copying sphinx/themes/scrolls/static/watermark.png -> build-2/lib/sphinx/themes/scrolls/static copying sphinx/themes/scrolls/static/watermark_blur.png -> build-2/lib/sphinx/themes/scrolls/static creating build-2/lib/sphinx/themes/sphinxdoc copying sphinx/themes/sphinxdoc/layout.html -> build-2/lib/sphinx/themes/sphinxdoc copying sphinx/themes/sphinxdoc/theme.conf -> build-2/lib/sphinx/themes/sphinxdoc creating build-2/lib/sphinx/themes/sphinxdoc/static copying sphinx/themes/sphinxdoc/static/contents.png -> build-2/lib/sphinx/themes/sphinxdoc/static copying sphinx/themes/sphinxdoc/static/navigation.png -> build-2/lib/sphinx/themes/sphinxdoc/static copying sphinx/themes/sphinxdoc/static/sphinxdoc.css_t -> build-2/lib/sphinx/themes/sphinxdoc/static creating build-2/lib/sphinx/themes/traditional copying sphinx/themes/traditional/theme.conf -> build-2/lib/sphinx/themes/traditional creating build-2/lib/sphinx/themes/traditional/static copying sphinx/themes/traditional/static/traditional.css_t -> build-2/lib/sphinx/themes/traditional/static copying sphinx/locale/sphinx.pot -> build-2/lib/sphinx/locale creating build-2/lib/sphinx/locale/bn creating build-2/lib/sphinx/locale/bn/LC_MESSAGES copying sphinx/locale/bn/LC_MESSAGES/sphinx.js -> build-2/lib/sphinx/locale/bn/LC_MESSAGES copying sphinx/locale/bn/LC_MESSAGES/sphinx.mo -> build-2/lib/sphinx/locale/bn/LC_MESSAGES copying sphinx/locale/bn/LC_MESSAGES/sphinx.po -> build-2/lib/sphinx/locale/bn/LC_MESSAGES creating build-2/lib/sphinx/locale/ca creating build-2/lib/sphinx/locale/ca/LC_MESSAGES copying sphinx/locale/ca/LC_MESSAGES/sphinx.js -> build-2/lib/sphinx/locale/ca/LC_MESSAGES copying sphinx/locale/ca/LC_MESSAGES/sphinx.mo -> build-2/lib/sphinx/locale/ca/LC_MESSAGES copying sphinx/locale/ca/LC_MESSAGES/sphinx.po -> build-2/lib/sphinx/locale/ca/LC_MESSAGES creating build-2/lib/sphinx/locale/cs creating build-2/lib/sphinx/locale/cs/LC_MESSAGES copying sphinx/locale/cs/LC_MESSAGES/sphinx.js -> build-2/lib/sphinx/locale/cs/LC_MESSAGES copying sphinx/locale/cs/LC_MESSAGES/sphinx.mo -> build-2/lib/sphinx/locale/cs/LC_MESSAGES copying sphinx/locale/cs/LC_MESSAGES/sphinx.po -> build-2/lib/sphinx/locale/cs/LC_MESSAGES creating build-2/lib/sphinx/locale/cy creating build-2/lib/sphinx/locale/cy/LC_MESSAGES copying sphinx/locale/cy/LC_MESSAGES/sphinx.js -> build-2/lib/sphinx/locale/cy/LC_MESSAGES copying sphinx/locale/cy/LC_MESSAGES/sphinx.mo -> build-2/lib/sphinx/locale/cy/LC_MESSAGES copying sphinx/locale/cy/LC_MESSAGES/sphinx.po -> build-2/lib/sphinx/locale/cy/LC_MESSAGES creating build-2/lib/sphinx/locale/da creating build-2/lib/sphinx/locale/da/LC_MESSAGES copying sphinx/locale/da/LC_MESSAGES/sphinx.js -> build-2/lib/sphinx/locale/da/LC_MESSAGES copying sphinx/locale/da/LC_MESSAGES/sphinx.mo -> build-2/lib/sphinx/locale/da/LC_MESSAGES copying sphinx/locale/da/LC_MESSAGES/sphinx.po -> build-2/lib/sphinx/locale/da/LC_MESSAGES creating build-2/lib/sphinx/locale/de creating build-2/lib/sphinx/locale/de/LC_MESSAGES copying sphinx/locale/de/LC_MESSAGES/sphinx.js -> build-2/lib/sphinx/locale/de/LC_MESSAGES copying sphinx/locale/de/LC_MESSAGES/sphinx.mo -> build-2/lib/sphinx/locale/de/LC_MESSAGES copying sphinx/locale/de/LC_MESSAGES/sphinx.po -> build-2/lib/sphinx/locale/de/LC_MESSAGES creating build-2/lib/sphinx/locale/el creating build-2/lib/sphinx/locale/el/LC_MESSAGES copying sphinx/locale/el/LC_MESSAGES/sphinx.js -> build-2/lib/sphinx/locale/el/LC_MESSAGES copying sphinx/locale/el/LC_MESSAGES/sphinx.mo -> build-2/lib/sphinx/locale/el/LC_MESSAGES copying sphinx/locale/el/LC_MESSAGES/sphinx.po -> build-2/lib/sphinx/locale/el/LC_MESSAGES creating build-2/lib/sphinx/locale/eo creating build-2/lib/sphinx/locale/eo/LC_MESSAGES copying sphinx/locale/eo/LC_MESSAGES/sphinx.js -> build-2/lib/sphinx/locale/eo/LC_MESSAGES copying sphinx/locale/eo/LC_MESSAGES/sphinx.mo -> build-2/lib/sphinx/locale/eo/LC_MESSAGES copying sphinx/locale/eo/LC_MESSAGES/sphinx.po -> build-2/lib/sphinx/locale/eo/LC_MESSAGES creating build-2/lib/sphinx/locale/es creating build-2/lib/sphinx/locale/es/LC_MESSAGES copying sphinx/locale/es/LC_MESSAGES/sphinx.js -> build-2/lib/sphinx/locale/es/LC_MESSAGES copying sphinx/locale/es/LC_MESSAGES/sphinx.mo -> build-2/lib/sphinx/locale/es/LC_MESSAGES copying sphinx/locale/es/LC_MESSAGES/sphinx.po -> build-2/lib/sphinx/locale/es/LC_MESSAGES creating build-2/lib/sphinx/locale/et creating build-2/lib/sphinx/locale/et/LC_MESSAGES copying sphinx/locale/et/LC_MESSAGES/sphinx.js -> build-2/lib/sphinx/locale/et/LC_MESSAGES copying sphinx/locale/et/LC_MESSAGES/sphinx.mo -> build-2/lib/sphinx/locale/et/LC_MESSAGES copying sphinx/locale/et/LC_MESSAGES/sphinx.po -> build-2/lib/sphinx/locale/et/LC_MESSAGES creating build-2/lib/sphinx/locale/eu creating build-2/lib/sphinx/locale/eu/LC_MESSAGES copying sphinx/locale/eu/LC_MESSAGES/sphinx.js -> build-2/lib/sphinx/locale/eu/LC_MESSAGES copying sphinx/locale/eu/LC_MESSAGES/sphinx.mo -> build-2/lib/sphinx/locale/eu/LC_MESSAGES copying sphinx/locale/eu/LC_MESSAGES/sphinx.po -> build-2/lib/sphinx/locale/eu/LC_MESSAGES creating build-2/lib/sphinx/locale/fa creating build-2/lib/sphinx/locale/fa/LC_MESSAGES copying sphinx/locale/fa/LC_MESSAGES/sphinx.js -> build-2/lib/sphinx/locale/fa/LC_MESSAGES copying sphinx/locale/fa/LC_MESSAGES/sphinx.mo -> build-2/lib/sphinx/locale/fa/LC_MESSAGES copying sphinx/locale/fa/LC_MESSAGES/sphinx.po -> build-2/lib/sphinx/locale/fa/LC_MESSAGES creating build-2/lib/sphinx/locale/fi creating build-2/lib/sphinx/locale/fi/LC_MESSAGES copying sphinx/locale/fi/LC_MESSAGES/sphinx.js -> build-2/lib/sphinx/locale/fi/LC_MESSAGES copying sphinx/locale/fi/LC_MESSAGES/sphinx.mo -> build-2/lib/sphinx/locale/fi/LC_MESSAGES copying sphinx/locale/fi/LC_MESSAGES/sphinx.po -> build-2/lib/sphinx/locale/fi/LC_MESSAGES creating build-2/lib/sphinx/locale/fr creating build-2/lib/sphinx/locale/fr/LC_MESSAGES copying sphinx/locale/fr/LC_MESSAGES/sphinx.js -> build-2/lib/sphinx/locale/fr/LC_MESSAGES copying sphinx/locale/fr/LC_MESSAGES/sphinx.mo -> build-2/lib/sphinx/locale/fr/LC_MESSAGES copying sphinx/locale/fr/LC_MESSAGES/sphinx.po -> build-2/lib/sphinx/locale/fr/LC_MESSAGES creating build-2/lib/sphinx/locale/he creating build-2/lib/sphinx/locale/he/LC_MESSAGES copying sphinx/locale/he/LC_MESSAGES/sphinx.js -> build-2/lib/sphinx/locale/he/LC_MESSAGES copying sphinx/locale/he/LC_MESSAGES/sphinx.mo -> build-2/lib/sphinx/locale/he/LC_MESSAGES copying sphinx/locale/he/LC_MESSAGES/sphinx.po -> build-2/lib/sphinx/locale/he/LC_MESSAGES creating build-2/lib/sphinx/locale/hi creating build-2/lib/sphinx/locale/hi/LC_MESSAGES copying sphinx/locale/hi/LC_MESSAGES/sphinx.js -> build-2/lib/sphinx/locale/hi/LC_MESSAGES copying sphinx/locale/hi/LC_MESSAGES/sphinx.mo -> build-2/lib/sphinx/locale/hi/LC_MESSAGES copying sphinx/locale/hi/LC_MESSAGES/sphinx.po -> build-2/lib/sphinx/locale/hi/LC_MESSAGES creating build-2/lib/sphinx/locale/hr creating build-2/lib/sphinx/locale/hr/LC_MESSAGES copying sphinx/locale/hr/LC_MESSAGES/sphinx.js -> build-2/lib/sphinx/locale/hr/LC_MESSAGES copying sphinx/locale/hr/LC_MESSAGES/sphinx.mo -> build-2/lib/sphinx/locale/hr/LC_MESSAGES copying sphinx/locale/hr/LC_MESSAGES/sphinx.po -> build-2/lib/sphinx/locale/hr/LC_MESSAGES creating build-2/lib/sphinx/locale/hu creating build-2/lib/sphinx/locale/hu/LC_MESSAGES copying sphinx/locale/hu/LC_MESSAGES/sphinx.js -> build-2/lib/sphinx/locale/hu/LC_MESSAGES copying sphinx/locale/hu/LC_MESSAGES/sphinx.mo -> build-2/lib/sphinx/locale/hu/LC_MESSAGES copying sphinx/locale/hu/LC_MESSAGES/sphinx.po -> build-2/lib/sphinx/locale/hu/LC_MESSAGES creating build-2/lib/sphinx/locale/id creating build-2/lib/sphinx/locale/id/LC_MESSAGES copying sphinx/locale/id/LC_MESSAGES/sphinx.js -> build-2/lib/sphinx/locale/id/LC_MESSAGES copying sphinx/locale/id/LC_MESSAGES/sphinx.mo -> build-2/lib/sphinx/locale/id/LC_MESSAGES copying sphinx/locale/id/LC_MESSAGES/sphinx.po -> build-2/lib/sphinx/locale/id/LC_MESSAGES creating build-2/lib/sphinx/locale/it creating build-2/lib/sphinx/locale/it/LC_MESSAGES copying sphinx/locale/it/LC_MESSAGES/sphinx.js -> build-2/lib/sphinx/locale/it/LC_MESSAGES copying sphinx/locale/it/LC_MESSAGES/sphinx.mo -> build-2/lib/sphinx/locale/it/LC_MESSAGES copying sphinx/locale/it/LC_MESSAGES/sphinx.po -> build-2/lib/sphinx/locale/it/LC_MESSAGES creating build-2/lib/sphinx/locale/ja creating build-2/lib/sphinx/locale/ja/LC_MESSAGES copying sphinx/locale/ja/LC_MESSAGES/sphinx.js -> build-2/lib/sphinx/locale/ja/LC_MESSAGES copying sphinx/locale/ja/LC_MESSAGES/sphinx.mo -> build-2/lib/sphinx/locale/ja/LC_MESSAGES copying sphinx/locale/ja/LC_MESSAGES/sphinx.po -> build-2/lib/sphinx/locale/ja/LC_MESSAGES creating build-2/lib/sphinx/locale/ko creating build-2/lib/sphinx/locale/ko/LC_MESSAGES copying sphinx/locale/ko/LC_MESSAGES/sphinx.js -> build-2/lib/sphinx/locale/ko/LC_MESSAGES copying sphinx/locale/ko/LC_MESSAGES/sphinx.mo -> build-2/lib/sphinx/locale/ko/LC_MESSAGES copying sphinx/locale/ko/LC_MESSAGES/sphinx.po -> build-2/lib/sphinx/locale/ko/LC_MESSAGES creating build-2/lib/sphinx/locale/lt creating build-2/lib/sphinx/locale/lt/LC_MESSAGES copying sphinx/locale/lt/LC_MESSAGES/sphinx.js -> build-2/lib/sphinx/locale/lt/LC_MESSAGES copying sphinx/locale/lt/LC_MESSAGES/sphinx.mo -> build-2/lib/sphinx/locale/lt/LC_MESSAGES copying sphinx/locale/lt/LC_MESSAGES/sphinx.po -> build-2/lib/sphinx/locale/lt/LC_MESSAGES creating build-2/lib/sphinx/locale/lv creating build-2/lib/sphinx/locale/lv/LC_MESSAGES copying sphinx/locale/lv/LC_MESSAGES/sphinx.js -> build-2/lib/sphinx/locale/lv/LC_MESSAGES copying sphinx/locale/lv/LC_MESSAGES/sphinx.mo -> build-2/lib/sphinx/locale/lv/LC_MESSAGES copying sphinx/locale/lv/LC_MESSAGES/sphinx.po -> build-2/lib/sphinx/locale/lv/LC_MESSAGES creating build-2/lib/sphinx/locale/mk creating build-2/lib/sphinx/locale/mk/LC_MESSAGES copying sphinx/locale/mk/LC_MESSAGES/sphinx.js -> build-2/lib/sphinx/locale/mk/LC_MESSAGES copying sphinx/locale/mk/LC_MESSAGES/sphinx.mo -> build-2/lib/sphinx/locale/mk/LC_MESSAGES copying sphinx/locale/mk/LC_MESSAGES/sphinx.po -> build-2/lib/sphinx/locale/mk/LC_MESSAGES creating build-2/lib/sphinx/locale/nb_NO creating build-2/lib/sphinx/locale/nb_NO/LC_MESSAGES copying sphinx/locale/nb_NO/LC_MESSAGES/sphinx.js -> build-2/lib/sphinx/locale/nb_NO/LC_MESSAGES copying sphinx/locale/nb_NO/LC_MESSAGES/sphinx.mo -> build-2/lib/sphinx/locale/nb_NO/LC_MESSAGES copying sphinx/locale/nb_NO/LC_MESSAGES/sphinx.po -> build-2/lib/sphinx/locale/nb_NO/LC_MESSAGES creating build-2/lib/sphinx/locale/ne creating build-2/lib/sphinx/locale/ne/LC_MESSAGES copying sphinx/locale/ne/LC_MESSAGES/sphinx.js -> build-2/lib/sphinx/locale/ne/LC_MESSAGES copying sphinx/locale/ne/LC_MESSAGES/sphinx.mo -> build-2/lib/sphinx/locale/ne/LC_MESSAGES copying sphinx/locale/ne/LC_MESSAGES/sphinx.po -> build-2/lib/sphinx/locale/ne/LC_MESSAGES creating build-2/lib/sphinx/locale/nl creating build-2/lib/sphinx/locale/nl/LC_MESSAGES copying sphinx/locale/nl/LC_MESSAGES/sphinx.js -> build-2/lib/sphinx/locale/nl/LC_MESSAGES copying sphinx/locale/nl/LC_MESSAGES/sphinx.mo -> build-2/lib/sphinx/locale/nl/LC_MESSAGES copying sphinx/locale/nl/LC_MESSAGES/sphinx.po -> build-2/lib/sphinx/locale/nl/LC_MESSAGES creating build-2/lib/sphinx/locale/pl creating build-2/lib/sphinx/locale/pl/LC_MESSAGES copying sphinx/locale/pl/LC_MESSAGES/sphinx.js -> build-2/lib/sphinx/locale/pl/LC_MESSAGES copying sphinx/locale/pl/LC_MESSAGES/sphinx.mo -> build-2/lib/sphinx/locale/pl/LC_MESSAGES copying sphinx/locale/pl/LC_MESSAGES/sphinx.po -> build-2/lib/sphinx/locale/pl/LC_MESSAGES creating build-2/lib/sphinx/locale/pt_BR creating build-2/lib/sphinx/locale/pt_BR/LC_MESSAGES copying sphinx/locale/pt_BR/LC_MESSAGES/sphinx.js -> build-2/lib/sphinx/locale/pt_BR/LC_MESSAGES copying sphinx/locale/pt_BR/LC_MESSAGES/sphinx.mo -> build-2/lib/sphinx/locale/pt_BR/LC_MESSAGES copying sphinx/locale/pt_BR/LC_MESSAGES/sphinx.po -> build-2/lib/sphinx/locale/pt_BR/LC_MESSAGES creating build-2/lib/sphinx/locale/pt_PT creating build-2/lib/sphinx/locale/pt_PT/LC_MESSAGES copying sphinx/locale/pt_PT/LC_MESSAGES/sphinx.js -> build-2/lib/sphinx/locale/pt_PT/LC_MESSAGES copying sphinx/locale/pt_PT/LC_MESSAGES/sphinx.mo -> build-2/lib/sphinx/locale/pt_PT/LC_MESSAGES copying sphinx/locale/pt_PT/LC_MESSAGES/sphinx.po -> build-2/lib/sphinx/locale/pt_PT/LC_MESSAGES creating build-2/lib/sphinx/locale/ro creating build-2/lib/sphinx/locale/ro/LC_MESSAGES copying sphinx/locale/ro/LC_MESSAGES/sphinx.js -> build-2/lib/sphinx/locale/ro/LC_MESSAGES copying sphinx/locale/ro/LC_MESSAGES/sphinx.mo -> build-2/lib/sphinx/locale/ro/LC_MESSAGES copying sphinx/locale/ro/LC_MESSAGES/sphinx.po -> build-2/lib/sphinx/locale/ro/LC_MESSAGES creating build-2/lib/sphinx/locale/ru creating build-2/lib/sphinx/locale/ru/LC_MESSAGES copying sphinx/locale/ru/LC_MESSAGES/sphinx.js -> build-2/lib/sphinx/locale/ru/LC_MESSAGES copying sphinx/locale/ru/LC_MESSAGES/sphinx.mo -> build-2/lib/sphinx/locale/ru/LC_MESSAGES copying sphinx/locale/ru/LC_MESSAGES/sphinx.po -> build-2/lib/sphinx/locale/ru/LC_MESSAGES creating build-2/lib/sphinx/locale/si creating build-2/lib/sphinx/locale/si/LC_MESSAGES copying sphinx/locale/si/LC_MESSAGES/sphinx.js -> build-2/lib/sphinx/locale/si/LC_MESSAGES copying sphinx/locale/si/LC_MESSAGES/sphinx.mo -> build-2/lib/sphinx/locale/si/LC_MESSAGES copying sphinx/locale/si/LC_MESSAGES/sphinx.po -> build-2/lib/sphinx/locale/si/LC_MESSAGES creating build-2/lib/sphinx/locale/sk creating build-2/lib/sphinx/locale/sk/LC_MESSAGES copying sphinx/locale/sk/LC_MESSAGES/sphinx.js -> build-2/lib/sphinx/locale/sk/LC_MESSAGES copying sphinx/locale/sk/LC_MESSAGES/sphinx.mo -> build-2/lib/sphinx/locale/sk/LC_MESSAGES copying sphinx/locale/sk/LC_MESSAGES/sphinx.po -> build-2/lib/sphinx/locale/sk/LC_MESSAGES creating build-2/lib/sphinx/locale/sl creating build-2/lib/sphinx/locale/sl/LC_MESSAGES copying sphinx/locale/sl/LC_MESSAGES/sphinx.js -> build-2/lib/sphinx/locale/sl/LC_MESSAGES copying sphinx/locale/sl/LC_MESSAGES/sphinx.mo -> build-2/lib/sphinx/locale/sl/LC_MESSAGES copying sphinx/locale/sl/LC_MESSAGES/sphinx.po -> build-2/lib/sphinx/locale/sl/LC_MESSAGES creating build-2/lib/sphinx/locale/sv creating build-2/lib/sphinx/locale/sv/LC_MESSAGES copying sphinx/locale/sv/LC_MESSAGES/sphinx.js -> build-2/lib/sphinx/locale/sv/LC_MESSAGES copying sphinx/locale/sv/LC_MESSAGES/sphinx.mo -> build-2/lib/sphinx/locale/sv/LC_MESSAGES copying sphinx/locale/sv/LC_MESSAGES/sphinx.po -> build-2/lib/sphinx/locale/sv/LC_MESSAGES creating build-2/lib/sphinx/locale/tr creating build-2/lib/sphinx/locale/tr/LC_MESSAGES copying sphinx/locale/tr/LC_MESSAGES/sphinx.js -> build-2/lib/sphinx/locale/tr/LC_MESSAGES copying sphinx/locale/tr/LC_MESSAGES/sphinx.mo -> build-2/lib/sphinx/locale/tr/LC_MESSAGES copying sphinx/locale/tr/LC_MESSAGES/sphinx.po -> build-2/lib/sphinx/locale/tr/LC_MESSAGES creating build-2/lib/sphinx/locale/uk_UA creating build-2/lib/sphinx/locale/uk_UA/LC_MESSAGES copying sphinx/locale/uk_UA/LC_MESSAGES/sphinx.js -> build-2/lib/sphinx/locale/uk_UA/LC_MESSAGES copying sphinx/locale/uk_UA/LC_MESSAGES/sphinx.mo -> build-2/lib/sphinx/locale/uk_UA/LC_MESSAGES copying sphinx/locale/uk_UA/LC_MESSAGES/sphinx.po -> build-2/lib/sphinx/locale/uk_UA/LC_MESSAGES creating build-2/lib/sphinx/locale/vi creating build-2/lib/sphinx/locale/vi/LC_MESSAGES copying sphinx/locale/vi/LC_MESSAGES/sphinx.js -> build-2/lib/sphinx/locale/vi/LC_MESSAGES copying sphinx/locale/vi/LC_MESSAGES/sphinx.mo -> build-2/lib/sphinx/locale/vi/LC_MESSAGES copying sphinx/locale/vi/LC_MESSAGES/sphinx.po -> build-2/lib/sphinx/locale/vi/LC_MESSAGES creating build-2/lib/sphinx/locale/zh_CN creating build-2/lib/sphinx/locale/zh_CN/LC_MESSAGES copying sphinx/locale/zh_CN/LC_MESSAGES/sphinx.js -> build-2/lib/sphinx/locale/zh_CN/LC_MESSAGES copying sphinx/locale/zh_CN/LC_MESSAGES/sphinx.mo -> build-2/lib/sphinx/locale/zh_CN/LC_MESSAGES copying sphinx/locale/zh_CN/LC_MESSAGES/sphinx.po -> build-2/lib/sphinx/locale/zh_CN/LC_MESSAGES creating build-2/lib/sphinx/locale/zh_TW creating build-2/lib/sphinx/locale/zh_TW/LC_MESSAGES copying sphinx/locale/zh_TW/LC_MESSAGES/sphinx.js -> build-2/lib/sphinx/locale/zh_TW/LC_MESSAGES copying sphinx/locale/zh_TW/LC_MESSAGES/sphinx.mo -> build-2/lib/sphinx/locale/zh_TW/LC_MESSAGES copying sphinx/locale/zh_TW/LC_MESSAGES/sphinx.po -> build-2/lib/sphinx/locale/zh_TW/LC_MESSAGES copying sphinx/pycode/Grammar-py2.pickle -> build-2/lib/sphinx/pycode copying sphinx/pycode/Grammar-py2.txt -> build-2/lib/sphinx/pycode copying sphinx/pycode/Grammar-py3.pickle -> build-2/lib/sphinx/pycode copying sphinx/pycode/Grammar-py3.txt -> build-2/lib/sphinx/pycode creating build-2/lib/sphinx/search/non-minified-js copying sphinx/search/non-minified-js/danish-stemmer.js -> build-2/lib/sphinx/search/non-minified-js copying sphinx/search/non-minified-js/dutch-stemmer.js -> build-2/lib/sphinx/search/non-minified-js copying sphinx/search/non-minified-js/finnish-stemmer.js -> build-2/lib/sphinx/search/non-minified-js copying sphinx/search/non-minified-js/french-stemmer.js -> build-2/lib/sphinx/search/non-minified-js copying sphinx/search/non-minified-js/german-stemmer.js -> build-2/lib/sphinx/search/non-minified-js copying sphinx/search/non-minified-js/hungarian-stemmer.js -> build-2/lib/sphinx/search/non-minified-js copying sphinx/search/non-minified-js/italian-stemmer.js -> build-2/lib/sphinx/search/non-minified-js copying sphinx/search/non-minified-js/norwegian-stemmer.js -> build-2/lib/sphinx/search/non-minified-js copying sphinx/search/non-minified-js/porter-stemmer.js -> build-2/lib/sphinx/search/non-minified-js copying sphinx/search/non-minified-js/portuguese-stemmer.js -> build-2/lib/sphinx/search/non-minified-js copying sphinx/search/non-minified-js/romanian-stemmer.js -> build-2/lib/sphinx/search/non-minified-js copying sphinx/search/non-minified-js/russian-stemmer.js -> build-2/lib/sphinx/search/non-minified-js copying sphinx/search/non-minified-js/spanish-stemmer.js -> build-2/lib/sphinx/search/non-minified-js copying sphinx/search/non-minified-js/swedish-stemmer.js -> build-2/lib/sphinx/search/non-minified-js copying sphinx/search/non-minified-js/turkish-stemmer.js -> build-2/lib/sphinx/search/non-minified-js creating build-2/lib/sphinx/ext/autosummary/templates creating build-2/lib/sphinx/ext/autosummary/templates/autosummary copying sphinx/ext/autosummary/templates/autosummary/base.rst -> build-2/lib/sphinx/ext/autosummary/templates/autosummary copying sphinx/ext/autosummary/templates/autosummary/class.rst -> build-2/lib/sphinx/ext/autosummary/templates/autosummary copying sphinx/ext/autosummary/templates/autosummary/module.rst -> build-2/lib/sphinx/ext/autosummary/templates/autosummary copying sphinx/pycode/pgen2/parse.c -> build-2/lib/sphinx/pycode/pgen2 copying sphinx/pycode/pgen2/parse.pyx -> build-2/lib/sphinx/pycode/pgen2 + /bin/rm '--interactive=never' sphinx/__init__.pyc + LC_ALL=C.UTF-8 /usr/bin/python2 tests/run.py Checking dependencies... Temporary files will be placed in /tmp/B.p6BCGZ/BUILD/Sphinx-1.5.5/tests/build. Running Sphinx test suite (with Python 2.7.14)... ============================= test session starts ============================== platform linux2 -- Python 2.7.14, pytest-3.0.7, py-1.4.32, pluggy-0.4.0 rootdir: /tmp/B.p6BCGZ/BUILD/Sphinx-1.5.5, inifile: plugins: timeout-1.2.0, expect-1.1.0, cov-2.4.0, hypothesis-3.7.0, backports.unittest-mock-1.2.1 collected 856 items tests/test_api_translator.py .............. tests/test_apidoc.py ...... tests/test_application.py ......... tests/test_autodoc.py ........s tests/test_build.py ..................... tests/test_build_applehelp.py . tests/test_build_gettext.py ..... tests/test_build_html.py ............................................................................................................................................................................................................................................................................................................................................................................................................................................................... tests/test_build_linkcheck.py FF tests/test_build_manpage.py . tests/test_build_texinfo.py .. tests/test_build_text.py ....... tests/test_catalogs.py ... tests/test_config.py ......................... tests/test_correct_year.py ... tests/test_directive_code.py ................ tests/test_directive_only.py . tests/test_docutilsconf.py ....... tests/test_domain_cpp.py ............. tests/test_domain_js.py ... tests/test_domain_py.py .... tests/test_domain_rst.py . tests/test_domain_std.py .. tests/test_environment.py ..... tests/test_environment_indexentries.py ...... tests/test_environment_toctree.py ......... tests/test_ext_autodoc.py . tests/test_ext_autosectionlabel.py . tests/test_ext_autosummary.py ... tests/test_ext_coverage.py . tests/test_ext_doctest.py . tests/test_ext_githubpages.py . tests/test_ext_graphviz.py ... tests/test_ext_ifconfig.py . tests/test_ext_inheritance_diagram.py ... tests/test_ext_intersphinx.py .............. tests/test_ext_math.py ..s... tests/test_ext_napoleon.py ................ tests/test_ext_napoleon_docstring.py ...................... tests/test_ext_napoleon_iterators.py ................ tests/test_ext_todo.py .. tests/test_ext_viewcode.py .. tests/test_highlighting.py ...... tests/test_intl.py ........................................... tests/test_markup.py ................ tests/test_metadata.py . tests/test_quickstart.py ......... tests/test_search.py ........ tests/test_searchadapters.py ss tests/test_setup_command.py ..... tests/test_templating.py .. tests/test_theming.py ... tests/test_toctree.py .. tests/test_util.py ... tests/test_util_fileutil.py .. tests/test_util_inspect.py .... tests/test_util_jsdump.py . tests/test_util_logging.py . tests/test_util_matching.py .. tests/test_util_nodes.py ........ tests/test_util_rst.py . tests/test_versioning.py .......... tests/test_websupport.py ........... tests/test_writer_latex.py . =================================== FAILURES =================================== ________________________________ test_defaults _________________________________ app = <SphinxTestApp buildername='linkcheck'> status = <StringIO.StringIO instance at 0x7f44e74148c0> warning = <StringIO.StringIO instance at 0x7f44e74149e0> @pytest.mark.sphinx('linkcheck', testroot='linkcheck', freshenv=True) def test_defaults(app, status, warning): app.builder.build_all() assert (app.outdir / 'output.txt').exists() content = (app.outdir / 'output.txt').text() print(content) # looking for #top should fail > assert "Anchor 'top' not found" in content E assert "Anchor 'top' not found" in "links.txt:3: [broken] https://www.w3.org/TR/2006/REC-xml-names-20060816/#defaulting: HTTPSConnectionPool(host='www.w3... object at 0x7f44e78a9810>: Failed to establish a new connection: [Errno -3] Temporary failure in name resolution',))\n" tests/test_build_linkcheck.py:25: AssertionError ----------------------------- Captured stdout call ----------------------------- links.txt:3: [broken] https://www.w3.org/TR/2006/REC-xml-names-20060816/#defaulting: HTTPSConnectionPool(host='www.w3.org', port=443): Max retries exceeded with url: /TR/2006/REC-xml-names-20060816/ (Caused by NewConnectionError('<urllib3.connection.VerifiedHTTPSConnection object at 0x7f44e6ccae10>: Failed to establish a new connection: [Errno -3] Temporary failure in name resolution',)) links.txt:9: [broken] http://example.com/#!bar: HTTPConnectionPool(host='example.com', port=80): Max retries exceeded with url: / (Caused by NewConnectionError('<urllib3.connection.HTTPConnection object at 0x7f44e6ccaad0>: Failed to establish a new connection: [Errno -3] Temporary failure in name resolution',)) links.txt:10: [broken] http://example.com#!bar: HTTPConnectionPool(host='example.com', port=80): Max retries exceeded with url: / (Caused by NewConnectionError('<urllib3.connection.HTTPConnection object at 0x7f44e6d9ed10>: Failed to establish a new connection: [Errno -3] Temporary failure in name resolution',)) links.txt:11: [broken] http://example.com/#top: HTTPConnectionPool(host='example.com', port=80): Max retries exceeded with url: / (Caused by NewConnectionError('<urllib3.connection.HTTPConnection object at 0x7f44e78a9810>: Failed to establish a new connection: [Errno -3] Temporary failure in name resolution',)) --------------------------- Captured stdout teardown --------------------------- # testroot: linkcheck # builder: linkcheck # srcdir: /tmp/B.p6BCGZ/BUILD/Sphinx-1.5.5/tests/build/linkcheck # outdir: /tmp/B.p6BCGZ/BUILD/Sphinx-1.5.5/tests/build/linkcheck/_build/linkcheck # status: Running Sphinx v1.5.5 building [linkcheck]: all source files updating environment: 1 added, 0 changed, 0 removed reading sources... [100%] links looking for now-outdated files... none found pickling environment... done checking consistency... done preparing documents... done writing output... [100%] links (line 3) broken https://www.w3.org/TR/2006/REC-xml-names-20060816/#defaulting - HTTPSConnectionPool(host='www.w3.org', port=443): Max retries exceeded with url: /TR/2006/REC-xml-names-20060816/ (Caused by NewConnectionError('<urllib3.connection.VerifiedHTTPSConnection object at 0x7f44e6ccae10>: Failed to establish a new connection: [Errno -3] Temporary failure in name resolution',)) (line 9) broken http://example.com/#!bar - HTTPConnectionPool(host='example.com', port=80): Max retries exceeded with url: / (Caused by NewConnectionError('<urllib3.connection.HTTPConnection object at 0x7f44e6ccaad0>: Failed to establish a new connection: [Errno -3] Temporary failure in name resolution',)) (line 10) broken http://example.com#!bar - HTTPConnectionPool(host='example.com', port=80): Max retries exceeded with url: / (Caused by NewConnectionError('<urllib3.connection.HTTPConnection object at 0x7f44e6d9ed10>: Failed to establish a new connection: [Errno -3] Temporary failure in name resolution',)) (line 11) broken http://example.com/#top - HTTPConnectionPool(host='example.com', port=80): Max retries exceeded with url: / (Caused by NewConnectionError('<urllib3.connection.HTTPConnection object at 0x7f44e78a9810>: Failed to establish a new connection: [Errno -3] Temporary failure in name resolution',)) # warning: /tmp/B.p6BCGZ/BUILD/Sphinx-1.5.5/tests/build/linkcheck/links.txt:9: WARNING: Duplicate explicit target name: "example bar invalid". /tmp/B.p6BCGZ/BUILD/Sphinx-1.5.5/tests/build/linkcheck/links.txt:9: WARNING: Duplicate explicit target name: "example bar invalid". /tmp/B.p6BCGZ/BUILD/Sphinx-1.5.5/tests/build/linkcheck/links.txt:5: ERROR: Unknown target name: "http://www.sphinx-doc.org/en/1.4.8/tutorial.html#install-sphinx".  _____________________________ test_anchors_ignored _____________________________ app = <SphinxTestApp buildername='linkcheck'> status = <StringIO.StringIO instance at 0x7f44e65b6f80> warning = <StringIO.StringIO instance at 0x7f44e65b6368> @pytest.mark.sphinx( 'linkcheck', testroot='linkcheck', freshenv=True, confoverrides={'linkcheck_anchors_ignore': ["^!", "^top$"]}) def test_anchors_ignored(app, status, warning): app.builder.build_all() assert (app.outdir / 'output.txt').exists() content = (app.outdir / 'output.txt').text() # expect all ok when excluding #top > assert not content E assert not "links.txt:3: [broken] https://www.w3.org/TR/2006/REC-xml-names-20060816/#defaulting: HTTPSConnectionPool(host='www.w3... object at 0x7f44e6470590>: Failed to establish a new connection: [Errno -3] Temporary failure in name resolution',))\n" tests/test_build_linkcheck.py:39: AssertionError --------------------------- Captured stdout teardown --------------------------- # testroot: linkcheck # builder: linkcheck # srcdir: /tmp/B.p6BCGZ/BUILD/Sphinx-1.5.5/tests/build/linkcheck # outdir: /tmp/B.p6BCGZ/BUILD/Sphinx-1.5.5/tests/build/linkcheck/_build/linkcheck # status: Running Sphinx v1.5.5 building [linkcheck]: all source files updating environment: 1 added, 0 changed, 0 removed reading sources... [100%] links looking for now-outdated files... none found pickling environment... done checking consistency... done preparing documents... done writing output... [100%] links (line 3) broken https://www.w3.org/TR/2006/REC-xml-names-20060816/#defaulting - HTTPSConnectionPool(host='www.w3.org', port=443): Max retries exceeded with url: /TR/2006/REC-xml-names-20060816/ (Caused by NewConnectionError('<urllib3.connection.VerifiedHTTPSConnection object at 0x7f44e6499d90>: Failed to establish a new connection: [Errno -3] Temporary failure in name resolution',)) (line 9) broken http://example.com/#!bar - HTTPConnectionPool(host='example.com', port=80): Max retries exceeded with url: / (Caused by NewConnectionError('<urllib3.connection.HTTPConnection object at 0x7f44e6499590>: Failed to establish a new connection: [Errno -3] Temporary failure in name resolution',)) (line 10) broken http://example.com#!bar - HTTPConnectionPool(host='example.com', port=80): Max retries exceeded with url: / (Caused by NewConnectionError('<urllib3.connection.HTTPConnection object at 0x7f44e73fc090>: Failed to establish a new connection: [Errno -3] Temporary failure in name resolution',)) (line 11) broken http://example.com/#top - HTTPConnectionPool(host='example.com', port=80): Max retries exceeded with url: / (Caused by NewConnectionError('<urllib3.connection.HTTPConnection object at 0x7f44e6470590>: Failed to establish a new connection: [Errno -3] Temporary failure in name resolution',)) # warning: /tmp/B.p6BCGZ/BUILD/Sphinx-1.5.5/tests/build/linkcheck/links.txt:9: WARNING: Duplicate explicit target name: "example bar invalid". /tmp/B.p6BCGZ/BUILD/Sphinx-1.5.5/tests/build/linkcheck/links.txt:9: WARNING: Duplicate explicit target name: "example bar invalid". /tmp/B.p6BCGZ/BUILD/Sphinx-1.5.5/tests/build/linkcheck/links.txt:5: ERROR: Unknown target name: "http://www.sphinx-doc.org/en/1.4.8/tutorial.html#install-sphinx".  ============== 2 failed, 850 passed, 4 skipped in 119.05 seconds =============== error: Bad exit status from /tmp/B.p6BCGZ/BUILD/tmp/rpm-tmp.12083 (%build) RPM build errors: Bad exit status from /tmp/B.p6BCGZ/BUILD/tmp/rpm-tmp.12083 (%build) ended at: Tue Nov 28 10:07:05 2017, done in 0:02:01.983347 error: No files produced. mesg: ttyname failed: Inappropriate ioctl for device + chmod -R u+rwX /tmp/B.p6BCGZ/BUILD + rm -rf /tmp/B.p6BCGZ/tmp /tmp/B.p6BCGZ/BUILD mesg: ttyname failed: Inappropriate ioctl for device + rm -rf /tmp/B.p6BCGZ Begin-PLD-Builder-Info Build-Time: user:101.05s sys:2.93s real:128.82s (faults io:0 non-io:496851) End-PLD-Builder-Info
[Back to list of logs] [View rpm -qa of builder]