FailedOk

th/SRPMS[OK]
th/x32[OK]
th/i686[OK]
th/x86_64[OK]

ac/SRPMS[OK]
ac/i386[OK]
ac/i586[OK]
ac/i686[OK]
ac/alpha[OK]
ac/amd64[OK]
ac/athlon[OK]
ac/ppc[OK]
ac/sparc[OK]
ac/sparc64[OK]

Advanced Search
main()
Powered by PLD Linux
(c) 2002-2017 PLD Team
$Revision: 1.37 $
Powered by Ken.
Your IP: 23.20.103.97

spl b479d4b9-5dd4-4713-9db5-d482d8026997

Status:Failed
Source URL:ftp://buildlogs.pld-linux.org/th/x86_64/FAIL/spl,b479d4b9-5dd4-4713-9db5-d482d8026997.bz2
text/plain URL:View!
full text:View!
rpm -qa of builder:View!
Date:2017/07/31 19:46:51
Runtime:0:01:39.359790

Toc:

  • error 1
  • /tmp/B.BMGHr9/BUILD/spl-0.6.5.9/include/sys/kmem.h:63:25: error: 'PF_FSTRANS' undeclared (first use in this function)
  • error 2
  • /tmp/B.BMGHr9/BUILD/spl-0.6.5.9/include/sys/kmem.h:82:22: error: 'PF_FSTRANS' undeclared (first use in this function)
  • error 3
  • /tmp/B.BMGHr9/BUILD/spl-0.6.5.9/include/sys/kmem.h:82:22: error: 'PF_FSTRANS' undeclared (first use in this function)
  • error 4
  • /tmp/B.BMGHr9/BUILD/spl-0.6.5.9/include/sys/kmem.h:112:27: error: 'PF_FSTRANS' undeclared (first use in this function)
  • error 5
  • /tmp/B.BMGHr9/BUILD/spl-0.6.5.9/include/sys/kmem.h:63:25: error: 'PF_FSTRANS' undeclared (first use in this function)
  • error 6
  • /tmp/B.BMGHr9/BUILD/spl-0.6.5.9/include/sys/kmem.h:82:22: error: 'PF_FSTRANS' undeclared (first use in this function)
  • error 7
  • /tmp/B.BMGHr9/BUILD/spl-0.6.5.9/include/sys/kmem.h:82:22: error: 'PF_FSTRANS' undeclared (first use in this function)
  • error 8
  • /tmp/B.BMGHr9/BUILD/spl-0.6.5.9/include/sys/kmem.h:112:27: error: 'PF_FSTRANS' undeclared (first use in this function)
  • error 9
  • /tmp/B.BMGHr9/BUILD/spl-0.6.5.9/include/sys/kmem.h:63:25: error: 'PF_FSTRANS' undeclared (first use in this function)
  • error 10
  • /tmp/B.BMGHr9/BUILD/spl-0.6.5.9/include/sys/kmem.h:82:22: error: 'PF_FSTRANS' undeclared (first use in this function)
  • error 11
  • /tmp/B.BMGHr9/BUILD/spl-0.6.5.9/include/sys/kmem.h:82:22: error: 'PF_FSTRANS' undeclared (first use in this function)
  • error 12
  • /tmp/B.BMGHr9/BUILD/spl-0.6.5.9/include/sys/kmem.h:112:27: error: 'PF_FSTRANS' undeclared (first use in this function)
  • error 13
  • /tmp/B.BMGHr9/BUILD/spl-0.6.5.9/include/sys/kmem.h:63:25: error: 'PF_FSTRANS' undeclared (first use in this function)
  • error 14
  • /tmp/B.BMGHr9/BUILD/spl-0.6.5.9/include/sys/kmem.h:82:22: error: 'PF_FSTRANS' undeclared (first use in this function)
  • error 15
  • /tmp/B.BMGHr9/BUILD/spl-0.6.5.9/include/sys/kmem.h:82:22: error: 'PF_FSTRANS' undeclared (first use in this function)
  • error 16
  • /tmp/B.BMGHr9/BUILD/spl-0.6.5.9/include/sys/kmem.h:112:27: error: 'PF_FSTRANS' undeclared (first use in this function)
  • error 17
  • /tmp/B.BMGHr9/BUILD/spl-0.6.5.9/include/sys/kmem.h:63:25: error: 'PF_FSTRANS' undeclared (first use in this function)
  • error 18
  • /tmp/B.BMGHr9/BUILD/spl-0.6.5.9/include/sys/kmem.h:82:22: error: 'PF_FSTRANS' undeclared (first use in this function)
  • error 19
  • /tmp/B.BMGHr9/BUILD/spl-0.6.5.9/include/sys/kmem.h:82:22: error: 'PF_FSTRANS' undeclared (first use in this function)
  • error 20
  • /tmp/B.BMGHr9/BUILD/spl-0.6.5.9/include/sys/kmem.h:112:27: error: 'PF_FSTRANS' undeclared (first use in this function)
  • error 21
  • /tmp/B.BMGHr9/BUILD/spl-0.6.5.9/include/sys/kmem.h:63:25: error: 'PF_FSTRANS' undeclared (first use in this function)
  • error 22
  • /tmp/B.BMGHr9/BUILD/spl-0.6.5.9/include/sys/kmem.h:82:22: error: 'PF_FSTRANS' undeclared (first use in this function)
  • error 23
  • /tmp/B.BMGHr9/BUILD/spl-0.6.5.9/include/sys/kmem.h:82:22: error: 'PF_FSTRANS' undeclared (first use in this function)
  • error 24
  • /tmp/B.BMGHr9/BUILD/spl-0.6.5.9/include/sys/kmem.h:112:27: error: 'PF_FSTRANS' undeclared (first use in this function)
  • error 25
  • error: Bad exit status from /tmp/B.BMGHr9/BUILD/tmp/rpm-tmp.37549 (%build)
  • error 26
  • RPM build errors:
  • error 27
  • error: No files produced.

Content:

rm -rf .libs _libs
make[3]: Leaving directory '/tmp/B.BMGHr9/BUILD/spl-0.6.5.9/include/sys/sysevent'
make[3]: Entering directory '/tmp/B.BMGHr9/BUILD/spl-0.6.5.9/include/sys/sysevent'
rm -f *.lo
make[3]: Leaving directory '/tmp/B.BMGHr9/BUILD/spl-0.6.5.9/include/sys/sysevent'
make[3]: Entering directory '/tmp/B.BMGHr9/BUILD/spl-0.6.5.9/include/sys'
rm -rf .libs _libs
make[3]: Leaving directory '/tmp/B.BMGHr9/BUILD/spl-0.6.5.9/include/sys'
make[3]: Entering directory '/tmp/B.BMGHr9/BUILD/spl-0.6.5.9/include/sys'
rm -f *.lo
make[3]: Leaving directory '/tmp/B.BMGHr9/BUILD/spl-0.6.5.9/include/sys'
Making clean in util
make[2]: Entering directory '/tmp/B.BMGHr9/BUILD/spl-0.6.5.9/include/util'
rm -rf .libs _libs
make[2]: Leaving directory '/tmp/B.BMGHr9/BUILD/spl-0.6.5.9/include/util'
make[2]: Entering directory '/tmp/B.BMGHr9/BUILD/spl-0.6.5.9/include/util'
rm -f *.lo
make[2]: Leaving directory '/tmp/B.BMGHr9/BUILD/spl-0.6.5.9/include/util'
Making clean in vm
make[2]: Entering directory '/tmp/B.BMGHr9/BUILD/spl-0.6.5.9/include/vm'
rm -rf .libs _libs
make[2]: Leaving directory '/tmp/B.BMGHr9/BUILD/spl-0.6.5.9/include/vm'
make[2]: Entering directory '/tmp/B.BMGHr9/BUILD/spl-0.6.5.9/include/vm'
rm -f *.lo
make[2]: Leaving directory '/tmp/B.BMGHr9/BUILD/spl-0.6.5.9/include/vm'
make[2]: Entering directory '/tmp/B.BMGHr9/BUILD/spl-0.6.5.9/include'
rm -rf .libs _libs
make[2]: Leaving directory '/tmp/B.BMGHr9/BUILD/spl-0.6.5.9/include'
make[2]: Entering directory '/tmp/B.BMGHr9/BUILD/spl-0.6.5.9/include'
rm -f *.lo
make[2]: Leaving directory '/tmp/B.BMGHr9/BUILD/spl-0.6.5.9/include'
Making clean in rpm
Making clean in generic
make[2]: Entering directory '/tmp/B.BMGHr9/BUILD/spl-0.6.5.9/rpm/generic'
rm -rf .libs _libs
make[2]: Leaving directory '/tmp/B.BMGHr9/BUILD/spl-0.6.5.9/rpm/generic'
make[2]: Entering directory '/tmp/B.BMGHr9/BUILD/spl-0.6.5.9/rpm/generic'
rm -f *.lo
make[2]: Leaving directory '/tmp/B.BMGHr9/BUILD/spl-0.6.5.9/rpm/generic'
Making clean in redhat
make[2]: Entering directory '/tmp/B.BMGHr9/BUILD/spl-0.6.5.9/rpm/redhat'
rm -rf .libs _libs
make[2]: Leaving directory '/tmp/B.BMGHr9/BUILD/spl-0.6.5.9/rpm/redhat'
make[2]: Entering directory '/tmp/B.BMGHr9/BUILD/spl-0.6.5.9/rpm/redhat'
rm -f *.lo
make[2]: Leaving directory '/tmp/B.BMGHr9/BUILD/spl-0.6.5.9/rpm/redhat'
make[2]: Entering directory '/tmp/B.BMGHr9/BUILD/spl-0.6.5.9/rpm'
rm -rf .libs _libs
make[2]: Leaving directory '/tmp/B.BMGHr9/BUILD/spl-0.6.5.9/rpm'
make[2]: Entering directory '/tmp/B.BMGHr9/BUILD/spl-0.6.5.9/rpm'
rm -f *.lo
make[2]: Leaving directory '/tmp/B.BMGHr9/BUILD/spl-0.6.5.9/rpm'
Making clean in module
/usr/bin/make -C /usr/src/linux SUBDIRS=`pwd`  clean
make[1]: Entering directory '/tmp/B.BMGHr9/BUILD/spl-0.6.5.9/module'
if [ -f Module.symvers ]; then rm -f Module.symvers; fi
if [ -f Module.markers ]; then rm -f Module.markers; fi
make[1]: Leaving directory '/tmp/B.BMGHr9/BUILD/spl-0.6.5.9/module'
make[1]: Entering directory '/tmp/B.BMGHr9/BUILD/spl-0.6.5.9'
rm -rf .libs _libs
make[1]: Leaving directory '/tmp/B.BMGHr9/BUILD/spl-0.6.5.9'
make[1]: Entering directory '/tmp/B.BMGHr9/BUILD/spl-0.6.5.9'
rm -f *.lo
make[1]: Leaving directory '/tmp/B.BMGHr9/BUILD/spl-0.6.5.9'
+ /usr/bin/make -Otarget -j5
/usr/bin/make  all-recursive
Making all in include
Making all in fs
make[3]: Nothing to be done for 'all'.
Making all in linux
make[3]: Nothing to be done for 'all'.
Making all in rpc
make[3]: Nothing to be done for 'all'.
Making all in sharefs
make[3]: Nothing to be done for 'all'.
Making all in sys
Making all in fm
make[4]: Nothing to be done for 'all'.
Making all in fs
make[4]: Nothing to be done for 'all'.
Making all in sysevent
make[4]: Nothing to be done for 'all'.
make[4]: Nothing to be done for 'all-am'.
Making all in util
make[3]: Nothing to be done for 'all'.
Making all in vm
make[3]: Nothing to be done for 'all'.
make[3]: Nothing to be done for 'all-am'.
Making all in rpm
Making all in generic
make[3]: Nothing to be done for 'all'.
Making all in redhat
make[3]: Nothing to be done for 'all'.
make[3]: Nothing to be done for 'all-am'.
Making all in module
/usr/bin/make -C /usr/src/linux SUBDIRS=`pwd`  CONFIG_SPL=m modules
  CC [M]  /tmp/B.BMGHr9/BUILD/spl-0.6.5.9/module/spl/spl-kmem.o
In file included from /tmp/B.BMGHr9/BUILD/spl-0.6.5.9/module/spl/spl-kmem.c:27:0:
/tmp/B.BMGHr9/BUILD/spl-0.6.5.9/include/sys/kmem.h: In function 'kmem_flags_convert':
/tmp/B.BMGHr9/BUILD/spl-0.6.5.9/include/sys/kmem.h:63:25: error: 'PF_FSTRANS' undeclared (first use in this function)
   if ((current->flags & PF_FSTRANS))
                         ^~~~~~~~~~
/tmp/B.BMGHr9/BUILD/spl-0.6.5.9/include/sys/kmem.h:63:25: note: each undeclared identifier is reported only once for each function it appears in
/tmp/B.BMGHr9/BUILD/spl-0.6.5.9/include/sys/kmem.h: In function 'spl_fstrans_mark':
/tmp/B.BMGHr9/BUILD/spl-0.6.5.9/include/sys/kmem.h:82:22: error: 'PF_FSTRANS' undeclared (first use in this function)
 #define SPL_FSTRANS (PF_FSTRANS|PF_MEMALLOC_NOIO)
                      ^
/tmp/B.BMGHr9/BUILD/spl-0.6.5.9/include/sys/kmem.h:93:40: note: in expansion of macro 'SPL_FSTRANS'
  cookie.saved_flags = current->flags & SPL_FSTRANS;
                                        ^~~~~~~~~~~
/tmp/B.BMGHr9/BUILD/spl-0.6.5.9/include/sys/kmem.h: In function 'spl_fstrans_unmark':
/tmp/B.BMGHr9/BUILD/spl-0.6.5.9/include/sys/kmem.h:82:22: error: 'PF_FSTRANS' undeclared (first use in this function)
 #define SPL_FSTRANS (PF_FSTRANS|PF_MEMALLOC_NOIO)
                      ^
/tmp/B.BMGHr9/BUILD/spl-0.6.5.9/include/sys/kmem.h:105:21: note: in expansion of macro 'SPL_FSTRANS'
  current->flags &= ~SPL_FSTRANS;
                     ^~~~~~~~~~~
/tmp/B.BMGHr9/BUILD/spl-0.6.5.9/include/sys/kmem.h: In function 'spl_fstrans_check':
/tmp/B.BMGHr9/BUILD/spl-0.6.5.9/include/sys/kmem.h:112:27: error: 'PF_FSTRANS' undeclared (first use in this function)
  return (current->flags & PF_FSTRANS);
                           ^~~~~~~~~~
make[5]: *** [scripts/Makefile.build:302: /tmp/B.BMGHr9/BUILD/spl-0.6.5.9/module/spl/spl-kmem.o] Error 1
make[5]: *** Waiting for unfinished jobs....
  CC [M]  /tmp/B.BMGHr9/BUILD/spl-0.6.5.9/module/spl/spl-kmem-cache.o
In file included from /tmp/B.BMGHr9/BUILD/spl-0.6.5.9/module/spl/spl-kmem-cache.c:25:0:
/tmp/B.BMGHr9/BUILD/spl-0.6.5.9/include/sys/kmem.h: In function 'kmem_flags_convert':
/tmp/B.BMGHr9/BUILD/spl-0.6.5.9/include/sys/kmem.h:63:25: error: 'PF_FSTRANS' undeclared (first use in this function)
   if ((current->flags & PF_FSTRANS))
                         ^~~~~~~~~~
/tmp/B.BMGHr9/BUILD/spl-0.6.5.9/include/sys/kmem.h:63:25: note: each undeclared identifier is reported only once for each function it appears in
/tmp/B.BMGHr9/BUILD/spl-0.6.5.9/include/sys/kmem.h: In function 'spl_fstrans_mark':
/tmp/B.BMGHr9/BUILD/spl-0.6.5.9/include/sys/kmem.h:82:22: error: 'PF_FSTRANS' undeclared (first use in this function)
 #define SPL_FSTRANS (PF_FSTRANS|PF_MEMALLOC_NOIO)
                      ^
/tmp/B.BMGHr9/BUILD/spl-0.6.5.9/include/sys/kmem.h:93:40: note: in expansion of macro 'SPL_FSTRANS'
  cookie.saved_flags = current->flags & SPL_FSTRANS;
                                        ^~~~~~~~~~~
/tmp/B.BMGHr9/BUILD/spl-0.6.5.9/include/sys/kmem.h: In function 'spl_fstrans_unmark':
/tmp/B.BMGHr9/BUILD/spl-0.6.5.9/include/sys/kmem.h:82:22: error: 'PF_FSTRANS' undeclared (first use in this function)
 #define SPL_FSTRANS (PF_FSTRANS|PF_MEMALLOC_NOIO)
                      ^
/tmp/B.BMGHr9/BUILD/spl-0.6.5.9/include/sys/kmem.h:105:21: note: in expansion of macro 'SPL_FSTRANS'
  current->flags &= ~SPL_FSTRANS;
                     ^~~~~~~~~~~
/tmp/B.BMGHr9/BUILD/spl-0.6.5.9/include/sys/kmem.h: In function 'spl_fstrans_check':
/tmp/B.BMGHr9/BUILD/spl-0.6.5.9/include/sys/kmem.h:112:27: error: 'PF_FSTRANS' undeclared (first use in this function)
  return (current->flags & PF_FSTRANS);
                           ^~~~~~~~~~
/tmp/B.BMGHr9/BUILD/spl-0.6.5.9/include/sys/kmem.h:113:1: warning: control reaches end of non-void function [-Wreturn-type]
 }
 ^
make[5]: *** [scripts/Makefile.build:302: /tmp/B.BMGHr9/BUILD/spl-0.6.5.9/module/spl/spl-kmem-cache.o] Error 1
  CC [M]  /tmp/B.BMGHr9/BUILD/spl-0.6.5.9/module/spl/spl-proc.o
In file included from /tmp/B.BMGHr9/BUILD/spl-0.6.5.9/include/sys/kstat.h:32:0,
                 from /tmp/B.BMGHr9/BUILD/spl-0.6.5.9/module/spl/spl-proc.c:28:
/tmp/B.BMGHr9/BUILD/spl-0.6.5.9/include/sys/kmem.h: In function 'kmem_flags_convert':
/tmp/B.BMGHr9/BUILD/spl-0.6.5.9/include/sys/kmem.h:63:25: error: 'PF_FSTRANS' undeclared (first use in this function)
   if ((current->flags & PF_FSTRANS))
                         ^~~~~~~~~~
/tmp/B.BMGHr9/BUILD/spl-0.6.5.9/include/sys/kmem.h:63:25: note: each undeclared identifier is reported only once for each function it appears in
/tmp/B.BMGHr9/BUILD/spl-0.6.5.9/include/sys/kmem.h: In function 'spl_fstrans_mark':
/tmp/B.BMGHr9/BUILD/spl-0.6.5.9/include/sys/kmem.h:82:22: error: 'PF_FSTRANS' undeclared (first use in this function)
 #define SPL_FSTRANS (PF_FSTRANS|PF_MEMALLOC_NOIO)
                      ^
/tmp/B.BMGHr9/BUILD/spl-0.6.5.9/include/sys/kmem.h:93:40: note: in expansion of macro 'SPL_FSTRANS'
  cookie.saved_flags = current->flags & SPL_FSTRANS;
                                        ^~~~~~~~~~~
/tmp/B.BMGHr9/BUILD/spl-0.6.5.9/include/sys/kmem.h: In function 'spl_fstrans_unmark':
/tmp/B.BMGHr9/BUILD/spl-0.6.5.9/include/sys/kmem.h:82:22: error: 'PF_FSTRANS' undeclared (first use in this function)
 #define SPL_FSTRANS (PF_FSTRANS|PF_MEMALLOC_NOIO)
                      ^
/tmp/B.BMGHr9/BUILD/spl-0.6.5.9/include/sys/kmem.h:105:21: note: in expansion of macro 'SPL_FSTRANS'
  current->flags &= ~SPL_FSTRANS;
                     ^~~~~~~~~~~
/tmp/B.BMGHr9/BUILD/spl-0.6.5.9/include/sys/kmem.h: In function 'spl_fstrans_check':
/tmp/B.BMGHr9/BUILD/spl-0.6.5.9/include/sys/kmem.h:112:27: error: 'PF_FSTRANS' undeclared (first use in this function)
  return (current->flags & PF_FSTRANS);
                           ^~~~~~~~~~
make[5]: *** [scripts/Makefile.build:302: /tmp/B.BMGHr9/BUILD/spl-0.6.5.9/module/spl/spl-proc.o] Error 1
make[4]: *** [scripts/Makefile.build:561: /tmp/B.BMGHr9/BUILD/spl-0.6.5.9/module/spl] Error 2
make[4]: *** Waiting for unfinished jobs....
  CC [M]  /tmp/B.BMGHr9/BUILD/spl-0.6.5.9/module/splat/splat-kmem.o
In file included from /tmp/B.BMGHr9/BUILD/spl-0.6.5.9/module/splat/splat-kmem.c:27:0:
/tmp/B.BMGHr9/BUILD/spl-0.6.5.9/include/sys/kmem.h: In function 'kmem_flags_convert':
/tmp/B.BMGHr9/BUILD/spl-0.6.5.9/include/sys/kmem.h:63:25: error: 'PF_FSTRANS' undeclared (first use in this function)
   if ((current->flags & PF_FSTRANS))
                         ^~~~~~~~~~
/tmp/B.BMGHr9/BUILD/spl-0.6.5.9/include/sys/kmem.h:63:25: note: each undeclared identifier is reported only once for each function it appears in
/tmp/B.BMGHr9/BUILD/spl-0.6.5.9/include/sys/kmem.h: In function 'spl_fstrans_mark':
/tmp/B.BMGHr9/BUILD/spl-0.6.5.9/include/sys/kmem.h:82:22: error: 'PF_FSTRANS' undeclared (first use in this function)
 #define SPL_FSTRANS (PF_FSTRANS|PF_MEMALLOC_NOIO)
                      ^
/tmp/B.BMGHr9/BUILD/spl-0.6.5.9/include/sys/kmem.h:93:40: note: in expansion of macro 'SPL_FSTRANS'
  cookie.saved_flags = current->flags & SPL_FSTRANS;
                                        ^~~~~~~~~~~
/tmp/B.BMGHr9/BUILD/spl-0.6.5.9/include/sys/kmem.h: In function 'spl_fstrans_unmark':
/tmp/B.BMGHr9/BUILD/spl-0.6.5.9/include/sys/kmem.h:82:22: error: 'PF_FSTRANS' undeclared (first use in this function)
 #define SPL_FSTRANS (PF_FSTRANS|PF_MEMALLOC_NOIO)
                      ^
/tmp/B.BMGHr9/BUILD/spl-0.6.5.9/include/sys/kmem.h:105:21: note: in expansion of macro 'SPL_FSTRANS'
  current->flags &= ~SPL_FSTRANS;
                     ^~~~~~~~~~~
/tmp/B.BMGHr9/BUILD/spl-0.6.5.9/include/sys/kmem.h: In function 'spl_fstrans_check':
/tmp/B.BMGHr9/BUILD/spl-0.6.5.9/include/sys/kmem.h:112:27: error: 'PF_FSTRANS' undeclared (first use in this function)
  return (current->flags & PF_FSTRANS);
                           ^~~~~~~~~~
make[5]: *** [scripts/Makefile.build:302: /tmp/B.BMGHr9/BUILD/spl-0.6.5.9/module/splat/splat-kmem.o] Error 1
make[5]: *** Waiting for unfinished jobs....
  CC [M]  /tmp/B.BMGHr9/BUILD/spl-0.6.5.9/module/splat/splat-random.o
In file included from /tmp/B.BMGHr9/BUILD/spl-0.6.5.9/module/splat/splat-random.c:28:0:
/tmp/B.BMGHr9/BUILD/spl-0.6.5.9/include/sys/kmem.h: In function 'kmem_flags_convert':
/tmp/B.BMGHr9/BUILD/spl-0.6.5.9/include/sys/kmem.h:63:25: error: 'PF_FSTRANS' undeclared (first use in this function)
   if ((current->flags & PF_FSTRANS))
                         ^~~~~~~~~~
/tmp/B.BMGHr9/BUILD/spl-0.6.5.9/include/sys/kmem.h:63:25: note: each undeclared identifier is reported only once for each function it appears in
/tmp/B.BMGHr9/BUILD/spl-0.6.5.9/include/sys/kmem.h: In function 'spl_fstrans_mark':
/tmp/B.BMGHr9/BUILD/spl-0.6.5.9/include/sys/kmem.h:82:22: error: 'PF_FSTRANS' undeclared (first use in this function)
 #define SPL_FSTRANS (PF_FSTRANS|PF_MEMALLOC_NOIO)
                      ^
/tmp/B.BMGHr9/BUILD/spl-0.6.5.9/include/sys/kmem.h:93:40: note: in expansion of macro 'SPL_FSTRANS'
  cookie.saved_flags = current->flags & SPL_FSTRANS;
                                        ^~~~~~~~~~~
/tmp/B.BMGHr9/BUILD/spl-0.6.5.9/include/sys/kmem.h: In function 'spl_fstrans_unmark':
/tmp/B.BMGHr9/BUILD/spl-0.6.5.9/include/sys/kmem.h:82:22: error: 'PF_FSTRANS' undeclared (first use in this function)
 #define SPL_FSTRANS (PF_FSTRANS|PF_MEMALLOC_NOIO)
                      ^
/tmp/B.BMGHr9/BUILD/spl-0.6.5.9/include/sys/kmem.h:105:21: note: in expansion of macro 'SPL_FSTRANS'
  current->flags &= ~SPL_FSTRANS;
                     ^~~~~~~~~~~
/tmp/B.BMGHr9/BUILD/spl-0.6.5.9/include/sys/kmem.h: In function 'spl_fstrans_check':
/tmp/B.BMGHr9/BUILD/spl-0.6.5.9/include/sys/kmem.h:112:27: error: 'PF_FSTRANS' undeclared (first use in this function)
  return (current->flags & PF_FSTRANS);
                           ^~~~~~~~~~
make[5]: *** [scripts/Makefile.build:302: /tmp/B.BMGHr9/BUILD/spl-0.6.5.9/module/splat/splat-random.o] Error 1
  CC [M]  /tmp/B.BMGHr9/BUILD/spl-0.6.5.9/module/splat/splat-taskq.o
In file included from /tmp/B.BMGHr9/BUILD/spl-0.6.5.9/module/splat/splat-taskq.c:27:0:
/tmp/B.BMGHr9/BUILD/spl-0.6.5.9/include/sys/kmem.h: In function 'kmem_flags_convert':
/tmp/B.BMGHr9/BUILD/spl-0.6.5.9/include/sys/kmem.h:63:25: error: 'PF_FSTRANS' undeclared (first use in this function)
   if ((current->flags & PF_FSTRANS))
                         ^~~~~~~~~~
/tmp/B.BMGHr9/BUILD/spl-0.6.5.9/include/sys/kmem.h:63:25: note: each undeclared identifier is reported only once for each function it appears in
/tmp/B.BMGHr9/BUILD/spl-0.6.5.9/include/sys/kmem.h: In function 'spl_fstrans_mark':
/tmp/B.BMGHr9/BUILD/spl-0.6.5.9/include/sys/kmem.h:82:22: error: 'PF_FSTRANS' undeclared (first use in this function)
 #define SPL_FSTRANS (PF_FSTRANS|PF_MEMALLOC_NOIO)
                      ^
/tmp/B.BMGHr9/BUILD/spl-0.6.5.9/include/sys/kmem.h:93:40: note: in expansion of macro 'SPL_FSTRANS'
  cookie.saved_flags = current->flags & SPL_FSTRANS;
                                        ^~~~~~~~~~~
/tmp/B.BMGHr9/BUILD/spl-0.6.5.9/include/sys/kmem.h: In function 'spl_fstrans_unmark':
/tmp/B.BMGHr9/BUILD/spl-0.6.5.9/include/sys/kmem.h:82:22: error: 'PF_FSTRANS' undeclared (first use in this function)
 #define SPL_FSTRANS (PF_FSTRANS|PF_MEMALLOC_NOIO)
                      ^
/tmp/B.BMGHr9/BUILD/spl-0.6.5.9/include/sys/kmem.h:105:21: note: in expansion of macro 'SPL_FSTRANS'
  current->flags &= ~SPL_FSTRANS;
                     ^~~~~~~~~~~
/tmp/B.BMGHr9/BUILD/spl-0.6.5.9/include/sys/kmem.h: In function 'spl_fstrans_check':
/tmp/B.BMGHr9/BUILD/spl-0.6.5.9/include/sys/kmem.h:112:27: error: 'PF_FSTRANS' undeclared (first use in this function)
  return (current->flags & PF_FSTRANS);
                           ^~~~~~~~~~
make[5]: *** [scripts/Makefile.build:302: /tmp/B.BMGHr9/BUILD/spl-0.6.5.9/module/splat/splat-taskq.o] Error 1
  CC [M]  /tmp/B.BMGHr9/BUILD/spl-0.6.5.9/module/splat/splat-ctl.o
  CC [M]  /tmp/B.BMGHr9/BUILD/spl-0.6.5.9/module/splat/splat-mutex.o
make[4]: *** [scripts/Makefile.build:561: /tmp/B.BMGHr9/BUILD/spl-0.6.5.9/module/splat] Error 2
make[3]: *** [Makefile:1515: _module_/tmp/B.BMGHr9/BUILD/spl-0.6.5.9/module] Error 2
make[2]: *** [Makefile:11: modules] Error 2
make[1]: *** [Makefile:589: all-recursive] Error 1
make: *** [Makefile:470: all] Error 2
error: Bad exit status from /tmp/B.BMGHr9/BUILD/tmp/rpm-tmp.37549 (%build)


RPM build errors:
    Bad exit status from /tmp/B.BMGHr9/BUILD/tmp/rpm-tmp.37549 (%build)
ended at: Mon Jul 31 19:46:51 2017, done in 0:01:39.359790
error: No files produced.
mesg: ttyname failed: Inappropriate ioctl for device
+ chmod -R u+rwX /tmp/B.BMGHr9/BUILD
+ rm -rf /tmp/B.BMGHr9/tmp /tmp/B.BMGHr9/BUILD
mesg: ttyname failed: Inappropriate ioctl for device
+ rm -rf /tmp/B.BMGHr9
Begin-PLD-Builder-Info
Build-Time: user:62.44s sys:13.21s real:104.53s (faults io:0 non-io:8626835)

End-PLD-Builder-Info
[Back to list of logs] [View rpm -qa of builder]