FailedOk

th/SRPMS[OK]
th/x32[OK]
th/i686[OK]
th/x86_64[OK]

ac/SRPMS[OK]
ac/i386[OK]
ac/i586[OK]
ac/i686[OK]
ac/alpha[OK]
ac/amd64[OK]
ac/athlon[OK]
ac/ppc[OK]
ac/sparc[OK]
ac/sparc64[OK]

Advanced Search
main()
Powered by PLD Linux
(c) 2002-2018 PLD Team
$Revision: 1.37 $
Powered by Real Computer.
Your IP: 52.91.245.237

sysbench a4f1ef60-740c-429c-b197-7c73da67705c

Status:Failed
Source URL:ftp://buildlogs.pld-linux.org/th/x86_64/FAIL/sysbench,a4f1ef60-740c-429c-b197-7c73da67705c.bz2
text/plain URL:View!
rpm -qa of builder:View!
Date:2018/03/07 12:01:34
Runtime:0:00:12.441164

Toc:

  • prep
  • Executing(%prep): /bin/sh -e /tmp/B.JgELop/BUILD/tmp/rpm-tmp.50562
  • build
  • Executing(%build): /bin/sh -e /tmp/B.JgELop/BUILD/tmp/rpm-tmp.50562
  • error 1
  • collect2: error: ld returned 1 exit status
  • error 2
  • make[2]: *** [Makefile:494: sysbench] Error 1
  • error 3
  • make[1]: *** [Makefile:548: all-recursive] Error 1
  • error 4
  • error: Bad exit status from /tmp/B.JgELop/BUILD/tmp/rpm-tmp.50562 (%build)
  • error 5
  • RPM build errors:
  • error 6
  • error: No files produced.

Content:

request from: baggins
checking if we should skip the build
started at: Wed Mar  7 12:01:20 2018
fetching https://srcbuilder.pld-linux.org/th//srpms/a4f1ef60-740c-429c-b197-7c73da67705c/sysbench-0.4.12-3.src.rpm
fetched 431709 bytes, 699.1 K/s
installing srpm: sysbench-0.4.12-3.src.rpm
mesg: ttyname failed: Inappropriate ioctl for device
+ install -d /tmp/B.JgELop/BUILD /tmp/B.JgELop/RPMS
+ LC_ALL=en_US.UTF-8
+ rpm -qp --changelog sysbench-0.4.12-3.src.rpm
* Wed Mar 07 2018 PLD Linux Team <feedback@pld-linux.org>
- For complete changelog see: http://git.pld-linux.org/?p=packages/sysbench.git;a=log;h=master
+ rpm -Uhv --nodeps --define '_topdir /tmp/B.JgELop' --define '_specdir %{_topdir}' --define '_sourcedir %{_specdir}' --define '_rpmdir %{_topdir}/RPMS' --define '_builddir %{_topdir}/BUILD' sysbench-0.4.12-3.src.rpm Preparing... ################################################## sysbench ################################################## + rm -f sysbench-0.4.12-3.src.rpm mesg: ttyname failed: Inappropriate ioctl for device + install -m 700 -d /tmp/B.JgELop/BUILD/tmp mesg: ttyname failed: Inappropriate ioctl for device + TMPDIR=/tmp/B.JgELop/BUILD/tmp + exec nice -n 0 rpmbuild -bp --short-circuit --nodeps --define '_topdir /tmp/B.JgELop' --define '_specdir %{_topdir}' --define '_sourcedir %{_specdir}' --define '_rpmdir %{_topdir}/RPMS' --define '_builddir %{_topdir}/BUILD' --target x86_64-pld-linux --define 'prep exit 0' /tmp/B.JgELop/sysbench.spec Building target platforms: x86_64-pld-linux checking BuildConflict-ing packages no BuildConflicts found checking BR rpm: Building target platforms: x86_64-pld-linux no BR needed building RPM using: set -ex; : build-id: a4f1ef60-740c-429c-b197-7c73da67705c; TMPDIR=/tmp/B.JgELop/BUILD/tmp exec nice -n 0 rpmbuild -bb --define '_smp_mflags -j5' --define '_make_opts -Otarget' --define '_pld_builder 1' --define '_topdir /tmp/B.JgELop' --define '_specdir %{_topdir}' --define '_sourcedir %{_specdir}' --define '_rpmdir %{_topdir}/RPMS' --define '_builddir %{_topdir}/BUILD' --target x86_64-pld-linux /tmp/B.JgELop/sysbench.spec mesg: ttyname failed: Inappropriate ioctl for device + : build-id: a4f1ef60-740c-429c-b197-7c73da67705c + TMPDIR=/tmp/B.JgELop/BUILD/tmp + exec nice -n 0 rpmbuild -bb --define '_smp_mflags -j5' --define '_make_opts -Otarget' --define '_pld_builder 1' --define '_topdir /tmp/B.JgELop' --define '_specdir %{_topdir}' --define '_sourcedir %{_specdir}' --define '_rpmdir %{_topdir}/RPMS' --define '_builddir %{_topdir}/BUILD' --target x86_64-pld-linux /tmp/B.JgELop/sysbench.spec Building target platforms: x86_64-pld-linux Executing(%prep): /bin/sh -e /tmp/B.JgELop/BUILD/tmp/rpm-tmp.50562 + umask 022 + cd /tmp/B.JgELop/BUILD + cd /tmp/B.JgELop/BUILD + rm -rf sysbench-0.4.12 + /usr/bin/gzip -dc /tmp/B.JgELop/sysbench-0.4.12.tar.gz + /bin/tar -xf - + STATUS=0 + '[' 0 -ne 0 ']' + cd sysbench-0.4.12 + /bin/id -u + '[' 1000 '=' 0 ']' + /bin/id -u + '[' 1000 '=' 0 ']' + /bin/chmod -Rf a+rX,u+w,g-w,o-w . + exit 0 Executing(%build): /bin/sh -e /tmp/B.JgELop/BUILD/tmp/rpm-tmp.50562 TMP=/home/users/builder/tmp HOME=/home/users/builder PATH=/home/users/builder/GNUstep/Tools:/usr/local/bin:/usr/bin:/bin:/home/users/builder/bin TMPDIR=/tmp/B.JgELop/BUILD/tmp + umask 022 + cd /tmp/B.JgELop/BUILD + cd sysbench-0.4.12 + libtoolize --copy --force --install libtoolize: putting auxiliary files in AC_CONFIG_AUX_DIR, 'config'. libtoolize: copying file 'config/config.guess' libtoolize: copying file 'config/config.sub' libtoolize: copying file 'config/install-sh' libtoolize: copying file 'config/ltmain.sh' libtoolize: You should add the contents of the following files to 'aclocal.m4': libtoolize: '/usr/share/aclocal/libtool.m4' libtoolize: '/usr/share/aclocal/ltoptions.m4' libtoolize: '/usr/share/aclocal/ltsugar.m4' libtoolize: '/usr/share/aclocal/ltversion.m4' libtoolize: '/usr/share/aclocal/lt~obsolete.m4' libtoolize: Consider adding 'AC_CONFIG_MACRO_DIRS([m4])' to configure.ac, libtoolize: and rerunning libtoolize and aclocal. libtoolize: Consider adding '-I m4' to ACLOCAL_AMFLAGS in Makefile.am. + aclocal + autoconf + autoheader + automake -a -c -f --foreign configure.ac:48: installing 'config/compile' configure.ac:7: installing 'config/missing' sysbench/Makefile.am: installing 'config/depcomp' + ./configure 'LDFLAGS=-Wl,--as-needed -Wl,--no-copy-dt-needed-entries -Wl,-z,relro -Wl,-z,combreloc ' 'CFLAGS=-O2 -fwrapv -pipe -Wformat -Werror=format-security -gdwarf-4 -fno-debug-types-section -fvar-tracking-assignments -g2 -Wp,-D_FORTIFY_SOURCE=2 -fstack-protector-strong --param=ssp-buffer-size=4 -fPIC -march=x86-64 -gdwarf-4 -fno-debug-types-section -fvar-tracking-assignments -g2 ' 'CXXFLAGS=-O2 -fwrapv -pipe -Wformat -Werror=format-security -gdwarf-4 -fno-debug-types-section -fvar-tracking-assignments -g2 -Wp,-D_FORTIFY_SOURCE=2 -fstack-protector-strong --param=ssp-buffer-size=4 -fPIC -march=x86-64 -gdwarf-4 -fno-debug-types-section -fvar-tracking-assignments -g2 ' 'FFLAGS=-O2 -fwrapv -pipe -Wformat -Werror=format-security -gdwarf-4 -fno-debug-types-section -fvar-tracking-assignments -g2 -Wp,-D_FORTIFY_SOURCE=2 -fstack-protector-strong --param=ssp-buffer-size=4 -fPIC -march=x86-64 -gdwarf-4 -fno-debug-types-section -fvar-tracking-assignments -g2 ' 'FCFLAGS=-O2 -fwrapv -pipe -Wformat -Werror=format-security -gdwarf-4 -fno-debug-types-section -fvar-tracking-assignments -g2 -Wp,-D_FORTIFY_SOURCE=2 -fstack-protector-strong --param=ssp-buffer-size=4 -fPIC -march=x86-64 -gdwarf-4 -fno-debug-types-section -fvar-tracking-assignments -g2 ' 'CPPFLAGS=' 'CC=x86_64-pld-linux-gcc' 'CXX=x86_64-pld-linux-g++' '--host=x86_64-pld-linux' '--build=x86_64-pld-linux' '--prefix=/usr' '--exec-prefix=/usr' '--bindir=/usr/bin' '--sbindir=/usr/sbin' '--sysconfdir=/etc' '--datadir=/usr/share' '--includedir=/usr/include' '--libdir=/usr/lib64' '--libexecdir=/usr/libexec' '--localstatedir=/var' '--sharedstatedir=/var/lib' '--mandir=/usr/share/man' '--infodir=/usr/share/info' '--x-libraries=/usr/lib64' --with-mysql --with-pgsql checking build system type... x86_64-pld-linux-gnu checking host system type... x86_64-pld-linux-gnu checking target system type... x86_64-pld-linux-gnu checking for a BSD-compatible install... /usr/bin/install -c checking whether build environment is sane... yes checking for a thread-safe mkdir -p... /bin/mkdir -p checking for mawk... mawk checking whether make sets $(MAKE)... yes checking whether make supports nested variables... yes checking whether to compile with MySQL support... (cached) yes checking whether to compile with Oracle support... (cached) no checking whether to compile with PostgreSQL support... (cached) yes checking whether make supports the include directive... yes (GNU style) checking for x86_64-pld-linux-gcc... x86_64-pld-linux-gcc checking whether the C compiler works... yes checking for C compiler default output file name... a.out checking for suffix of executables... checking whether we are cross compiling... no checking for suffix of object files... o checking whether we are using the GNU C compiler... yes checking whether x86_64-pld-linux-gcc accepts -g... yes checking for x86_64-pld-linux-gcc option to accept ISO C89... none needed checking whether x86_64-pld-linux-gcc understands -c and -o together... yes checking dependency style of x86_64-pld-linux-gcc... gcc3 checking whether SHM_HUGETLB is declared... yes checking whether O_SYNC is declared... yes checking for x86_64-pld-linux-gcc... (cached) x86_64-pld-linux-gcc checking whether we are using the GNU C compiler... (cached) yes checking whether x86_64-pld-linux-gcc accepts -g... (cached) yes checking for x86_64-pld-linux-gcc option to accept ISO C89... (cached) none needed checking whether x86_64-pld-linux-gcc understands -c and -o together... (cached) yes checking dependency style of x86_64-pld-linux-gcc... (cached) gcc3 checking how to print strings... print -r checking for a sed that does not truncate output... /bin/sed checking for grep that handles long lines and -e... /bin/grep checking for egrep... /bin/grep -E checking for fgrep... /bin/grep -F checking for ld used by x86_64-pld-linux-gcc... /usr/bin/ld checking if the linker (/usr/bin/ld) is GNU ld... yes checking for BSD- or MS-compatible name lister (nm)... /usr/bin/nm -B checking the name lister (/usr/bin/nm -B) interface... BSD nm checking whether ln -s works... yes checking the maximum length of command line arguments... 1572864 checking how to convert x86_64-pld-linux-gnu file names to x86_64-pld-linux-gnu format... func_convert_file_noop checking how to convert x86_64-pld-linux-gnu file names to toolchain format... func_convert_file_noop checking for /usr/bin/ld option to reload object files... -r checking for x86_64-pld-linux-objdump... no checking for objdump... objdump checking how to recognize dependent libraries... pass_all checking for x86_64-pld-linux-dlltool... no checking for dlltool... no checking how to associate runtime and link libraries... print -r -- checking for x86_64-pld-linux-ar... no checking for ar... ar checking for archiver @FILE support... @ checking for x86_64-pld-linux-strip... no checking for strip... strip checking for x86_64-pld-linux-ranlib... no checking for ranlib... ranlib checking command to parse /usr/bin/nm -B output from x86_64-pld-linux-gcc object... ok checking for sysroot... no checking for a working dd... /bin/dd checking how to truncate binary pipes... /bin/dd bs=4096 count=1 checking for x86_64-pld-linux-mt... no checking for mt... no checking if : is a manifest tool... no checking how to run the C preprocessor... x86_64-pld-linux-gcc -E checking for ANSI C header files... yes checking for sys/types.h... yes checking for sys/stat.h... yes checking for stdlib.h... yes checking for string.h... yes checking for memory.h... yes checking for strings.h... yes checking for inttypes.h... yes checking for stdint.h... yes checking for unistd.h... yes checking for dlfcn.h... yes checking for objdir... .libs checking if x86_64-pld-linux-gcc supports -fno-rtti -fno-exceptions... no checking for x86_64-pld-linux-gcc option to produce PIC... -fPIC -DPIC checking if x86_64-pld-linux-gcc PIC flag -fPIC -DPIC works... yes checking if x86_64-pld-linux-gcc static flag -static works... yes checking if x86_64-pld-linux-gcc supports -c -o file.o... yes checking if x86_64-pld-linux-gcc supports -c -o file.o... (cached) yes checking whether the x86_64-pld-linux-gcc linker (/usr/bin/ld -m elf_x86_64) supports shared libraries... yes checking whether -lc should be explicitly linked in... no checking dynamic linker characteristics... GNU/Linux ld.so checking how to hardcode library paths into programs... immediate checking whether stripping libraries is possible... yes checking if libtool supports shared libraries... yes checking whether to build shared libraries... yes checking whether to build static libraries... yes checking for xsltproc... xsltproc checking whether xsltproc works... yes checking for the pthreads library -lpthreads... no checking whether pthreads work without any flags... no checking whether pthreads work with -Kthread... no checking whether pthreads work with -kthread... no checking for the pthreads library -llthread... no checking whether pthreads work with -pthread... yes checking for joinable pthread attribute... PTHREAD_CREATE_JOINABLE checking if more special flags are required for pthreads... no checking for cc_r... x86_64-pld-linux-gcc checking for sqrt in -lm... yes checking for mysql_config... /usr/bin/mysql_config checking MySQL C flags... -I/usr/include/mysql checking MySQL linker flags... -L/usr/lib64 -lmysqlclient_r -lpthread -lz -lm -lrt -latomic -lssl -lcrypto -ldl checking for pg_config... /usr/bin/pg_config checking PostgreSQL C flags... -I/usr/include checking PostgreSQL linker flags... -L/usr/lib64 -lpq checking libaio.h usability... yes checking libaio.h presence... yes checking for libaio.h... yes checking for io_queue_init in -laio... yes checking if io_getevents() has an old interface... no checking for malloc in -lumem... no checking for malloc in -lmtmalloc... no checking for ANSI C header files... (cached) yes checking errno.h usability... yes checking errno.h presence... yes checking for errno.h... yes checking fcntl.h usability... yes checking fcntl.h presence... yes checking for fcntl.h... yes checking math.h usability... yes checking math.h presence... yes checking for math.h... yes checking pthread.h usability... yes checking pthread.h presence... yes checking for pthread.h... yes checking sched.h usability... yes checking sched.h presence... yes checking for sched.h... yes checking signal.h usability... yes checking signal.h presence... yes checking for signal.h... yes checking for stdlib.h... (cached) yes checking for string.h... (cached) yes checking sys/aio.h usability... no checking sys/aio.h presence... no checking for sys/aio.h... no checking sys/ipc.h usability... yes checking sys/ipc.h presence... yes checking for sys/ipc.h... yes checking sys/time.h usability... yes checking sys/time.h presence... yes checking for sys/time.h... yes checking sys/mman.h usability... yes checking sys/mman.h presence... yes checking for sys/mman.h... yes checking sys/shm.h usability... yes checking sys/shm.h presence... yes checking for sys/shm.h... yes checking thread.h usability... no checking thread.h presence... no checking for thread.h... no checking for unistd.h... (cached) yes checking for inline... inline checking for off_t... yes checking for size_t... yes checking whether time.h and sys/time.h may both be included... yes checking for special C compiler options needed for large files... no checking for _FILE_OFFSET_BITS value needed for large files... no checking size of size_t... 8 checking for stdlib.h... (cached) yes checking for GNU libc compatible malloc... yes checking for stdlib.h... (cached) yes checking for unistd.h... (cached) yes checking for sys/param.h... yes checking for getpagesize... yes checking for working mmap... yes checking whether strerror_r is declared... yes checking for strerror_r... yes checking whether strerror_r returns char *... no checking whether clock_gettime is declared... yes checking for library containing clock_gettime... none required checking for alarm... yes checking for fdatasync... yes checking for gettimeofday... yes checking for lrand48... yes checking for memalign... yes checking for memset... yes checking for posix_memalign... yes checking for pthread_yield... no checking for setvbuf... yes checking for sqrt... yes checking for strdup... yes checking for thr_setconcurrency... no checking for valloc... yes checking that generated files are newer than configure... done configure: creating ./config.status config.status: creating Makefile config.status: creating doc/xsl/Makefile config.status: creating doc/xsl/catalog.xml config.status: creating doc/Makefile config.status: creating sysbench/Makefile config.status: creating sysbench/drivers/Makefile config.status: creating sysbench/drivers/mysql/Makefile config.status: creating sysbench/drivers/oracle/Makefile config.status: creating sysbench/drivers/pgsql/Makefile config.status: creating sysbench/tests/Makefile config.status: creating sysbench/tests/cpu/Makefile config.status: creating sysbench/tests/fileio/Makefile config.status: creating sysbench/tests/memory/Makefile config.status: creating sysbench/tests/threads/Makefile config.status: creating sysbench/tests/mutex/Makefile config.status: creating sysbench/tests/oltp/Makefile config.status: creating config/config.h config.status: executing depfiles commands config.status: executing libtool commands + /usr/bin/make -Otarget -j5 Making all in doc Making all in xsl make[2]: Nothing to be done for 'all'. make[2]: Nothing to be done for 'all-am'. Making all in sysbench Making all in drivers Making all in mysql make[3]: Entering directory '/tmp/B.JgELop/BUILD/sysbench-0.4.12/sysbench/drivers/mysql' x86_64-pld-linux-gcc -DHAVE_CONFIG_H -I. -I../../../config -I/usr/include/mysql -D_REENTRANT -D_XOPEN_SOURCE=500 -D_GNU_SOURCE -I../../../sysbench -pthread -O2 -fwrapv -pipe -Wformat -Werror=format-security -gdwarf-4 -fno-debug-types-section -fvar-tracking-assignments -g2 -Wp,-D_FORTIFY_SOURCE=2 -fstack-protector-strong --param=ssp-buffer-size=4 -fPIC -march=x86-64 -gdwarf-4 -fno-debug-types-section -fvar-tracking-assignments -g2 -MT libsbmysql_a-drv_mysql.o -MD -MP -MF .deps/libsbmysql_a-drv_mysql.Tpo -c -o libsbmysql_a-drv_mysql.o `test -f 'drv_mysql.c' || echo './'`drv_mysql.c mv -f .deps/libsbmysql_a-drv_mysql.Tpo .deps/libsbmysql_a-drv_mysql.Po make[3]: Leaving directory '/tmp/B.JgELop/BUILD/sysbench-0.4.12/sysbench/drivers/mysql' make[3]: Entering directory '/tmp/B.JgELop/BUILD/sysbench-0.4.12/sysbench/drivers/mysql' rm -f libsbmysql.a ar cru libsbmysql.a libsbmysql_a-drv_mysql.o ranlib libsbmysql.a make[3]: Leaving directory '/tmp/B.JgELop/BUILD/sysbench-0.4.12/sysbench/drivers/mysql' Making all in pgsql make[3]: Entering directory '/tmp/B.JgELop/BUILD/sysbench-0.4.12/sysbench/drivers/pgsql' x86_64-pld-linux-gcc -DHAVE_CONFIG_H -I. -I../../../config -I/usr/include -D_REENTRANT -D_XOPEN_SOURCE=500 -D_GNU_SOURCE -I../../../sysbench -pthread -O2 -fwrapv -pipe -Wformat -Werror=format-security -gdwarf-4 -fno-debug-types-section -fvar-tracking-assignments -g2 -Wp,-D_FORTIFY_SOURCE=2 -fstack-protector-strong --param=ssp-buffer-size=4 -fPIC -march=x86-64 -gdwarf-4 -fno-debug-types-section -fvar-tracking-assignments -g2 -MT libsbpgsql_a-drv_pgsql.o -MD -MP -MF .deps/libsbpgsql_a-drv_pgsql.Tpo -c -o libsbpgsql_a-drv_pgsql.o `test -f 'drv_pgsql.c' || echo './'`drv_pgsql.c drv_pgsql.c: In function 'get_unique_stmt_name': drv_pgsql.c:695:38: warning: format '%d' expects argument of type 'int', but argument 4 has type 'long int' [-Wformat=] return snprintf(name, len, "sbstmt%d%d", sb_rnd(), sb_rnd()); ~^ %ld drv_pgsql.c:695:40: warning: format '%d' expects argument of type 'int', but argument 5 has type 'long int' [-Wformat=] return snprintf(name, len, "sbstmt%d%d", sb_rnd(), sb_rnd()); ~^ %ld mv -f .deps/libsbpgsql_a-drv_pgsql.Tpo .deps/libsbpgsql_a-drv_pgsql.Po make[3]: Leaving directory '/tmp/B.JgELop/BUILD/sysbench-0.4.12/sysbench/drivers/pgsql' make[3]: Entering directory '/tmp/B.JgELop/BUILD/sysbench-0.4.12/sysbench/drivers/pgsql' rm -f libsbpgsql.a ar cru libsbpgsql.a libsbpgsql_a-drv_pgsql.o ranlib libsbpgsql.a make[3]: Leaving directory '/tmp/B.JgELop/BUILD/sysbench-0.4.12/sysbench/drivers/pgsql' make[3]: Nothing to be done for 'all-am'. Making all in tests Making all in cpu make[3]: Entering directory '/tmp/B.JgELop/BUILD/sysbench-0.4.12/sysbench/tests/cpu' x86_64-pld-linux-gcc -DHAVE_CONFIG_H -I. -I../../../config -D_REENTRANT -D_XOPEN_SOURCE=500 -D_GNU_SOURCE -I../../../sysbench -pthread -O2 -fwrapv -pipe -Wformat -Werror=format-security -gdwarf-4 -fno-debug-types-section -fvar-tracking-assignments -g2 -Wp,-D_FORTIFY_SOURCE=2 -fstack-protector-strong --param=ssp-buffer-size=4 -fPIC -march=x86-64 -gdwarf-4 -fno-debug-types-section -fvar-tracking-assignments -g2 -MT libsbcpu_a-sb_cpu.o -MD -MP -MF .deps/libsbcpu_a-sb_cpu.Tpo -c -o libsbcpu_a-sb_cpu.o `test -f 'sb_cpu.c' || echo './'`sb_cpu.c mv -f .deps/libsbcpu_a-sb_cpu.Tpo .deps/libsbcpu_a-sb_cpu.Po make[3]: Leaving directory '/tmp/B.JgELop/BUILD/sysbench-0.4.12/sysbench/tests/cpu' make[3]: Entering directory '/tmp/B.JgELop/BUILD/sysbench-0.4.12/sysbench/tests/cpu' rm -f libsbcpu.a ar cru libsbcpu.a libsbcpu_a-sb_cpu.o ranlib libsbcpu.a make[3]: Leaving directory '/tmp/B.JgELop/BUILD/sysbench-0.4.12/sysbench/tests/cpu' Making all in fileio make[3]: Entering directory '/tmp/B.JgELop/BUILD/sysbench-0.4.12/sysbench/tests/fileio' x86_64-pld-linux-gcc -DHAVE_CONFIG_H -I. -I../../../config -D_REENTRANT -D_XOPEN_SOURCE=500 -D_GNU_SOURCE -I../../../sysbench -pthread -O2 -fwrapv -pipe -Wformat -Werror=format-security -gdwarf-4 -fno-debug-types-section -fvar-tracking-assignments -g2 -Wp,-D_FORTIFY_SOURCE=2 -fstack-protector-strong --param=ssp-buffer-size=4 -fPIC -march=x86-64 -gdwarf-4 -fno-debug-types-section -fvar-tracking-assignments -g2 -MT libsbfileio_a-crc32.o -MD -MP -MF .deps/libsbfileio_a-crc32.Tpo -c -o libsbfileio_a-crc32.o `test -f 'crc32.c' || echo './'`crc32.c mv -f .deps/libsbfileio_a-crc32.Tpo .deps/libsbfileio_a-crc32.Po make[3]: Leaving directory '/tmp/B.JgELop/BUILD/sysbench-0.4.12/sysbench/tests/fileio' make[3]: Entering directory '/tmp/B.JgELop/BUILD/sysbench-0.4.12/sysbench/tests/fileio' x86_64-pld-linux-gcc -DHAVE_CONFIG_H -I. -I../../../config -D_REENTRANT -D_XOPEN_SOURCE=500 -D_GNU_SOURCE -I../../../sysbench -pthread -O2 -fwrapv -pipe -Wformat -Werror=format-security -gdwarf-4 -fno-debug-types-section -fvar-tracking-assignments -g2 -Wp,-D_FORTIFY_SOURCE=2 -fstack-protector-strong --param=ssp-buffer-size=4 -fPIC -march=x86-64 -gdwarf-4 -fno-debug-types-section -fvar-tracking-assignments -g2 -MT libsbfileio_a-sb_fileio.o -MD -MP -MF .deps/libsbfileio_a-sb_fileio.Tpo -c -o libsbfileio_a-sb_fileio.o `test -f 'sb_fileio.c' || echo './'`sb_fileio.c sb_fileio.c: In function 'sb_memalign': sb_fileio.c:1791:3: warning: ignoring return value of 'posix_memalign', declared with attribute warn_unused_result [-Wunused-result] posix_memalign((void **)&buffer, page_size, size); ^~~~~~~~~~~~~~~~~~~~~~~~~~~~~~~~~~~~~~~~~~~~~~~~~ mv -f .deps/libsbfileio_a-sb_fileio.Tpo .deps/libsbfileio_a-sb_fileio.Po make[3]: Leaving directory '/tmp/B.JgELop/BUILD/sysbench-0.4.12/sysbench/tests/fileio' make[3]: Entering directory '/tmp/B.JgELop/BUILD/sysbench-0.4.12/sysbench/tests/fileio' rm -f libsbfileio.a ar cru libsbfileio.a libsbfileio_a-sb_fileio.o libsbfileio_a-crc32.o ranlib libsbfileio.a make[3]: Leaving directory '/tmp/B.JgELop/BUILD/sysbench-0.4.12/sysbench/tests/fileio' Making all in memory make[3]: Entering directory '/tmp/B.JgELop/BUILD/sysbench-0.4.12/sysbench/tests/memory' x86_64-pld-linux-gcc -DHAVE_CONFIG_H -I. -I../../../config -D_REENTRANT -D_XOPEN_SOURCE=500 -D_GNU_SOURCE -I../../../sysbench -pthread -O2 -fwrapv -pipe -Wformat -Werror=format-security -gdwarf-4 -fno-debug-types-section -fvar-tracking-assignments -g2 -Wp,-D_FORTIFY_SOURCE=2 -fstack-protector-strong --param=ssp-buffer-size=4 -fPIC -march=x86-64 -gdwarf-4 -fno-debug-types-section -fvar-tracking-assignments -g2 -MT libsbmemory_a-sb_memory.o -MD -MP -MF .deps/libsbmemory_a-sb_memory.Tpo -c -o libsbmemory_a-sb_memory.o `test -f 'sb_memory.c' || echo './'`sb_memory.c mv -f .deps/libsbmemory_a-sb_memory.Tpo .deps/libsbmemory_a-sb_memory.Po make[3]: Leaving directory '/tmp/B.JgELop/BUILD/sysbench-0.4.12/sysbench/tests/memory' make[3]: Entering directory '/tmp/B.JgELop/BUILD/sysbench-0.4.12/sysbench/tests/memory' rm -f libsbmemory.a ar cru libsbmemory.a libsbmemory_a-sb_memory.o ranlib libsbmemory.a make[3]: Leaving directory '/tmp/B.JgELop/BUILD/sysbench-0.4.12/sysbench/tests/memory' Making all in threads make[3]: Entering directory '/tmp/B.JgELop/BUILD/sysbench-0.4.12/sysbench/tests/threads' x86_64-pld-linux-gcc -DHAVE_CONFIG_H -I. -I../../../config -D_REENTRANT -D_XOPEN_SOURCE=500 -D_GNU_SOURCE -I../../../sysbench -pthread -O2 -fwrapv -pipe -Wformat -Werror=format-security -gdwarf-4 -fno-debug-types-section -fvar-tracking-assignments -g2 -Wp,-D_FORTIFY_SOURCE=2 -fstack-protector-strong --param=ssp-buffer-size=4 -fPIC -march=x86-64 -gdwarf-4 -fno-debug-types-section -fvar-tracking-assignments -g2 -MT libsbthreads_a-sb_threads.o -MD -MP -MF .deps/libsbthreads_a-sb_threads.Tpo -c -o libsbthreads_a-sb_threads.o `test -f 'sb_threads.c' || echo './'`sb_threads.c mv -f .deps/libsbthreads_a-sb_threads.Tpo .deps/libsbthreads_a-sb_threads.Po make[3]: Leaving directory '/tmp/B.JgELop/BUILD/sysbench-0.4.12/sysbench/tests/threads' make[3]: Entering directory '/tmp/B.JgELop/BUILD/sysbench-0.4.12/sysbench/tests/threads' rm -f libsbthreads.a ar cru libsbthreads.a libsbthreads_a-sb_threads.o ranlib libsbthreads.a make[3]: Leaving directory '/tmp/B.JgELop/BUILD/sysbench-0.4.12/sysbench/tests/threads' Making all in mutex make[3]: Entering directory '/tmp/B.JgELop/BUILD/sysbench-0.4.12/sysbench/tests/mutex' x86_64-pld-linux-gcc -DHAVE_CONFIG_H -I. -I../../../config -D_REENTRANT -D_XOPEN_SOURCE=500 -D_GNU_SOURCE -I../../../sysbench -pthread -O2 -fwrapv -pipe -Wformat -Werror=format-security -gdwarf-4 -fno-debug-types-section -fvar-tracking-assignments -g2 -Wp,-D_FORTIFY_SOURCE=2 -fstack-protector-strong --param=ssp-buffer-size=4 -fPIC -march=x86-64 -gdwarf-4 -fno-debug-types-section -fvar-tracking-assignments -g2 -MT libsbmutex_a-sb_mutex.o -MD -MP -MF .deps/libsbmutex_a-sb_mutex.Tpo -c -o libsbmutex_a-sb_mutex.o `test -f 'sb_mutex.c' || echo './'`sb_mutex.c mv -f .deps/libsbmutex_a-sb_mutex.Tpo .deps/libsbmutex_a-sb_mutex.Po make[3]: Leaving directory '/tmp/B.JgELop/BUILD/sysbench-0.4.12/sysbench/tests/mutex' make[3]: Entering directory '/tmp/B.JgELop/BUILD/sysbench-0.4.12/sysbench/tests/mutex' rm -f libsbmutex.a ar cru libsbmutex.a libsbmutex_a-sb_mutex.o ranlib libsbmutex.a make[3]: Leaving directory '/tmp/B.JgELop/BUILD/sysbench-0.4.12/sysbench/tests/mutex' Making all in oltp make[3]: Entering directory '/tmp/B.JgELop/BUILD/sysbench-0.4.12/sysbench/tests/oltp' x86_64-pld-linux-gcc -DHAVE_CONFIG_H -I. -I../../../config -I./.. -D_REENTRANT -D_XOPEN_SOURCE=500 -D_GNU_SOURCE -I../../../sysbench -I/usr/include/mysql -pthread -O2 -fwrapv -pipe -Wformat -Werror=format-security -gdwarf-4 -fno-debug-types-section -fvar-tracking-assignments -g2 -Wp,-D_FORTIFY_SOURCE=2 -fstack-protector-strong --param=ssp-buffer-size=4 -fPIC -march=x86-64 -gdwarf-4 -fno-debug-types-section -fvar-tracking-assignments -g2 -MT libsboltp_a-sb_oltp.o -MD -MP -MF .deps/libsboltp_a-sb_oltp.Tpo -c -o libsboltp_a-sb_oltp.o `test -f 'sb_oltp.c' || echo './'`sb_oltp.c mv -f .deps/libsboltp_a-sb_oltp.Tpo .deps/libsboltp_a-sb_oltp.Po make[3]: Leaving directory '/tmp/B.JgELop/BUILD/sysbench-0.4.12/sysbench/tests/oltp' make[3]: Entering directory '/tmp/B.JgELop/BUILD/sysbench-0.4.12/sysbench/tests/oltp' rm -f libsboltp.a ar cru libsboltp.a libsboltp_a-sb_oltp.o ranlib libsboltp.a make[3]: Leaving directory '/tmp/B.JgELop/BUILD/sysbench-0.4.12/sysbench/tests/oltp' make[3]: Nothing to be done for 'all-am'. Making all in . make[2]: Entering directory '/tmp/B.JgELop/BUILD/sysbench-0.4.12/sysbench' x86_64-pld-linux-gcc -DHAVE_CONFIG_H -I. -I../config -D_REENTRANT -D_XOPEN_SOURCE=500 -D_GNU_SOURCE -I../sysbench -pthread -O2 -fwrapv -pipe -Wformat -Werror=format-security -gdwarf-4 -fno-debug-types-section -fvar-tracking-assignments -g2 -Wp,-D_FORTIFY_SOURCE=2 -fstack-protector-strong --param=ssp-buffer-size=4 -fPIC -march=x86-64 -gdwarf-4 -fno-debug-types-section -fvar-tracking-assignments -g2 -MT sb_timer.o -MD -MP -MF .deps/sb_timer.Tpo -c -o sb_timer.o sb_timer.c mv -f .deps/sb_timer.Tpo .deps/sb_timer.Po make[2]: Leaving directory '/tmp/B.JgELop/BUILD/sysbench-0.4.12/sysbench' make[2]: Entering directory '/tmp/B.JgELop/BUILD/sysbench-0.4.12/sysbench' x86_64-pld-linux-gcc -DHAVE_CONFIG_H -I. -I../config -D_REENTRANT -D_XOPEN_SOURCE=500 -D_GNU_SOURCE -I../sysbench -pthread -O2 -fwrapv -pipe -Wformat -Werror=format-security -gdwarf-4 -fno-debug-types-section -fvar-tracking-assignments -g2 -Wp,-D_FORTIFY_SOURCE=2 -fstack-protector-strong --param=ssp-buffer-size=4 -fPIC -march=x86-64 -gdwarf-4 -fno-debug-types-section -fvar-tracking-assignments -g2 -MT db_driver.o -MD -MP -MF .deps/db_driver.Tpo -c -o db_driver.o db_driver.c mv -f .deps/db_driver.Tpo .deps/db_driver.Po make[2]: Leaving directory '/tmp/B.JgELop/BUILD/sysbench-0.4.12/sysbench' make[2]: Entering directory '/tmp/B.JgELop/BUILD/sysbench-0.4.12/sysbench' x86_64-pld-linux-gcc -DHAVE_CONFIG_H -I. -I../config -D_REENTRANT -D_XOPEN_SOURCE=500 -D_GNU_SOURCE -I../sysbench -pthread -O2 -fwrapv -pipe -Wformat -Werror=format-security -gdwarf-4 -fno-debug-types-section -fvar-tracking-assignments -g2 -Wp,-D_FORTIFY_SOURCE=2 -fstack-protector-strong --param=ssp-buffer-size=4 -fPIC -march=x86-64 -gdwarf-4 -fno-debug-types-section -fvar-tracking-assignments -g2 -MT sysbench.o -MD -MP -MF .deps/sysbench.Tpo -c -o sysbench.o sysbench.c mv -f .deps/sysbench.Tpo .deps/sysbench.Po make[2]: Leaving directory '/tmp/B.JgELop/BUILD/sysbench-0.4.12/sysbench' make[2]: Entering directory '/tmp/B.JgELop/BUILD/sysbench-0.4.12/sysbench' x86_64-pld-linux-gcc -DHAVE_CONFIG_H -I. -I../config -D_REENTRANT -D_XOPEN_SOURCE=500 -D_GNU_SOURCE -I../sysbench -pthread -O2 -fwrapv -pipe -Wformat -Werror=format-security -gdwarf-4 -fno-debug-types-section -fvar-tracking-assignments -g2 -Wp,-D_FORTIFY_SOURCE=2 -fstack-protector-strong --param=ssp-buffer-size=4 -fPIC -march=x86-64 -gdwarf-4 -fno-debug-types-section -fvar-tracking-assignments -g2 -MT sb_options.o -MD -MP -MF .deps/sb_options.Tpo -c -o sb_options.o sb_options.c mv -f .deps/sb_options.Tpo .deps/sb_options.Po make[2]: Leaving directory '/tmp/B.JgELop/BUILD/sysbench-0.4.12/sysbench' make[2]: Entering directory '/tmp/B.JgELop/BUILD/sysbench-0.4.12/sysbench' x86_64-pld-linux-gcc -DHAVE_CONFIG_H -I. -I../config -D_REENTRANT -D_XOPEN_SOURCE=500 -D_GNU_SOURCE -I../sysbench -pthread -O2 -fwrapv -pipe -Wformat -Werror=format-security -gdwarf-4 -fno-debug-types-section -fvar-tracking-assignments -g2 -Wp,-D_FORTIFY_SOURCE=2 -fstack-protector-strong --param=ssp-buffer-size=4 -fPIC -march=x86-64 -gdwarf-4 -fno-debug-types-section -fvar-tracking-assignments -g2 -MT sb_logger.o -MD -MP -MF .deps/sb_logger.Tpo -c -o sb_logger.o sb_logger.c sb_logger.c: In function 'log_errno': sb_logger.c:335:3: warning: ignoring return value of 'strerror_r', declared with attribute warn_unused_result [-Wunused-result] strerror_r(old_errno, errbuf, sizeof(errbuf)); ^~~~~~~~~~~~~~~~~~~~~~~~~~~~~~~~~~~~~~~~~~~~~ mv -f .deps/sb_logger.Tpo .deps/sb_logger.Po make[2]: Leaving directory '/tmp/B.JgELop/BUILD/sysbench-0.4.12/sysbench' make[2]: Entering directory '/tmp/B.JgELop/BUILD/sysbench-0.4.12/sysbench' /bin/sh ../libtool --tag=CC --mode=link x86_64-pld-linux-gcc -pthread -O2 -fwrapv -pipe -Wformat -Werror=format-security -gdwarf-4 -fno-debug-types-section -fvar-tracking-assignments -g2 -Wp,-D_FORTIFY_SOURCE=2 -fstack-protector-strong --param=ssp-buffer-size=4 -fPIC -march=x86-64 -gdwarf-4 -fno-debug-types-section -fvar-tracking-assignments -g2 -Wl,--as-needed -Wl,--no-copy-dt-needed-entries -Wl,-z,relro -Wl,-z,combreloc -o sysbench sysbench.o sb_timer.o sb_options.o sb_logger.o db_driver.o tests/fileio/libsbfileio.a tests/threads/libsbthreads.a tests/memory/libsbmemory.a tests/cpu/libsbcpu.a tests/oltp/libsboltp.a tests/mutex/libsbmutex.a drivers/mysql/libsbmysql.a -L/usr/lib64 -lmysqlclient_r -lpthread -lz -lm -lrt -latomic -lssl -lcrypto -ldl drivers/pgsql/libsbpgsql.a -L/usr/lib64 -lpq -laio -lm libtool: link: x86_64-pld-linux-gcc -pthread -O2 -fwrapv -pipe -Wformat -Werror=format-security -gdwarf-4 -fno-debug-types-section -fvar-tracking-assignments -g2 -Wp,-D_FORTIFY_SOURCE=2 -fstack-protector-strong --param=ssp-buffer-size=4 -fPIC -march=x86-64 -gdwarf-4 -fno-debug-types-section -fvar-tracking-assignments -g2 -Wl,--as-needed -Wl,--no-copy-dt-needed-entries -Wl,-z -Wl,relro -Wl,-z -Wl,combreloc -o sysbench sysbench.o sb_timer.o sb_options.o sb_logger.o db_driver.o tests/fileio/libsbfileio.a tests/threads/libsbthreads.a tests/memory/libsbmemory.a tests/cpu/libsbcpu.a tests/oltp/libsboltp.a tests/mutex/libsbmutex.a drivers/mysql/libsbmysql.a -L/usr/lib64 -lmysqlclient_r -lpthread -lz -lrt /usr/lib64/libatomic.so -lssl -lcrypto -ldl drivers/pgsql/libsbpgsql.a -lpq -laio -lm -pthread /usr/bin/ld: cannot find -lmysqlclient_r collect2: error: ld returned 1 exit status make[2]: *** [Makefile:494: sysbench] Error 1 make[2]: Leaving directory '/tmp/B.JgELop/BUILD/sysbench-0.4.12/sysbench' make[1]: *** [Makefile:548: all-recursive] Error 1 make: *** [Makefile:441: all-recursive] Error 1 error: Bad exit status from /tmp/B.JgELop/BUILD/tmp/rpm-tmp.50562 (%build) RPM build errors: Bad exit status from /tmp/B.JgELop/BUILD/tmp/rpm-tmp.50562 (%build) ended at: Wed Mar 7 12:01:34 2018, done in 0:00:12.441164 error: No files produced. mesg: ttyname failed: Inappropriate ioctl for device + chmod -R u+rwX /tmp/B.JgELop/BUILD + rm -rf /tmp/B.JgELop/tmp /tmp/B.JgELop/BUILD mesg: ttyname failed: Inappropriate ioctl for device + rm -rf /tmp/B.JgELop Begin-PLD-Builder-Info Build-Time: user:9.55s sys:1.70s real:14.53s (faults io:0 non-io:1061257) End-PLD-Builder-Info
[Back to list of logs] [View rpm -qa of builder]