FailedOk

th/SRPMS[OK]
th/x32[OK]
th/i686[OK]
th/x86_64[OK]

ac/SRPMS[OK]
ac/i386[OK]
ac/i586[OK]
ac/i686[OK]
ac/alpha[OK]
ac/amd64[OK]
ac/athlon[OK]
ac/ppc[OK]
ac/sparc[OK]
ac/sparc64[OK]

Advanced Search
main()
Powered by PLD Linux
(c) 2002-2018 PLD Team
$Revision: 1.37 $
Powered by X.
Your IP: 54.234.228.185

sysbench a4f1ef60-740c-429c-b197-7c73da67705c

Status:Failed
Source URL:ftp://buildlogs.pld-linux.org/th/x86_64/FAIL/sysbench,a4f1ef60-740c-429c-b197-7c73da67705c.bz2
text/plain URL:View!
full text:View!
rpm -qa of builder:View!
Date:2018/03/07 12:01:34
Runtime:0:00:12.441164

Toc:

  • error 1
  • collect2: error: ld returned 1 exit status
  • error 2
  • make[2]: *** [Makefile:494: sysbench] Error 1
  • error 3
  • make[1]: *** [Makefile:548: all-recursive] Error 1
  • error 4
  • error: Bad exit status from /tmp/B.JgELop/BUILD/tmp/rpm-tmp.50562 (%build)
  • error 5
  • RPM build errors:
  • error 6
  • error: No files produced.

Content:

Making all in tests
Making all in cpu
make[3]: Entering directory '/tmp/B.JgELop/BUILD/sysbench-0.4.12/sysbench/tests/cpu'
x86_64-pld-linux-gcc -DHAVE_CONFIG_H -I. -I../../../config  -D_REENTRANT -D_XOPEN_SOURCE=500 -D_GNU_SOURCE -I../../../sysbench  -pthread -O2 -fwrapv -pipe -Wformat -Werror=format-security -gdwarf-4 -fno-debug-types-section -fvar-tracking-assignments -g2 -Wp,-D_FORTIFY_SOURCE=2 -fstack-protector-strong --param=ssp-buffer-size=4 -fPIC -march=x86-64 -gdwarf-4 -fno-debug-types-section -fvar-tracking-assignments -g2  -MT libsbcpu_a-sb_cpu.o -MD -MP -MF .deps/libsbcpu_a-sb_cpu.Tpo -c -o libsbcpu_a-sb_cpu.o `test -f 'sb_cpu.c' || echo './'`sb_cpu.c
mv -f .deps/libsbcpu_a-sb_cpu.Tpo .deps/libsbcpu_a-sb_cpu.Po
make[3]: Leaving directory '/tmp/B.JgELop/BUILD/sysbench-0.4.12/sysbench/tests/cpu'
make[3]: Entering directory '/tmp/B.JgELop/BUILD/sysbench-0.4.12/sysbench/tests/cpu'
rm -f libsbcpu.a
ar cru libsbcpu.a libsbcpu_a-sb_cpu.o 
ranlib libsbcpu.a
make[3]: Leaving directory '/tmp/B.JgELop/BUILD/sysbench-0.4.12/sysbench/tests/cpu'
Making all in fileio
make[3]: Entering directory '/tmp/B.JgELop/BUILD/sysbench-0.4.12/sysbench/tests/fileio'
x86_64-pld-linux-gcc -DHAVE_CONFIG_H -I. -I../../../config  -D_REENTRANT -D_XOPEN_SOURCE=500 -D_GNU_SOURCE -I../../../sysbench  -pthread -O2 -fwrapv -pipe -Wformat -Werror=format-security -gdwarf-4 -fno-debug-types-section -fvar-tracking-assignments -g2 -Wp,-D_FORTIFY_SOURCE=2 -fstack-protector-strong --param=ssp-buffer-size=4 -fPIC -march=x86-64 -gdwarf-4 -fno-debug-types-section -fvar-tracking-assignments -g2  -MT libsbfileio_a-crc32.o -MD -MP -MF .deps/libsbfileio_a-crc32.Tpo -c -o libsbfileio_a-crc32.o `test -f 'crc32.c' || echo './'`crc32.c
mv -f .deps/libsbfileio_a-crc32.Tpo .deps/libsbfileio_a-crc32.Po
make[3]: Leaving directory '/tmp/B.JgELop/BUILD/sysbench-0.4.12/sysbench/tests/fileio'
make[3]: Entering directory '/tmp/B.JgELop/BUILD/sysbench-0.4.12/sysbench/tests/fileio'
x86_64-pld-linux-gcc -DHAVE_CONFIG_H -I. -I../../../config  -D_REENTRANT -D_XOPEN_SOURCE=500 -D_GNU_SOURCE -I../../../sysbench  -pthread -O2 -fwrapv -pipe -Wformat -Werror=format-security -gdwarf-4 -fno-debug-types-section -fvar-tracking-assignments -g2 -Wp,-D_FORTIFY_SOURCE=2 -fstack-protector-strong --param=ssp-buffer-size=4 -fPIC -march=x86-64 -gdwarf-4 -fno-debug-types-section -fvar-tracking-assignments -g2  -MT libsbfileio_a-sb_fileio.o -MD -MP -MF .deps/libsbfileio_a-sb_fileio.Tpo -c -o libsbfileio_a-sb_fileio.o `test -f 'sb_fileio.c' || echo './'`sb_fileio.c
sb_fileio.c: In function 'sb_memalign':
sb_fileio.c:1791:3: warning: ignoring return value of 'posix_memalign', declared with attribute warn_unused_result [-Wunused-result]
   posix_memalign((void **)&buffer, page_size, size);
   ^~~~~~~~~~~~~~~~~~~~~~~~~~~~~~~~~~~~~~~~~~~~~~~~~
mv -f .deps/libsbfileio_a-sb_fileio.Tpo .deps/libsbfileio_a-sb_fileio.Po
make[3]: Leaving directory '/tmp/B.JgELop/BUILD/sysbench-0.4.12/sysbench/tests/fileio'
make[3]: Entering directory '/tmp/B.JgELop/BUILD/sysbench-0.4.12/sysbench/tests/fileio'
rm -f libsbfileio.a
ar cru libsbfileio.a libsbfileio_a-sb_fileio.o libsbfileio_a-crc32.o 
ranlib libsbfileio.a
make[3]: Leaving directory '/tmp/B.JgELop/BUILD/sysbench-0.4.12/sysbench/tests/fileio'
Making all in memory
make[3]: Entering directory '/tmp/B.JgELop/BUILD/sysbench-0.4.12/sysbench/tests/memory'
x86_64-pld-linux-gcc -DHAVE_CONFIG_H -I. -I../../../config  -D_REENTRANT -D_XOPEN_SOURCE=500 -D_GNU_SOURCE -I../../../sysbench  -pthread -O2 -fwrapv -pipe -Wformat -Werror=format-security -gdwarf-4 -fno-debug-types-section -fvar-tracking-assignments -g2 -Wp,-D_FORTIFY_SOURCE=2 -fstack-protector-strong --param=ssp-buffer-size=4 -fPIC -march=x86-64 -gdwarf-4 -fno-debug-types-section -fvar-tracking-assignments -g2  -MT libsbmemory_a-sb_memory.o -MD -MP -MF .deps/libsbmemory_a-sb_memory.Tpo -c -o libsbmemory_a-sb_memory.o `test -f 'sb_memory.c' || echo './'`sb_memory.c
mv -f .deps/libsbmemory_a-sb_memory.Tpo .deps/libsbmemory_a-sb_memory.Po
make[3]: Leaving directory '/tmp/B.JgELop/BUILD/sysbench-0.4.12/sysbench/tests/memory'
make[3]: Entering directory '/tmp/B.JgELop/BUILD/sysbench-0.4.12/sysbench/tests/memory'
rm -f libsbmemory.a
ar cru libsbmemory.a libsbmemory_a-sb_memory.o 
ranlib libsbmemory.a
make[3]: Leaving directory '/tmp/B.JgELop/BUILD/sysbench-0.4.12/sysbench/tests/memory'
Making all in threads
make[3]: Entering directory '/tmp/B.JgELop/BUILD/sysbench-0.4.12/sysbench/tests/threads'
x86_64-pld-linux-gcc -DHAVE_CONFIG_H -I. -I../../../config  -D_REENTRANT -D_XOPEN_SOURCE=500 -D_GNU_SOURCE -I../../../sysbench  -pthread -O2 -fwrapv -pipe -Wformat -Werror=format-security -gdwarf-4 -fno-debug-types-section -fvar-tracking-assignments -g2 -Wp,-D_FORTIFY_SOURCE=2 -fstack-protector-strong --param=ssp-buffer-size=4 -fPIC -march=x86-64 -gdwarf-4 -fno-debug-types-section -fvar-tracking-assignments -g2  -MT libsbthreads_a-sb_threads.o -MD -MP -MF .deps/libsbthreads_a-sb_threads.Tpo -c -o libsbthreads_a-sb_threads.o `test -f 'sb_threads.c' || echo './'`sb_threads.c
mv -f .deps/libsbthreads_a-sb_threads.Tpo .deps/libsbthreads_a-sb_threads.Po
make[3]: Leaving directory '/tmp/B.JgELop/BUILD/sysbench-0.4.12/sysbench/tests/threads'
make[3]: Entering directory '/tmp/B.JgELop/BUILD/sysbench-0.4.12/sysbench/tests/threads'
rm -f libsbthreads.a
ar cru libsbthreads.a libsbthreads_a-sb_threads.o 
ranlib libsbthreads.a
make[3]: Leaving directory '/tmp/B.JgELop/BUILD/sysbench-0.4.12/sysbench/tests/threads'
Making all in mutex
make[3]: Entering directory '/tmp/B.JgELop/BUILD/sysbench-0.4.12/sysbench/tests/mutex'
x86_64-pld-linux-gcc -DHAVE_CONFIG_H -I. -I../../../config  -D_REENTRANT -D_XOPEN_SOURCE=500 -D_GNU_SOURCE -I../../../sysbench  -pthread -O2 -fwrapv -pipe -Wformat -Werror=format-security -gdwarf-4 -fno-debug-types-section -fvar-tracking-assignments -g2 -Wp,-D_FORTIFY_SOURCE=2 -fstack-protector-strong --param=ssp-buffer-size=4 -fPIC -march=x86-64 -gdwarf-4 -fno-debug-types-section -fvar-tracking-assignments -g2  -MT libsbmutex_a-sb_mutex.o -MD -MP -MF .deps/libsbmutex_a-sb_mutex.Tpo -c -o libsbmutex_a-sb_mutex.o `test -f 'sb_mutex.c' || echo './'`sb_mutex.c
mv -f .deps/libsbmutex_a-sb_mutex.Tpo .deps/libsbmutex_a-sb_mutex.Po
make[3]: Leaving directory '/tmp/B.JgELop/BUILD/sysbench-0.4.12/sysbench/tests/mutex'
make[3]: Entering directory '/tmp/B.JgELop/BUILD/sysbench-0.4.12/sysbench/tests/mutex'
rm -f libsbmutex.a
ar cru libsbmutex.a libsbmutex_a-sb_mutex.o 
ranlib libsbmutex.a
make[3]: Leaving directory '/tmp/B.JgELop/BUILD/sysbench-0.4.12/sysbench/tests/mutex'
Making all in oltp
make[3]: Entering directory '/tmp/B.JgELop/BUILD/sysbench-0.4.12/sysbench/tests/oltp'
x86_64-pld-linux-gcc -DHAVE_CONFIG_H -I. -I../../../config  -I./.. -D_REENTRANT -D_XOPEN_SOURCE=500 -D_GNU_SOURCE -I../../../sysbench -I/usr/include/mysql   -pthread -O2 -fwrapv -pipe -Wformat -Werror=format-security -gdwarf-4 -fno-debug-types-section -fvar-tracking-assignments -g2 -Wp,-D_FORTIFY_SOURCE=2 -fstack-protector-strong --param=ssp-buffer-size=4 -fPIC -march=x86-64 -gdwarf-4 -fno-debug-types-section -fvar-tracking-assignments -g2  -MT libsboltp_a-sb_oltp.o -MD -MP -MF .deps/libsboltp_a-sb_oltp.Tpo -c -o libsboltp_a-sb_oltp.o `test -f 'sb_oltp.c' || echo './'`sb_oltp.c
mv -f .deps/libsboltp_a-sb_oltp.Tpo .deps/libsboltp_a-sb_oltp.Po
make[3]: Leaving directory '/tmp/B.JgELop/BUILD/sysbench-0.4.12/sysbench/tests/oltp'
make[3]: Entering directory '/tmp/B.JgELop/BUILD/sysbench-0.4.12/sysbench/tests/oltp'
rm -f libsboltp.a
ar cru libsboltp.a libsboltp_a-sb_oltp.o 
ranlib libsboltp.a
make[3]: Leaving directory '/tmp/B.JgELop/BUILD/sysbench-0.4.12/sysbench/tests/oltp'
make[3]: Nothing to be done for 'all-am'.
Making all in .
make[2]: Entering directory '/tmp/B.JgELop/BUILD/sysbench-0.4.12/sysbench'
x86_64-pld-linux-gcc -DHAVE_CONFIG_H -I. -I../config  -D_REENTRANT -D_XOPEN_SOURCE=500 -D_GNU_SOURCE -I../sysbench  -pthread -O2 -fwrapv -pipe -Wformat -Werror=format-security -gdwarf-4 -fno-debug-types-section -fvar-tracking-assignments -g2 -Wp,-D_FORTIFY_SOURCE=2 -fstack-protector-strong --param=ssp-buffer-size=4 -fPIC -march=x86-64 -gdwarf-4 -fno-debug-types-section -fvar-tracking-assignments -g2  -MT sb_timer.o -MD -MP -MF .deps/sb_timer.Tpo -c -o sb_timer.o sb_timer.c
mv -f .deps/sb_timer.Tpo .deps/sb_timer.Po
make[2]: Leaving directory '/tmp/B.JgELop/BUILD/sysbench-0.4.12/sysbench'
make[2]: Entering directory '/tmp/B.JgELop/BUILD/sysbench-0.4.12/sysbench'
x86_64-pld-linux-gcc -DHAVE_CONFIG_H -I. -I../config  -D_REENTRANT -D_XOPEN_SOURCE=500 -D_GNU_SOURCE -I../sysbench  -pthread -O2 -fwrapv -pipe -Wformat -Werror=format-security -gdwarf-4 -fno-debug-types-section -fvar-tracking-assignments -g2 -Wp,-D_FORTIFY_SOURCE=2 -fstack-protector-strong --param=ssp-buffer-size=4 -fPIC -march=x86-64 -gdwarf-4 -fno-debug-types-section -fvar-tracking-assignments -g2  -MT db_driver.o -MD -MP -MF .deps/db_driver.Tpo -c -o db_driver.o db_driver.c
mv -f .deps/db_driver.Tpo .deps/db_driver.Po
make[2]: Leaving directory '/tmp/B.JgELop/BUILD/sysbench-0.4.12/sysbench'
make[2]: Entering directory '/tmp/B.JgELop/BUILD/sysbench-0.4.12/sysbench'
x86_64-pld-linux-gcc -DHAVE_CONFIG_H -I. -I../config  -D_REENTRANT -D_XOPEN_SOURCE=500 -D_GNU_SOURCE -I../sysbench  -pthread -O2 -fwrapv -pipe -Wformat -Werror=format-security -gdwarf-4 -fno-debug-types-section -fvar-tracking-assignments -g2 -Wp,-D_FORTIFY_SOURCE=2 -fstack-protector-strong --param=ssp-buffer-size=4 -fPIC -march=x86-64 -gdwarf-4 -fno-debug-types-section -fvar-tracking-assignments -g2  -MT sysbench.o -MD -MP -MF .deps/sysbench.Tpo -c -o sysbench.o sysbench.c
mv -f .deps/sysbench.Tpo .deps/sysbench.Po
make[2]: Leaving directory '/tmp/B.JgELop/BUILD/sysbench-0.4.12/sysbench'
make[2]: Entering directory '/tmp/B.JgELop/BUILD/sysbench-0.4.12/sysbench'
x86_64-pld-linux-gcc -DHAVE_CONFIG_H -I. -I../config  -D_REENTRANT -D_XOPEN_SOURCE=500 -D_GNU_SOURCE -I../sysbench  -pthread -O2 -fwrapv -pipe -Wformat -Werror=format-security -gdwarf-4 -fno-debug-types-section -fvar-tracking-assignments -g2 -Wp,-D_FORTIFY_SOURCE=2 -fstack-protector-strong --param=ssp-buffer-size=4 -fPIC -march=x86-64 -gdwarf-4 -fno-debug-types-section -fvar-tracking-assignments -g2  -MT sb_options.o -MD -MP -MF .deps/sb_options.Tpo -c -o sb_options.o sb_options.c
mv -f .deps/sb_options.Tpo .deps/sb_options.Po
make[2]: Leaving directory '/tmp/B.JgELop/BUILD/sysbench-0.4.12/sysbench'
make[2]: Entering directory '/tmp/B.JgELop/BUILD/sysbench-0.4.12/sysbench'
x86_64-pld-linux-gcc -DHAVE_CONFIG_H -I. -I../config  -D_REENTRANT -D_XOPEN_SOURCE=500 -D_GNU_SOURCE -I../sysbench  -pthread -O2 -fwrapv -pipe -Wformat -Werror=format-security -gdwarf-4 -fno-debug-types-section -fvar-tracking-assignments -g2 -Wp,-D_FORTIFY_SOURCE=2 -fstack-protector-strong --param=ssp-buffer-size=4 -fPIC -march=x86-64 -gdwarf-4 -fno-debug-types-section -fvar-tracking-assignments -g2  -MT sb_logger.o -MD -MP -MF .deps/sb_logger.Tpo -c -o sb_logger.o sb_logger.c
sb_logger.c: In function 'log_errno':
sb_logger.c:335:3: warning: ignoring return value of 'strerror_r', declared with attribute warn_unused_result [-Wunused-result]
   strerror_r(old_errno, errbuf, sizeof(errbuf));
   ^~~~~~~~~~~~~~~~~~~~~~~~~~~~~~~~~~~~~~~~~~~~~
mv -f .deps/sb_logger.Tpo .deps/sb_logger.Po
make[2]: Leaving directory '/tmp/B.JgELop/BUILD/sysbench-0.4.12/sysbench'
make[2]: Entering directory '/tmp/B.JgELop/BUILD/sysbench-0.4.12/sysbench'
/bin/sh ../libtool  --tag=CC   --mode=link x86_64-pld-linux-gcc -pthread -O2 -fwrapv -pipe -Wformat -Werror=format-security -gdwarf-4 -fno-debug-types-section -fvar-tracking-assignments -g2 -Wp,-D_FORTIFY_SOURCE=2 -fstack-protector-strong --param=ssp-buffer-size=4 -fPIC -march=x86-64 -gdwarf-4 -fno-debug-types-section -fvar-tracking-assignments -g2      -Wl,--as-needed -Wl,--no-copy-dt-needed-entries -Wl,-z,relro -Wl,-z,combreloc  -o sysbench sysbench.o sb_timer.o sb_options.o sb_logger.o db_driver.o tests/fileio/libsbfileio.a tests/threads/libsbthreads.a tests/memory/libsbmemory.a tests/cpu/libsbcpu.a tests/oltp/libsboltp.a tests/mutex/libsbmutex.a drivers/mysql/libsbmysql.a -L/usr/lib64 -lmysqlclient_r -lpthread -lz -lm -lrt -latomic -lssl -lcrypto -ldl drivers/pgsql/libsbpgsql.a -L/usr/lib64 -lpq  -laio -lm 
libtool: link: x86_64-pld-linux-gcc -pthread -O2 -fwrapv -pipe -Wformat -Werror=format-security -gdwarf-4 -fno-debug-types-section -fvar-tracking-assignments -g2 -Wp,-D_FORTIFY_SOURCE=2 -fstack-protector-strong --param=ssp-buffer-size=4 -fPIC -march=x86-64 -gdwarf-4 -fno-debug-types-section -fvar-tracking-assignments -g2 -Wl,--as-needed -Wl,--no-copy-dt-needed-entries -Wl,-z -Wl,relro -Wl,-z -Wl,combreloc -o sysbench sysbench.o sb_timer.o sb_options.o sb_logger.o db_driver.o  tests/fileio/libsbfileio.a tests/threads/libsbthreads.a tests/memory/libsbmemory.a tests/cpu/libsbcpu.a tests/oltp/libsboltp.a tests/mutex/libsbmutex.a drivers/mysql/libsbmysql.a -L/usr/lib64 -lmysqlclient_r -lpthread -lz -lrt /usr/lib64/libatomic.so -lssl -lcrypto -ldl drivers/pgsql/libsbpgsql.a -lpq -laio -lm -pthread
/usr/bin/ld: cannot find -lmysqlclient_r
collect2: error: ld returned 1 exit status
make[2]: *** [Makefile:494: sysbench] Error 1
make[2]: Leaving directory '/tmp/B.JgELop/BUILD/sysbench-0.4.12/sysbench'
make[1]: *** [Makefile:548: all-recursive] Error 1
make: *** [Makefile:441: all-recursive] Error 1
error: Bad exit status from /tmp/B.JgELop/BUILD/tmp/rpm-tmp.50562 (%build)


RPM build errors:
    Bad exit status from /tmp/B.JgELop/BUILD/tmp/rpm-tmp.50562 (%build)
ended at: Wed Mar  7 12:01:34 2018, done in 0:00:12.441164
error: No files produced.
mesg: ttyname failed: Inappropriate ioctl for device
+ chmod -R u+rwX /tmp/B.JgELop/BUILD
+ rm -rf /tmp/B.JgELop/tmp /tmp/B.JgELop/BUILD
mesg: ttyname failed: Inappropriate ioctl for device
+ rm -rf /tmp/B.JgELop
Begin-PLD-Builder-Info
Build-Time: user:9.55s sys:1.70s real:14.53s (faults io:0 non-io:1061257)

End-PLD-Builder-Info
[Back to list of logs] [View rpm -qa of builder]