FailedOk

th/SRPMS[OK]
th/x32[OK]
th/i686[OK]
th/x86_64[OK]

ac/SRPMS[OK]
ac/i386[OK]
ac/i586[OK]
ac/i686[OK]
ac/alpha[OK]
ac/amd64[OK]
ac/athlon[OK]
ac/ppc[OK]
ac/sparc[OK]
ac/sparc64[OK]

Advanced Search
main()
Powered by PLD Linux
(c) 2002-2018 PLD Team
$Revision: 1.37 $
Powered by Ken.
Your IP: 54.196.13.210

sysdig c0bc38db-468b-437e-9864-2578d93b7f1d

Status:Failed
Source URL:ftp://buildlogs.pld-linux.org/th/x86_64/FAIL/sysdig,c0bc38db-468b-437e-9864-2578d93b7f1d.bz2
text/plain URL:View!
rpm -qa of builder:View!
Date:2018/06/16 21:56:06
Runtime:0:00:09.364154

Toc:

  • prep
  • Executing(%prep): /bin/sh -e /tmp/B.LUfxIy/BUILD/tmp/rpm-tmp.8019
  • build
  • Executing(%build): /bin/sh -e /tmp/B.LUfxIy/BUILD/tmp/rpm-tmp.8019
  • error 1
  • /tmp/B.LUfxIy/BUILD/sysdig-0.20.0/driver/ppm_events.c:237:10: error: too many arguments to function 'sock->ops->getname'
  • error 2
  • /tmp/B.LUfxIy/BUILD/sysdig-0.20.0/driver/ppm_events.c:258:13: error: too many arguments to function 'sock->ops->getname'
  • error 3
  • /tmp/B.LUfxIy/BUILD/sysdig-0.20.0/driver/ppm_events.c:278:14: error: too many arguments to function 'sock->ops->getname'
  • error 4
  • /tmp/B.LUfxIy/BUILD/sysdig-0.20.0/driver/ppm_events.c:331:13: error: too many arguments to function 'sock->ops->getname'
  • error 5
  • /tmp/B.LUfxIy/BUILD/sysdig-0.20.0/driver/ppm_events.c:333:12: error: too many arguments to function 'sock->ops->getname'
  • error 6
  • /tmp/B.LUfxIy/BUILD/sysdig-0.20.0/driver/ppm_events.c:985:8: error: too many arguments to function 'sock->ops->getname'
  • error 7
  • /tmp/B.LUfxIy/BUILD/sysdig-0.20.0/driver/ppm_events.c:996:10: error: too many arguments to function 'sock->ops->getname'
  • error 8
  • /tmp/B.LUfxIy/BUILD/sysdig-0.20.0/driver/ppm_events.c:1048:10: error: too many arguments to function 'sock->ops->getname'
  • error 9
  • /tmp/B.LUfxIy/BUILD/sysdig-0.20.0/driver/ppm_events.c:1123:11: error: too many arguments to function 'sock->ops->getname'
  • error 10
  • make[1]: *** [scripts/Makefile.build:312: /tmp/B.LUfxIy/BUILD/sysdig-0.20.0/driver/ppm_events.o] Error 1
  • error 11
  • error: Bad exit status from /tmp/B.LUfxIy/BUILD/tmp/rpm-tmp.8019 (%build)
  • error 12
  • RPM build errors:
  • error 13
  • error: No files produced.

Content:

request from: baggins
checking if we should skip the build
started at: Sat Jun 16 21:55:51 2018
killing old processes on a builder
mesg: ttyname failed: Inappropriate ioctl for device
sending signal 9 to pid -1
Killed
fetching https://srcbuilder.pld-linux.org/th//srpms/c0bc38db-468b-437e-9864-2578d93b7f1d/sysdig-kernel-0.20.0-1%404.17.1_1.src.rpm
fetched 774440 bytes, 1452.3 K/s
installing srpm: sysdig-kernel-0.20.0-1@4.17.1_1.src.rpm
mesg: ttyname failed: Inappropriate ioctl for device
+ install -d /tmp/B.LUfxIy/BUILD /tmp/B.LUfxIy/RPMS
+ LC_ALL=en_US.UTF-8
+ rpm -qp --changelog sysdig-kernel-0.20.0-1@4.17.1_1.src.rpm
* Sat Jun 16 2018 PLD Linux Team <feedback@pld-linux.org>
- For complete changelog see: http://git.pld-linux.org/?p=packages/sysdig.git;a=log;h=auto/th/sysdig-0.20.0-1
* Thu Mar 01 2018 Jakub Bogusz <qboosh@pld-linux.org> 012ba1d
- updated to 0.20.0 + rpm -Uhv --nodeps --define '_topdir /tmp/B.LUfxIy' --define '_specdir %{_topdir}' --define '_sourcedir %{_specdir}' --define '_rpmdir %{_topdir}/RPMS' --define '_builddir %{_topdir}/BUILD' --without userspace --define 'build_kernels head,4.14,4.9,4.4' sysdig-kernel-0.20.0-1@4.17.1_1.src.rpm Preparing... ################################################## sysdig-kernel ################################################## + rm -f sysdig-kernel-0.20.0-1@4.17.1_1.src.rpm mesg: ttyname failed: Inappropriate ioctl for device + install -m 700 -d /tmp/B.LUfxIy/BUILD/tmp mesg: ttyname failed: Inappropriate ioctl for device + TMPDIR=/tmp/B.LUfxIy/BUILD/tmp + exec nice -n 0 rpmbuild -bp --short-circuit --nodeps --define '_topdir /tmp/B.LUfxIy' --define '_specdir %{_topdir}' --define '_sourcedir %{_specdir}' --define '_rpmdir %{_topdir}/RPMS' --define '_builddir %{_topdir}/BUILD' --without userspace --target x86_64-pld-linux --define 'build_kernels head,4.14,4.9,4.4' --define 'prep exit 0' /tmp/B.LUfxIy/sysdig.spec Building target platforms: x86_64-pld-linux checking BuildConflict-ing packages no BuildConflicts found checking BR rpm: Building target platforms: x86_64-pld-linux no BR needed building RPM using: set -ex; : build-id: c0bc38db-468b-437e-9864-2578d93b7f1d; TMPDIR=/tmp/B.LUfxIy/BUILD/tmp exec nice -n 0 rpmbuild -bb --define '_smp_mflags -j9' --define '_make_opts -Otarget' --define '_pld_builder 1' --define '_topdir /tmp/B.LUfxIy' --define '_specdir %{_topdir}' --define '_sourcedir %{_specdir}' --define '_rpmdir %{_topdir}/RPMS' --define '_builddir %{_topdir}/BUILD' --without userspace --target x86_64-pld-linux --define 'build_kernels head,4.14,4.9,4.4' /tmp/B.LUfxIy/sysdig.spec mesg: ttyname failed: Inappropriate ioctl for device + : build-id: c0bc38db-468b-437e-9864-2578d93b7f1d + TMPDIR=/tmp/B.LUfxIy/BUILD/tmp + exec nice -n 0 rpmbuild -bb --define '_smp_mflags -j9' --define '_make_opts -Otarget' --define '_pld_builder 1' --define '_topdir /tmp/B.LUfxIy' --define '_specdir %{_topdir}' --define '_sourcedir %{_specdir}' --define '_rpmdir %{_topdir}/RPMS' --define '_builddir %{_topdir}/BUILD' --without userspace --target x86_64-pld-linux --define 'build_kernels head,4.14,4.9,4.4' /tmp/B.LUfxIy/sysdig.spec Building target platforms: x86_64-pld-linux Executing(%prep): /bin/sh -e /tmp/B.LUfxIy/BUILD/tmp/rpm-tmp.8019 + umask 022 + cd /tmp/B.LUfxIy/BUILD + cd /tmp/B.LUfxIy/BUILD + rm -rf sysdig-0.20.0 + /usr/bin/gzip -dc /tmp/B.LUfxIy/sysdig-0.20.0.tar.gz + /bin/tar -xf - + STATUS=0 + '[' 0 -ne 0 ']' + cd sysdig-0.20.0 + /bin/id -u + '[' 1000 '=' 0 ']' + /bin/id -u + '[' 1000 '=' 0 ']' + /bin/chmod -Rf a+rX,u+w,g-w,o-w . + echo 'Patch #0 (buildflags.patch):' Patch #0 (buildflags.patch): + '[' -f /tmp/B.LUfxIy/buildflags.patch ']' + /bin/cat /tmp/B.LUfxIy/buildflags.patch + /usr/bin/patch -s -p1 + exit 0 Executing(%build): /bin/sh -e /tmp/B.LUfxIy/BUILD/tmp/rpm-tmp.8019 TMP=/home/users/builder/tmp HOME=/home/users/builder PATH=/home/users/builder/GNUstep/Tools:/usr/local/bin:/usr/bin:/bin:/home/users/builder/bin TMPDIR=/tmp/B.LUfxIy/BUILD/tmp + umask 022 + cd /tmp/B.LUfxIy/BUILD + cd sysdig-0.20.0 + install -d build + cd build + CC=x86_64-pld-linux-gcc CXX=x86_64-pld-linux-g++ CPPFLAGS= /usr/bin/cmake '-DCMAKE_VERBOSE_MAKEFILE=ON' '-DCMAKE_BUILD_TYPE=PLD' '-DCMAKE_INSTALL_BINDIR:PATH=/usr/bin' '-DCMAKE_INSTALL_SBINDIR:PATH=/usr/sbin' '-DCMAKE_INSTALL_LIBEXECDIR:PATH=/usr/libexec' '-DCMAKE_INSTALL_SYSCONFDIR:PATH=/etc' '-DCMAKE_INSTALL_SHAREDSTATEDIRPATH:PATH=/var/lib' '-DCMAKE_INSTALL_LOCALSTATEDIRPATH:PATH=/var' '-DCMAKE_INSTALL_LIBDIR:PATH=/usr/lib64' '-DCMAKE_INSTALL_INCLUDEDIR:PATH=/usr/include' '-DCMAKE_INSTALL_OLDINCLUDEDIR:PATH=/usr/include' '-DCMAKE_INSTALL_DATAROOTDIR:PATH=/usr/share' '-DCMAKE_INSTALL_DATADIR:PATH=/usr/share' '-DCMAKE_INSTALL_INFODIR:PATH=/usr/share/info' '-DCMAKE_INSTALL_LOCALEDIR:PATH=/usr/share/locale' '-DCMAKE_INSTALL_MANDIR:PATH=/usr/share/man' '-DCMAKE_INSTALL_DOCDIR:PATH=/usr/share/doc' '-DCMAKE_INSTALL_PREFIX:PATH=/usr' '-DSYSCONF_INSTALL_DIR:PATH=/etc' '-DCMAKE_CXX_FLAGS_PLD=-O2 -fwrapv -pipe -Wformat -Werror=format-security -Wp,-D_FORTIFY_SOURCE=2 -fstack-protector-strong --param=ssp-buffer-size=4 -fPIC -march=x86-64 -DNDEBUG -DQT_NO_DEBUG' '-DCMAKE_C_FLAGS_PLD=-O2 -fwrapv -pipe -Wformat -Werror=format-security -Wp,-D_FORTIFY_SOURCE=2 -fstack-protector-strong --param=ssp-buffer-size=4 -fPIC -march=x86-64 -DNDEBUG -DQT_NO_DEBUG' '-DCMAKE_Fortran_FLAGS_PLD=-O2 -fwrapv -pipe -Wformat -Werror=format-security -Wp,-D_FORTIFY_SOURCE=2 -fstack-protector-strong --param=ssp-buffer-size=4 -fPIC -march=x86-64 -DNDEBUG -DQT_NO_DEBUG' '-DCMAKE_EXE_LINKER_FLAGS_PLD=-Wl,--as-needed -Wl,--no-copy-dt-needed-entries -Wl,-z,relro -Wl,-z,combreloc ' '-DCMAKE_SHARED_LINKER_FLAGS_PLD=-Wl,--as-needed -Wl,--no-copy-dt-needed-entries -Wl,-z,relro -Wl,-z,combreloc ' '-DCMAKE_MODULE_LINKER_FLAGS_PLD=-Wl,--as-needed -Wl,--no-copy-dt-needed-entries -Wl,-z,relro -Wl,-z,combreloc ' '-DLIB_SUFFIX=64' '-DBUILD_SHARED_LIBS:BOOL=ON' .. '-DDIR_ETC=/etc' '-DSYSDIG_VERSION=0.20.0-1' '-DBUILD_DRIVER=OFF' '-DUSE_BUNDLED_B64=OFF' '-DUSE_BUNDLED_CURL=OFF' '-DUSE_BUNDLED_JQ=OFF' '-DUSE_BUNDLED_JSONCPP=OFF' '-DUSE_BUNDLED_LUAJIT=OFF' '-DUSE_BUNDLED_NCURSES=OFF' '-DUSE_BUNDLED_OPENSSL=OFF' '-DUSE_BUNDLED_ZLIB=OFF' -- The C compiler identification is GNU 7.3.0 -- The CXX compiler identification is GNU 7.3.0 -- Check for working C compiler: /usr/bin/x86_64-pld-linux-gcc -- Check for working C compiler: /usr/bin/x86_64-pld-linux-gcc -- works -- Detecting C compiler ABI info -- Detecting C compiler ABI info - done -- Detecting C compile features -- Detecting C compile features - done -- Check for working CXX compiler: /usr/bin/x86_64-pld-linux-g++ -- Check for working CXX compiler: /usr/bin/x86_64-pld-linux-g++ -- works -- Detecting CXX compiler ABI info -- Detecting CXX compiler ABI info - done -- Detecting CXX compile features -- Detecting CXX compile features - done -- Found LuaJIT: include: /usr/include/luajit-2.0, lib: /usr/lib64/libluajit-5.1.so -- Found jsoncpp: include: /usr/include/jsoncpp, lib: /usr/lib64/libjsoncpp.so -- Found zlib: include: /usr/include, lib: /usr/lib64/libz.so -- Found jq: include: /usr/include, lib: /usr/lib64/libjq.so -- Looking for wsyncup in /usr/lib64/libcurses.so -- Looking for wsyncup in /usr/lib64/libcurses.so - found -- Looking for cbreak in /usr/lib64/libncurses.so -- Looking for cbreak in /usr/lib64/libncurses.so - found -- Found Curses: /usr/lib64/libncurses.so -- Found ncurses: include: /usr/include, lib: /usr/lib64/libncurses.so;/usr/lib64/libform.so -- Found b64: include: /usr/include, lib: /usr/lib64/libb64.so -- Found OpenSSL: /usr/lib64/libcrypto.so (found version "1.0.2o") -- Found OpenSSL: include: /usr/include, lib: /usr/lib64/libssl.so;/usr/lib64/libcrypto.so -- Found CURL: /usr/lib64/libcurl.so (found version "7.60.0") -- Found CURL: include: /usr/include, lib: /usr/lib64/libcurl.so -- Configuring done -- Generating done CMake Warning: Manually-specified variables were not used by the project: CMAKE_Fortran_FLAGS_PLD CMAKE_INSTALL_BINDIR CMAKE_INSTALL_DATADIR CMAKE_INSTALL_DATAROOTDIR CMAKE_INSTALL_DOCDIR CMAKE_INSTALL_INCLUDEDIR CMAKE_INSTALL_INFODIR CMAKE_INSTALL_LIBDIR CMAKE_INSTALL_LIBEXECDIR CMAKE_INSTALL_LOCALEDIR CMAKE_INSTALL_LOCALSTATEDIRPATH CMAKE_INSTALL_MANDIR CMAKE_INSTALL_OLDINCLUDEDIR CMAKE_INSTALL_SBINDIR CMAKE_INSTALL_SHAREDSTATEDIRPATH CMAKE_INSTALL_SYSCONFDIR CMAKE_MODULE_LINKER_FLAGS_PLD CMAKE_SHARED_LINKER_FLAGS_PLD LIB_SUFFIX SYSCONF_INSTALL_DIR -- Build files have been written to: /tmp/B.LUfxIy/BUILD/sysdig-0.20.0/build + cd .. + cp -f build/driver/Makefile.dkms driver/Makefile + cd driver + compile + typeset 'L=<' PATCH_SH + set -e -x + '[' -r /usr/src/linux/.config ']' + rm -rf o + install -d o/include/linux o/include/generated o/arch/x86/include o/arch/powerpc/lib + ln -sf /usr/src/linux/.config o/.config + ln -sf /usr/src/linux/Module.symvers o/Module.symvers + '[' -f /usr/src/linux/include/generated/autoconf.h ']' + ln -sf /usr/src/linux/include/generated/autoconf.h o/include/generated/autoconf.h + ln -s ../generated/autoconf.h o/include/linux/autoconf.h + '[' -d /usr/src/linux/arch/x86/include/generated ']' + ln -s /usr/src/linux/arch/x86/include/generated o/arch/x86/include + set +x + install -d o/include/config + touch o/include/config/MARKER + ln -sf /usr/src/linux/include/config/auto.conf o/include/config/auto.conf + ln -sf /usr/src/linux/scripts o/scripts + /usr/bin/make -Otarget -j9 -C /usr/src/linux clean 'RCS_FIND_IGNORE=-name '\''*.[ks]o'\'' -o' 'M=/tmp/B.LUfxIy/BUILD/sysdig-0.20.0/driver' 'HOSTCC=x86_64-pld-linux-gcc' 'SYSSRC=/usr/src/linux' 'SYSOUT=/tmp/B.LUfxIy/BUILD/sysdig-0.20.0/driver/o' 'CC=x86_64-pld-linux-gcc' + /usr/bin/make -Otarget -j9 -C /usr/src/linux modules 'M=/tmp/B.LUfxIy/BUILD/sysdig-0.20.0/driver' 'CONSTIFY_PLUGIN=' 'HOSTCC=x86_64-pld-linux-gcc' 'SYSSRC=/usr/src/linux' 'SYSOUT=/tmp/B.LUfxIy/BUILD/sysdig-0.20.0/driver/o' 'CC=x86_64-pld-linux-gcc' CC [M] /tmp/B.LUfxIy/BUILD/sysdig-0.20.0/driver/dynamic_params_table.o CC [M] /tmp/B.LUfxIy/BUILD/sysdig-0.20.0/driver/flags_table.o CC [M] /tmp/B.LUfxIy/BUILD/sysdig-0.20.0/driver/event_table.o CC [M] /tmp/B.LUfxIy/BUILD/sysdig-0.20.0/driver/ppm_cputime.o CC [M] /tmp/B.LUfxIy/BUILD/sysdig-0.20.0/driver/ppm_events.o /tmp/B.LUfxIy/BUILD/sysdig-0.20.0/driver/ppm_events.c: In function 'compute_snaplen': /tmp/B.LUfxIy/BUILD/sysdig-0.20.0/driver/ppm_events.c:237:69: warning: passing argument 3 of 'sock->ops->getname' makes integer from pointer without a cast [-Wint-conversion] err = sock->ops->getname(sock, (struct sockaddr *)&sock_address, &sock_address_len, 0); ^ /tmp/B.LUfxIy/BUILD/sysdig-0.20.0/driver/ppm_events.c:237:69: note: expected 'int' but argument is of type 'int *' /tmp/B.LUfxIy/BUILD/sysdig-0.20.0/driver/ppm_events.c:237:10: error: too many arguments to function 'sock->ops->getname' err = sock->ops->getname(sock, (struct sockaddr *)&sock_address, &sock_address_len, 0); ^~~~ /tmp/B.LUfxIy/BUILD/sysdig-0.20.0/driver/ppm_events.c:258:72: warning: passing argument 3 of 'sock->ops->getname' makes integer from pointer without a cast [-Wint-conversion] err = sock->ops->getname(sock, (struct sockaddr *)&peer_address, &peer_address_len, 1); ^ /tmp/B.LUfxIy/BUILD/sysdig-0.20.0/driver/ppm_events.c:258:72: note: expected 'int' but argument is of type 'int *' /tmp/B.LUfxIy/BUILD/sysdig-0.20.0/driver/ppm_events.c:258:13: error: too many arguments to function 'sock->ops->getname' err = sock->ops->getname(sock, (struct sockaddr *)&peer_address, &peer_address_len, 1); ^~~~ /tmp/B.LUfxIy/BUILD/sysdig-0.20.0/driver/ppm_events.c:278:73: warning: passing argument 3 of 'sock->ops->getname' makes integer from pointer without a cast [-Wint-conversion] err = sock->ops->getname(sock, (struct sockaddr *)&peer_address, &peer_address_len, 1); ^ /tmp/B.LUfxIy/BUILD/sysdig-0.20.0/driver/ppm_events.c:278:73: note: expected 'int' but argument is of type 'int *' /tmp/B.LUfxIy/BUILD/sysdig-0.20.0/driver/ppm_events.c:278:14: error: too many arguments to function 'sock->ops->getname' err = sock->ops->getname(sock, (struct sockaddr *)&peer_address, &peer_address_len, 1); ^~~~ /tmp/B.LUfxIy/BUILD/sysdig-0.20.0/driver/ppm_events.c:331:72: warning: passing argument 3 of 'sock->ops->getname' makes integer from pointer without a cast [-Wint-conversion] err = sock->ops->getname(sock, (struct sockaddr *)&peer_address, &peer_address_len, 1); ^ /tmp/B.LUfxIy/BUILD/sysdig-0.20.0/driver/ppm_events.c:331:72: note: expected 'int' but argument is of type 'int *' /tmp/B.LUfxIy/BUILD/sysdig-0.20.0/driver/ppm_events.c:331:13: error: too many arguments to function 'sock->ops->getname' err = sock->ops->getname(sock, (struct sockaddr *)&peer_address, &peer_address_len, 1); ^~~~ /tmp/B.LUfxIy/BUILD/sysdig-0.20.0/driver/ppm_events.c:333:71: warning: passing argument 3 of 'sock->ops->getname' makes integer from pointer without a cast [-Wint-conversion] err = sock->ops->getname(sock, (struct sockaddr *)&peer_address, &peer_address_len, 1); ^ /tmp/B.LUfxIy/BUILD/sysdig-0.20.0/driver/ppm_events.c:333:71: note: expected 'int' but argument is of type 'int *' /tmp/B.LUfxIy/BUILD/sysdig-0.20.0/driver/ppm_events.c:333:12: error: too many arguments to function 'sock->ops->getname' err = sock->ops->getname(sock, (struct sockaddr *)&peer_address, &peer_address_len, 1); ^~~~ /tmp/B.LUfxIy/BUILD/sysdig-0.20.0/driver/ppm_events.c: In function 'fd_to_socktuple': /tmp/B.LUfxIy/BUILD/sysdig-0.20.0/driver/ppm_events.c:985:67: warning: passing argument 3 of 'sock->ops->getname' makes integer from pointer without a cast [-Wint-conversion] err = sock->ops->getname(sock, (struct sockaddr *)&sock_address, &sock_address_len, 0); ^ /tmp/B.LUfxIy/BUILD/sysdig-0.20.0/driver/ppm_events.c:985:67: note: expected 'int' but argument is of type 'int *' /tmp/B.LUfxIy/BUILD/sysdig-0.20.0/driver/ppm_events.c:985:8: error: too many arguments to function 'sock->ops->getname' err = sock->ops->getname(sock, (struct sockaddr *)&sock_address, &sock_address_len, 0); ^~~~ /tmp/B.LUfxIy/BUILD/sysdig-0.20.0/driver/ppm_events.c:996:69: warning: passing argument 3 of 'sock->ops->getname' makes integer from pointer without a cast [-Wint-conversion] err = sock->ops->getname(sock, (struct sockaddr *)&peer_address, &peer_address_len, 1); ^ /tmp/B.LUfxIy/BUILD/sysdig-0.20.0/driver/ppm_events.c:996:69: note: expected 'int' but argument is of type 'int *' /tmp/B.LUfxIy/BUILD/sysdig-0.20.0/driver/ppm_events.c:996:10: error: too many arguments to function 'sock->ops->getname' err = sock->ops->getname(sock, (struct sockaddr *)&peer_address, &peer_address_len, 1); ^~~~ /tmp/B.LUfxIy/BUILD/sysdig-0.20.0/driver/ppm_events.c:1048:69: warning: passing argument 3 of 'sock->ops->getname' makes integer from pointer without a cast [-Wint-conversion] err = sock->ops->getname(sock, (struct sockaddr *)&peer_address, &peer_address_len, 1); ^ /tmp/B.LUfxIy/BUILD/sysdig-0.20.0/driver/ppm_events.c:1048:69: note: expected 'int' but argument is of type 'int *' /tmp/B.LUfxIy/BUILD/sysdig-0.20.0/driver/ppm_events.c:1048:10: error: too many arguments to function 'sock->ops->getname' err = sock->ops->getname(sock, (struct sockaddr *)&peer_address, &peer_address_len, 1); ^~~~ /tmp/B.LUfxIy/BUILD/sysdig-0.20.0/driver/ppm_events.c:1123:70: warning: passing argument 3 of 'sock->ops->getname' makes integer from pointer without a cast [-Wint-conversion] err = sock->ops->getname(sock, (struct sockaddr *)&peer_address, &peer_address_len, 1); ^ /tmp/B.LUfxIy/BUILD/sysdig-0.20.0/driver/ppm_events.c:1123:70: note: expected 'int' but argument is of type 'int *' /tmp/B.LUfxIy/BUILD/sysdig-0.20.0/driver/ppm_events.c:1123:11: error: too many arguments to function 'sock->ops->getname' err = sock->ops->getname(sock, (struct sockaddr *)&peer_address, &peer_address_len, 1); ^~~~ make[1]: *** [scripts/Makefile.build:312: /tmp/B.LUfxIy/BUILD/sysdig-0.20.0/driver/ppm_events.o] Error 1 make[1]: *** Waiting for unfinished jobs.... CC [M] /tmp/B.LUfxIy/BUILD/sysdig-0.20.0/driver/syscall_table.o CC [M] /tmp/B.LUfxIy/BUILD/sysdig-0.20.0/driver/main.o CC [M] /tmp/B.LUfxIy/BUILD/sysdig-0.20.0/driver/ppm_fillers.o make: *** [Makefile:1571: _module_/tmp/B.LUfxIy/BUILD/sysdig-0.20.0/driver] Error 2 error: Bad exit status from /tmp/B.LUfxIy/BUILD/tmp/rpm-tmp.8019 (%build) RPM build errors: Bad exit status from /tmp/B.LUfxIy/BUILD/tmp/rpm-tmp.8019 (%build) ended at: Sat Jun 16 21:56:06 2018, done in 0:00:09.364154 error: No files produced. mesg: ttyname failed: Inappropriate ioctl for device + chmod -R u+rwX /tmp/B.LUfxIy/BUILD + rm -rf /tmp/B.LUfxIy/tmp /tmp/B.LUfxIy/BUILD mesg: ttyname failed: Inappropriate ioctl for device + rm -rf /tmp/B.LUfxIy Begin-PLD-Builder-Info Build-Time: user:12.04s sys:2.28s real:15.16s (faults io:0 non-io:912246) End-PLD-Builder-Info
[Back to list of logs] [View rpm -qa of builder]