FailedOk

th/SRPMS[OK]
th/x32[OK]
th/i686[OK]
th/x86_64[OK]

ac/SRPMS[OK]
ac/i386[OK]
ac/i586[OK]
ac/i686[OK]
ac/alpha[OK]
ac/amd64[OK]
ac/athlon[OK]
ac/ppc[OK]
ac/sparc[OK]
ac/sparc64[OK]

Advanced Search
main()
Powered by PLD Linux
(c) 2002-2017 PLD Team
$Revision: 1.37 $
Powered by Lunatic Corp.
Your IP: 54.226.34.209

texlive 5534528d-2b79-47a7-9d04-a10f8da0f470

Status:Failed
Source URL:ftp://buildlogs.pld-linux.org/th/x86_64/FAIL/texlive,5534528d-2b79-47a7-9d04-a10f8da0f470.bz2
text/plain URL:View!
full text:View!
rpm -qa of builder:View!
Date:2017/12/07 09:52:50
Runtime:0:01:54.126473

Toc:

  • error 1
  • TECkit-2.5.3/source/NormalizationData.c:2575:1: error: narrowing conversion of '69786' from 'int' to 'UInt16 {aka short unsigned int}' inside { } [-Wnarrowing]
  • error 2
  • TECkit-2.5.3/source/NormalizationData.c:2575:1: error: narrowing conversion of '69788' from 'int' to 'UInt16 {aka short unsigned int}' inside { } [-Wnarrowing]
  • error 3
  • TECkit-2.5.3/source/NormalizationData.c:2575:1: error: narrowing conversion of '69803' from 'int' to 'UInt16 {aka short unsigned int}' inside { } [-Wnarrowing]
  • error 4
  • error: Bad exit status from /tmp/B.n2AIzJ/BUILD/tmp/rpm-tmp.93157 (%build)
  • error 5
  • RPM build errors:
  • error 6
  • error: No files produced.

Content:

checking whether x86_64-pld-linux-gcc understands -c and -o together... yes
checking dependency style of x86_64-pld-linux-gcc... gcc3
checking whether to enable maintainer-specific portions of Makefiles... no
checking whether the compiler accepts prototypes... yes
checking what warning flags to pass to the C compiler... -Wimplicit -Wreturn-type
checking for x86_64-pld-linux-gcc... (cached) x86_64-pld-linux-gcc
checking whether we are using the GNU C compiler... (cached) yes
checking whether x86_64-pld-linux-gcc accepts -g... (cached) yes
checking for x86_64-pld-linux-gcc option to accept ISO C89... (cached) none needed
checking whether x86_64-pld-linux-gcc understands -c and -o together... (cached) yes
checking dependency style of x86_64-pld-linux-gcc... (cached) gcc3
checking whether we are using the GNU C++ compiler... yes
checking whether x86_64-pld-linux-g++ accepts -g... yes
checking dependency style of x86_64-pld-linux-g++... gcc3
checking what warning flags to pass to the C++ compiler... -Wreturn-type -Wno-write-strings
checking for x86_64-pld-linux-ranlib... no
checking for ranlib... ranlib
checking whether ln -s works... yes
checking that generated files are newer than configure... done
configure: creating ./config.status
config.status: creating Makefile
config.status: creating include/graphite2/Makefile
config.status: creating config.h
config.status: executing depfiles commands
=== configuring in teckit (/tmp/B.n2AIzJ/BUILD/texlive-20140525-source/libs/teckit)
make: running /bin/sh './configure'  '--disable-option-checking' '--prefix=/usr' 'LDFLAGS=-Wl,--as-needed -Wl,--no-copy-dt-needed-entries -Wl,-z,relro -Wl,-z,combreloc ' 'CFLAGS=-O2 -fwrapv -pipe -Wformat -Werror=format-security -gdwarf-4 -fno-debug-types-section -fvar-tracking-assignments -g2 -Wp,-D_FORTIFY_SOURCE=2 -fstack-protector-strong --param=ssp-buffer-size=4 -fPIC -march=x86-64 -gdwarf-4 -fno-debug-types-section -fvar-tracking-assignments -g2 ' 'CXXFLAGS=-O2 -fwrapv -pipe -Wformat -Werror=format-security -gdwarf-4 -fno-debug-types-section -fvar-tracking-assignments -g2 -Wp,-D_FORTIFY_SOURCE=2 -fstack-protector-strong --param=ssp-buffer-size=4 -fPIC -march=x86-64 -gdwarf-4 -fno-debug-types-section -fvar-tracking-assignments -g2 ' 'FFLAGS=-O2 -fwrapv -pipe -Wformat -Werror=format-security -gdwarf-4 -fno-debug-types-section -fvar-tracking-assignments -g2 -Wp,-D_FORTIFY_SOURCE=2 -fstack-protector-strong --param=ssp-buffer-size=4 -fPIC -march=x86-64 -gdwarf-4 -fno-debug-types-section -fvar-tracking-assignments -g2 ' 'FCFLAGS=-O2 -fwrapv -pipe -Wformat -Werror=format-security -gdwarf-4 -fno-debug-types-section -fvar-tracking-assignments -g2 -Wp,-D_FORTIFY_SOURCE=2 -fstack-protector-strong --param=ssp-buffer-size=4 -fPIC -march=x86-64 -gdwarf-4 -fno-debug-types-section -fvar-tracking-assignments -g2 ' 'CPPFLAGS= -DHAVE_PROTOTYPES' 'CC=x86_64-pld-linux-gcc' 'CXX=x86_64-pld-linux-g++' '--host=x86_64-pld-linux' '--build=x86_64-pld-linux' '--exec-prefix=/usr' '--bindir=/usr/bin' '--sbindir=/usr/sbin' '--sysconfdir=/etc' '--datadir=/usr/share' '--includedir=/usr/include' '--libdir=/usr/lib64' '--libexecdir=/usr/libexec' '--localstatedir=/var/lib/texmf' '--sharedstatedir=/var/lib' '--mandir=/usr/share/man' '--infodir=/usr/share/info' '--x-libraries=/usr/lib64' '--disable-xindy' '--disable-native-texlive-build' '--without-luatex' '--disable-multiplatform' '--disable-static' '--enable-a4' '--enable-gf' '--enable-ipc' '--enable-shared' '--enable-ttf2pk2' '--disable-t1utils' '--with-fontconfig' '--with-fonts-dir=/var/cache/fonts' '--with-ncurses' '--with-system-freetype' '--with-freetype-includes=/usr/include/freetype' '--with-system-freetype2' '--with-system-gd' '--with-system-ncurses' '--with-system-pnglib' '--with-system-t1lib' '--with-system-zlib' '--with-system-harfbuzz' '--with-system-icu' '--with-system-graphite2' '--with-system-zziplib' '--with-system-poppler' '--with-system-cairo' '--with-system-pixman' '--with-xdvi-x-toolkit=xaw' '--without-dialog' '--without-t1utils' '--without-texinfo' '--enable-build-in-source-tree' 'build_alias=x86_64-pld-linux' 'host_alias=x86_64-pld-linux' '--enable-largefile' '--disable-silent-rules' '--enable-cxx-runtime-hack=no' '--enable-libtool-hack=yes' '--enable-texlive-build' '--with-x' '--enable-m-tx=yes' '--enable-pmx=yes' '--enable-ps2eps=yes' '--enable-texdoctk=yes' '--enable-tpic2pdftex=yes' '--enable-vlna=yes' '--with-clisp-runtime=system' '--enable-xpdfopen=yes' '--enable-web2c=yes' '--enable-afm2pl=yes' '--enable-bibtex-x=yes' '--enable-chktex=yes' '--enable-cjkutils=yes' '--enable-detex=yes' '--enable-devnag=yes' '--enable-dtl=yes' '--enable-dvi2tty=yes' '--enable-dvidvi=yes' '--enable-dviljk=yes' '--enable-dvipdfm-x=yes' '--enable-dvipng=yes' '--enable-dvipos=yes' '--enable-dvipsk=yes' '--enable-dvisvgm=yes' '--enable-gsftopk=yes' '--enable-lacheck=yes' '--enable-lcdf-typetools=yes' '--enable-makeindexk=yes' '--enable-makejvf=yes' '--enable-mendexk=yes' '--enable-ps2pkm=yes' '--enable-psutils=yes' '--enable-seetexk=yes' '--enable-tex4htk=yes' '--enable-ttfdump=yes' '--enable-xdvik=yes' '--enable-texlive=yes' '--with-system-teckit=no' '--with-system-xpdf=no' '--with-system-potrace=no' '--with-system-libpng' '--with-system-libpaper=no' '--with-system-ptexenc=no' '--with-system-kpathsea=no' '--cache-file=/dev/null' '--srcdir=.'
checking for a BSD-compatible install... /usr/bin/install -c
checking whether build environment is sane... yes
checking for a thread-safe mkdir -p... /bin/mkdir -p
checking for gawk... gawk
checking whether make sets $(MAKE)... yes
checking whether make supports nested variables... yes
checking for style of include used by make... GNU
checking for x86_64-pld-linux-gcc... x86_64-pld-linux-gcc
checking whether the C compiler works... yes
checking for C compiler default output file name... a.out
checking for suffix of executables... 
checking whether we are cross compiling... no
checking for suffix of object files... o
checking whether we are using the GNU C compiler... yes
checking whether x86_64-pld-linux-gcc accepts -g... yes
checking for x86_64-pld-linux-gcc option to accept ISO C89... none needed
checking whether x86_64-pld-linux-gcc understands -c and -o together... yes
checking dependency style of x86_64-pld-linux-gcc... gcc3
checking whether to enable maintainer-specific portions of Makefiles... no
checking whether the compiler accepts prototypes... yes
checking what warning flags to pass to the C compiler... -Wimplicit -Wreturn-type
checking whether we are using the GNU C++ compiler... yes
checking whether x86_64-pld-linux-g++ accepts -g... yes
checking dependency style of x86_64-pld-linux-g++... gcc3
checking what warning flags to pass to the C++ compiler... -Wreturn-type -Wno-write-strings
checking for x86_64-pld-linux-gcc... (cached) x86_64-pld-linux-gcc
checking whether we are using the GNU C compiler... (cached) yes
checking whether x86_64-pld-linux-gcc accepts -g... (cached) yes
checking for x86_64-pld-linux-gcc option to accept ISO C89... (cached) none needed
checking whether x86_64-pld-linux-gcc understands -c and -o together... (cached) yes
checking dependency style of x86_64-pld-linux-gcc... (cached) gcc3
checking for x86_64-pld-linux-ranlib... no
checking for ranlib... ranlib
checking whether ln -s works... yes
checking build system type... x86_64-pld-linux-gnu
checking host system type... x86_64-pld-linux-gnu
checking how to run the C++ preprocessor... x86_64-pld-linux-g++ -E
checking for grep that handles long lines and -e... /bin/grep
checking for egrep... /bin/grep -E
checking for ANSI C header files... yes
checking for sys/types.h... yes
checking for sys/stat.h... yes
checking for stdlib.h... yes
checking for string.h... yes
checking for memory.h... yes
checking for strings.h... yes
checking for inttypes.h... yes
checking for stdint.h... yes
checking for unistd.h... yes
checking how to run the C preprocessor... x86_64-pld-linux-gcc -E
checking for ANSI C header files... (cached) yes
checking for stdlib.h... (cached) yes
checking for string.h... (cached) yes
checking whether byte ordering is bigendian... no
checking if <zlib.h> defines 'z_const'... yes
checking for compress... yes
checking zlib.h usability... yes
checking zlib.h presence... yes
checking for zlib.h... yes
checking that generated files are newer than configure... done
configure: creating ./config.status
config.status: creating Makefile
config.status: creating include/teckit/Makefile
config.status: creating config.h
config.status: executing depfiles commands
Making all in teckit
/usr/bin/make  all-recursive
Making all in .
make[5]: Entering directory '/tmp/B.n2AIzJ/BUILD/texlive-20140525-source/libs/teckit'
depbase=`echo TECkit-2.5.3/source/Engine.o | sed 's|[^/]*$|.deps/&|;s|\.o$||'`;\
x86_64-pld-linux-g++ -DHAVE_CONFIG_H -I.  -I./TECkit-2.5.3/source/Public-headers  -DNDEBUG -DHAVE_PROTOTYPES -Wreturn-type -Wno-write-strings -O2 -fwrapv -pipe -Wformat -Werror=format-security -gdwarf-4 -fno-debug-types-section -fvar-tracking-assignments -g2 -Wp,-D_FORTIFY_SOURCE=2 -fstack-protector-strong --param=ssp-buffer-size=4 -fPIC -march=x86-64 -gdwarf-4 -fno-debug-types-section -fvar-tracking-assignments -g2  -MT TECkit-2.5.3/source/Engine.o -MD -MP -MF $depbase.Tpo -c -o TECkit-2.5.3/source/Engine.o TECkit-2.5.3/source/Engine.cpp &&\
mv -f $depbase.Tpo $depbase.Po
In file included from TECkit-2.5.3/source/Engine.cpp:120:0:
TECkit-2.5.3/source/NormalizationData.c:2575:1: error: narrowing conversion of '69786' from 'int' to 'UInt16 {aka short unsigned int}' inside { } [-Wnarrowing]
 };
 ^
TECkit-2.5.3/source/NormalizationData.c:2575:1: error: narrowing conversion of '69788' from 'int' to 'UInt16 {aka short unsigned int}' inside { } [-Wnarrowing]
TECkit-2.5.3/source/NormalizationData.c:2575:1: error: narrowing conversion of '69803' from 'int' to 'UInt16 {aka short unsigned int}' inside { } [-Wnarrowing]
make[5]: *** [Makefile:757: TECkit-2.5.3/source/Engine.o] Error 1
make[5]: Leaving directory '/tmp/B.n2AIzJ/BUILD/texlive-20140525-source/libs/teckit'
make[5]: *** Waiting for unfinished jobs....
make[5]: Entering directory '/tmp/B.n2AIzJ/BUILD/texlive-20140525-source/libs/teckit'
depbase=`echo TECkit-2.5.3/source/UnicodeNames.o | sed 's|[^/]*$|.deps/&|;s|\.o$||'`;\
x86_64-pld-linux-g++ -DHAVE_CONFIG_H -I.  -I./TECkit-2.5.3/source/Public-headers  -DNDEBUG -DHAVE_PROTOTYPES -Wreturn-type -Wno-write-strings -O2 -fwrapv -pipe -Wformat -Werror=format-security -gdwarf-4 -fno-debug-types-section -fvar-tracking-assignments -g2 -Wp,-D_FORTIFY_SOURCE=2 -fstack-protector-strong --param=ssp-buffer-size=4 -fPIC -march=x86-64 -gdwarf-4 -fno-debug-types-section -fvar-tracking-assignments -g2  -MT TECkit-2.5.3/source/UnicodeNames.o -MD -MP -MF $depbase.Tpo -c -o TECkit-2.5.3/source/UnicodeNames.o TECkit-2.5.3/source/UnicodeNames.cpp &&\
mv -f $depbase.Tpo $depbase.Po
make[5]: Leaving directory '/tmp/B.n2AIzJ/BUILD/texlive-20140525-source/libs/teckit'
make[5]: Entering directory '/tmp/B.n2AIzJ/BUILD/texlive-20140525-source/libs/teckit'
depbase=`echo TECkit-2.5.3/source/Compiler.o | sed 's|[^/]*$|.deps/&|;s|\.o$||'`;\
x86_64-pld-linux-g++ -DHAVE_CONFIG_H -I.  -I./TECkit-2.5.3/source/Public-headers  -DNDEBUG -DHAVE_PROTOTYPES -Wreturn-type -Wno-write-strings -O2 -fwrapv -pipe -Wformat -Werror=format-security -gdwarf-4 -fno-debug-types-section -fvar-tracking-assignments -g2 -Wp,-D_FORTIFY_SOURCE=2 -fstack-protector-strong --param=ssp-buffer-size=4 -fPIC -march=x86-64 -gdwarf-4 -fno-debug-types-section -fvar-tracking-assignments -g2  -MT TECkit-2.5.3/source/Compiler.o -MD -MP -MF $depbase.Tpo -c -o TECkit-2.5.3/source/Compiler.o TECkit-2.5.3/source/Compiler.cpp &&\
mv -f $depbase.Tpo $depbase.Po
make[5]: Leaving directory '/tmp/B.n2AIzJ/BUILD/texlive-20140525-source/libs/teckit'
make[4]: *** [Makefile:779: all-recursive] Error 1
make[3]: *** [Makefile:605: all] Error 2
make[2]: *** [Makefile:875: recurse] Error 1
make[1]: *** [Makefile:455: all-recursive] Error 1
make: *** [Makefile:544: all-recursive] Error 1
error: Bad exit status from /tmp/B.n2AIzJ/BUILD/tmp/rpm-tmp.93157 (%build)


RPM build errors:
    Bad exit status from /tmp/B.n2AIzJ/BUILD/tmp/rpm-tmp.93157 (%build)
ended at: Thu Dec  7 09:52:49 2017, done in 0:01:54.126473
error: No files produced.
mesg: ttyname failed: Inappropriate ioctl for device
+ chmod -R u+rwX /tmp/B.n2AIzJ/BUILD
+ rm -rf /tmp/B.n2AIzJ/tmp /tmp/B.n2AIzJ/BUILD
mesg: ttyname failed: Inappropriate ioctl for device
+ rm -rf /tmp/B.n2AIzJ
Begin-PLD-Builder-Info
Build-Time: user:84.77s sys:13.81s real:123.95s (faults io:0 non-io:8557127)

End-PLD-Builder-Info
[Back to list of logs] [View rpm -qa of builder]