FailedOk

th/SRPMS[OK]
th/x32[OK]
th/i686[OK]
th/x86_64[OK]

ac/SRPMS[OK]
ac/i386[OK]
ac/i586[OK]
ac/i686[OK]
ac/alpha[OK]
ac/amd64[OK]
ac/athlon[OK]
ac/ppc[OK]
ac/sparc[OK]
ac/sparc64[OK]

Advanced Search
main()
Powered by PLD Linux
(c) 2002-2018 PLD Team
$Revision: 1.37 $
Powered by X.
Your IP: 54.236.230.108

thrift 9F3CB4BC-3443-4F0C-99DC-27C3AEAC8CE1

Status:Failed
Source URL:ftp://buildlogs.pld-linux.org/th/x86_64/FAIL/thrift,9F3CB4BC-3443-4F0C-99DC-27C3AEAC8CE1.bz2
text/plain URL:View!
full text:View!
rpm -qa of builder:View!
Date:2018/09/27 15:58:06
Runtime:0:08:56.887128

Toc:

  • error 1
  • warning: spurious network error (2 tries remaining): curl error: Could not resolve: github.com (Could not contact DNS servers)
  • error 2
  • warning: spurious network error (1 tries remaining): curl error: Could not resolve: github.com (Could not contact DNS servers)
  • error 3
  • error: failed to load source for a dependency on `byteorder`
  • error 4
  • curl error: Could not resolve: github.com (Could not contact DNS servers)
  • error 5
  • make[4]: *** [Makefile:820: all-local] Error 101
  • error 6
  • make[3]: *** [Makefile:534: all-recursive] Error 1
  • error 7
  • make[2]: *** [Makefile:575: all-recursive] Error 1
  • error 8
  • make[1]: *** [Makefile:659: all-recursive] Error 1
  • error 9
  • error: Bad exit status from /tmp/B.IJFt9D/BUILD/tmp/rpm-tmp.66283 (%build)
  • error 10
  • RPM build errors:
  • error 11
  • error: No files produced.

Content:

creating build
creating build/lib.linux-x86_64-3.7
creating build/lib.linux-x86_64-3.7/thrift
copying src/TRecursive.py -> build/lib.linux-x86_64-3.7/thrift
copying src/TSerialization.py -> build/lib.linux-x86_64-3.7/thrift
copying src/TSCons.py -> build/lib.linux-x86_64-3.7/thrift
copying src/__init__.py -> build/lib.linux-x86_64-3.7/thrift
copying src/compat.py -> build/lib.linux-x86_64-3.7/thrift
copying src/TTornado.py -> build/lib.linux-x86_64-3.7/thrift
copying src/TMultiplexedProcessor.py -> build/lib.linux-x86_64-3.7/thrift
copying src/Thrift.py -> build/lib.linux-x86_64-3.7/thrift
creating build/lib.linux-x86_64-3.7/thrift/protocol
copying src/protocol/TJSONProtocol.py -> build/lib.linux-x86_64-3.7/thrift/protocol
copying src/protocol/TProtocol.py -> build/lib.linux-x86_64-3.7/thrift/protocol
copying src/protocol/__init__.py -> build/lib.linux-x86_64-3.7/thrift/protocol
copying src/protocol/TCompactProtocol.py -> build/lib.linux-x86_64-3.7/thrift/protocol
copying src/protocol/TBinaryProtocol.py -> build/lib.linux-x86_64-3.7/thrift/protocol
copying src/protocol/TBase.py -> build/lib.linux-x86_64-3.7/thrift/protocol
copying src/protocol/TMultiplexedProtocol.py -> build/lib.linux-x86_64-3.7/thrift/protocol
copying src/protocol/TProtocolDecorator.py -> build/lib.linux-x86_64-3.7/thrift/protocol
creating build/lib.linux-x86_64-3.7/thrift/transport
copying src/transport/THttpClient.py -> build/lib.linux-x86_64-3.7/thrift/transport
copying src/transport/TSocket.py -> build/lib.linux-x86_64-3.7/thrift/transport
copying src/transport/__init__.py -> build/lib.linux-x86_64-3.7/thrift/transport
copying src/transport/TSSLSocket.py -> build/lib.linux-x86_64-3.7/thrift/transport
copying src/transport/sslcompat.py -> build/lib.linux-x86_64-3.7/thrift/transport
copying src/transport/TTransport.py -> build/lib.linux-x86_64-3.7/thrift/transport
copying src/transport/TZlibTransport.py -> build/lib.linux-x86_64-3.7/thrift/transport
copying src/transport/TTwisted.py -> build/lib.linux-x86_64-3.7/thrift/transport
creating build/lib.linux-x86_64-3.7/thrift/server
copying src/server/TProcessPoolServer.py -> build/lib.linux-x86_64-3.7/thrift/server
copying src/server/THttpServer.py -> build/lib.linux-x86_64-3.7/thrift/server
copying src/server/__init__.py -> build/lib.linux-x86_64-3.7/thrift/server
copying src/server/TNonblockingServer.py -> build/lib.linux-x86_64-3.7/thrift/server
copying src/server/TServer.py -> build/lib.linux-x86_64-3.7/thrift/server
running build_ext
building 'thrift.protocol.fastbinary' extension
creating build/temp.linux-x86_64-3.7
creating build/temp.linux-x86_64-3.7/src
creating build/temp.linux-x86_64-3.7/src/ext
x86_64-pld-linux-gcc -pthread -Wno-unused-result -Wsign-compare -DNDEBUG -O2 -fwrapv -pipe -Wformat -Werror=format-security -gdwarf-4 -fno-debug-types-section -fvar-tracking-assignments -g2 -Wp,-D_FORTIFY_SOURCE=2 -fstack-protector-strong --param=ssp-buffer-size=4 -fPIC -march=x86-64 -gdwarf-4 -fno-debug-types-section -fvar-tracking-assignments -g2 -fno-caller-saves -O2 -fwrapv -pipe -Wformat -Werror=format-security -gdwarf-4 -fno-debug-types-section -fvar-tracking-assignments -g2 -Wp,-D_FORTIFY_SOURCE=2 -fstack-protector-strong --param=ssp-buffer-size=4 -fPIC -march=x86-64 -gdwarf-4 -fno-debug-types-section -fvar-tracking-assignments -g2 -flto -fuse-linker-plugin -ffat-lto-objects -flto-partition=none -fPIC -Isrc -I/usr/include/python3.7m -c src/ext/module.cpp -o build/temp.linux-x86_64-3.7/src/ext/module.o
x86_64-pld-linux-gcc -pthread -Wno-unused-result -Wsign-compare -DNDEBUG -O2 -fwrapv -pipe -Wformat -Werror=format-security -gdwarf-4 -fno-debug-types-section -fvar-tracking-assignments -g2 -Wp,-D_FORTIFY_SOURCE=2 -fstack-protector-strong --param=ssp-buffer-size=4 -fPIC -march=x86-64 -gdwarf-4 -fno-debug-types-section -fvar-tracking-assignments -g2 -fno-caller-saves -O2 -fwrapv -pipe -Wformat -Werror=format-security -gdwarf-4 -fno-debug-types-section -fvar-tracking-assignments -g2 -Wp,-D_FORTIFY_SOURCE=2 -fstack-protector-strong --param=ssp-buffer-size=4 -fPIC -march=x86-64 -gdwarf-4 -fno-debug-types-section -fvar-tracking-assignments -g2 -flto -fuse-linker-plugin -ffat-lto-objects -flto-partition=none -fPIC -Isrc -I/usr/include/python3.7m -c src/ext/types.cpp -o build/temp.linux-x86_64-3.7/src/ext/types.o
x86_64-pld-linux-gcc -pthread -Wno-unused-result -Wsign-compare -DNDEBUG -O2 -fwrapv -pipe -Wformat -Werror=format-security -gdwarf-4 -fno-debug-types-section -fvar-tracking-assignments -g2 -Wp,-D_FORTIFY_SOURCE=2 -fstack-protector-strong --param=ssp-buffer-size=4 -fPIC -march=x86-64 -gdwarf-4 -fno-debug-types-section -fvar-tracking-assignments -g2 -fno-caller-saves -O2 -fwrapv -pipe -Wformat -Werror=format-security -gdwarf-4 -fno-debug-types-section -fvar-tracking-assignments -g2 -Wp,-D_FORTIFY_SOURCE=2 -fstack-protector-strong --param=ssp-buffer-size=4 -fPIC -march=x86-64 -gdwarf-4 -fno-debug-types-section -fvar-tracking-assignments -g2 -flto -fuse-linker-plugin -ffat-lto-objects -flto-partition=none -fPIC -Isrc -I/usr/include/python3.7m -c src/ext/binary.cpp -o build/temp.linux-x86_64-3.7/src/ext/binary.o
x86_64-pld-linux-gcc -pthread -Wno-unused-result -Wsign-compare -DNDEBUG -O2 -fwrapv -pipe -Wformat -Werror=format-security -gdwarf-4 -fno-debug-types-section -fvar-tracking-assignments -g2 -Wp,-D_FORTIFY_SOURCE=2 -fstack-protector-strong --param=ssp-buffer-size=4 -fPIC -march=x86-64 -gdwarf-4 -fno-debug-types-section -fvar-tracking-assignments -g2 -fno-caller-saves -O2 -fwrapv -pipe -Wformat -Werror=format-security -gdwarf-4 -fno-debug-types-section -fvar-tracking-assignments -g2 -Wp,-D_FORTIFY_SOURCE=2 -fstack-protector-strong --param=ssp-buffer-size=4 -fPIC -march=x86-64 -gdwarf-4 -fno-debug-types-section -fvar-tracking-assignments -g2 -flto -fuse-linker-plugin -ffat-lto-objects -flto-partition=none -fPIC -Isrc -I/usr/include/python3.7m -c src/ext/compact.cpp -o build/temp.linux-x86_64-3.7/src/ext/compact.o
x86_64-pld-linux-g++ -pthread -shared -Wl,--as-needed -Wl,--no-copy-dt-needed-entries -Wl,-z,relro -Wl,-z,combreloc -flto -fuse-linker-plugin -ffat-lto-objects -flto-partition=none build/temp.linux-x86_64-3.7/src/ext/module.o build/temp.linux-x86_64-3.7/src/ext/types.o build/temp.linux-x86_64-3.7/src/ext/binary.o build/temp.linux-x86_64-3.7/src/ext/compact.o -L/usr/lib64 -lpython3.7m -o build/lib.linux-x86_64-3.7/thrift/protocol/fastbinary.cpython-37m-x86_64-linux-gnu.so
/usr/bin/python setup.py build
running build
running build_py
creating build/lib.linux-x86_64-2.7
creating build/lib.linux-x86_64-2.7/thrift
copying src/TRecursive.py -> build/lib.linux-x86_64-2.7/thrift
copying src/TSerialization.py -> build/lib.linux-x86_64-2.7/thrift
copying src/TSCons.py -> build/lib.linux-x86_64-2.7/thrift
copying src/__init__.py -> build/lib.linux-x86_64-2.7/thrift
copying src/compat.py -> build/lib.linux-x86_64-2.7/thrift
copying src/TTornado.py -> build/lib.linux-x86_64-2.7/thrift
copying src/TMultiplexedProcessor.py -> build/lib.linux-x86_64-2.7/thrift
copying src/Thrift.py -> build/lib.linux-x86_64-2.7/thrift
creating build/lib.linux-x86_64-2.7/thrift/protocol
copying src/protocol/TJSONProtocol.py -> build/lib.linux-x86_64-2.7/thrift/protocol
copying src/protocol/TProtocol.py -> build/lib.linux-x86_64-2.7/thrift/protocol
copying src/protocol/__init__.py -> build/lib.linux-x86_64-2.7/thrift/protocol
copying src/protocol/TCompactProtocol.py -> build/lib.linux-x86_64-2.7/thrift/protocol
copying src/protocol/TBinaryProtocol.py -> build/lib.linux-x86_64-2.7/thrift/protocol
copying src/protocol/TBase.py -> build/lib.linux-x86_64-2.7/thrift/protocol
copying src/protocol/TMultiplexedProtocol.py -> build/lib.linux-x86_64-2.7/thrift/protocol
copying src/protocol/TProtocolDecorator.py -> build/lib.linux-x86_64-2.7/thrift/protocol
creating build/lib.linux-x86_64-2.7/thrift/transport
copying src/transport/THttpClient.py -> build/lib.linux-x86_64-2.7/thrift/transport
copying src/transport/TSocket.py -> build/lib.linux-x86_64-2.7/thrift/transport
copying src/transport/__init__.py -> build/lib.linux-x86_64-2.7/thrift/transport
copying src/transport/TSSLSocket.py -> build/lib.linux-x86_64-2.7/thrift/transport
copying src/transport/sslcompat.py -> build/lib.linux-x86_64-2.7/thrift/transport
copying src/transport/TTransport.py -> build/lib.linux-x86_64-2.7/thrift/transport
copying src/transport/TZlibTransport.py -> build/lib.linux-x86_64-2.7/thrift/transport
copying src/transport/TTwisted.py -> build/lib.linux-x86_64-2.7/thrift/transport
creating build/lib.linux-x86_64-2.7/thrift/server
copying src/server/TProcessPoolServer.py -> build/lib.linux-x86_64-2.7/thrift/server
copying src/server/THttpServer.py -> build/lib.linux-x86_64-2.7/thrift/server
copying src/server/__init__.py -> build/lib.linux-x86_64-2.7/thrift/server
copying src/server/TNonblockingServer.py -> build/lib.linux-x86_64-2.7/thrift/server
copying src/server/TServer.py -> build/lib.linux-x86_64-2.7/thrift/server
running build_ext
building 'thrift.protocol.fastbinary' extension
creating build/temp.linux-x86_64-2.7
creating build/temp.linux-x86_64-2.7/src
creating build/temp.linux-x86_64-2.7/src/ext
x86_64-pld-linux-gcc -pthread -fno-strict-aliasing -O2 -fwrapv -pipe -Wformat -Werror=format-security -gdwarf-4 -fno-debug-types-section -fvar-tracking-assignments -g2 -Wp,-D_FORTIFY_SOURCE=2 -fstack-protector-strong --param=ssp-buffer-size=4 -fPIC -march=x86-64 -gdwarf-4 -fno-debug-types-section -fvar-tracking-assignments -g2 -DNDEBUG -O2 -fwrapv -pipe -Wformat -Werror=format-security -gdwarf-4 -fno-debug-types-section -fvar-tracking-assignments -g2 -Wp,-D_FORTIFY_SOURCE=2 -fstack-protector-strong --param=ssp-buffer-size=4 -fPIC -march=x86-64 -gdwarf-4 -fno-debug-types-section -fvar-tracking-assignments -g2 -fPIC -Isrc -I/usr/include/python2.7 -c src/ext/module.cpp -o build/temp.linux-x86_64-2.7/src/ext/module.o
x86_64-pld-linux-gcc -pthread -fno-strict-aliasing -O2 -fwrapv -pipe -Wformat -Werror=format-security -gdwarf-4 -fno-debug-types-section -fvar-tracking-assignments -g2 -Wp,-D_FORTIFY_SOURCE=2 -fstack-protector-strong --param=ssp-buffer-size=4 -fPIC -march=x86-64 -gdwarf-4 -fno-debug-types-section -fvar-tracking-assignments -g2 -DNDEBUG -O2 -fwrapv -pipe -Wformat -Werror=format-security -gdwarf-4 -fno-debug-types-section -fvar-tracking-assignments -g2 -Wp,-D_FORTIFY_SOURCE=2 -fstack-protector-strong --param=ssp-buffer-size=4 -fPIC -march=x86-64 -gdwarf-4 -fno-debug-types-section -fvar-tracking-assignments -g2 -fPIC -Isrc -I/usr/include/python2.7 -c src/ext/types.cpp -o build/temp.linux-x86_64-2.7/src/ext/types.o
x86_64-pld-linux-gcc -pthread -fno-strict-aliasing -O2 -fwrapv -pipe -Wformat -Werror=format-security -gdwarf-4 -fno-debug-types-section -fvar-tracking-assignments -g2 -Wp,-D_FORTIFY_SOURCE=2 -fstack-protector-strong --param=ssp-buffer-size=4 -fPIC -march=x86-64 -gdwarf-4 -fno-debug-types-section -fvar-tracking-assignments -g2 -DNDEBUG -O2 -fwrapv -pipe -Wformat -Werror=format-security -gdwarf-4 -fno-debug-types-section -fvar-tracking-assignments -g2 -Wp,-D_FORTIFY_SOURCE=2 -fstack-protector-strong --param=ssp-buffer-size=4 -fPIC -march=x86-64 -gdwarf-4 -fno-debug-types-section -fvar-tracking-assignments -g2 -fPIC -Isrc -I/usr/include/python2.7 -c src/ext/binary.cpp -o build/temp.linux-x86_64-2.7/src/ext/binary.o
x86_64-pld-linux-gcc -pthread -fno-strict-aliasing -O2 -fwrapv -pipe -Wformat -Werror=format-security -gdwarf-4 -fno-debug-types-section -fvar-tracking-assignments -g2 -Wp,-D_FORTIFY_SOURCE=2 -fstack-protector-strong --param=ssp-buffer-size=4 -fPIC -march=x86-64 -gdwarf-4 -fno-debug-types-section -fvar-tracking-assignments -g2 -DNDEBUG -O2 -fwrapv -pipe -Wformat -Werror=format-security -gdwarf-4 -fno-debug-types-section -fvar-tracking-assignments -g2 -Wp,-D_FORTIFY_SOURCE=2 -fstack-protector-strong --param=ssp-buffer-size=4 -fPIC -march=x86-64 -gdwarf-4 -fno-debug-types-section -fvar-tracking-assignments -g2 -fPIC -Isrc -I/usr/include/python2.7 -c src/ext/compact.cpp -o build/temp.linux-x86_64-2.7/src/ext/compact.o
x86_64-pld-linux-g++ -pthread -shared -Wl,--as-needed -Wl,--no-copy-dt-needed-entries -Wl,-z,relro -Wl,-z,combreloc build/temp.linux-x86_64-2.7/src/ext/module.o build/temp.linux-x86_64-2.7/src/ext/types.o build/temp.linux-x86_64-2.7/src/ext/binary.o build/temp.linux-x86_64-2.7/src/ext/compact.o -L/usr/lib64 -lpython2.7 -o build/lib.linux-x86_64-2.7/thrift/protocol/fastbinary.so
make[3]: Leaving directory '/tmp/B.IJFt9D/BUILD/thrift-0.11.0/lib/py'
Making all in rs
make[3]: Entering directory '/tmp/B.IJFt9D/BUILD/thrift-0.11.0/lib/rs'
Making all in .
make[4]: Entering directory '/tmp/B.IJFt9D/BUILD/thrift-0.11.0/lib/rs'
/usr/bin/cargo build
    Updating registry `https://github.com/rust-lang/crates.io-index`
warning: spurious network error (2 tries remaining): curl error: Could not resolve: github.com (Could not contact DNS servers)
; class=Net (12)
warning: spurious network error (1 tries remaining): curl error: Could not resolve: github.com (Could not contact DNS servers)
; class=Net (12)
error: failed to load source for a dependency on `byteorder`

Caused by:
  Unable to update registry `https://github.com/rust-lang/crates.io-index`

Caused by:
  failed to fetch `https://github.com/rust-lang/crates.io-index`

Caused by:
  curl error: Could not resolve: github.com (Could not contact DNS servers)
; class=Net (12)
make[4]: *** [Makefile:820: all-local] Error 101
make[4]: Leaving directory '/tmp/B.IJFt9D/BUILD/thrift-0.11.0/lib/rs'
make[3]: *** [Makefile:534: all-recursive] Error 1
make[3]: Leaving directory '/tmp/B.IJFt9D/BUILD/thrift-0.11.0/lib/rs'
make[2]: *** [Makefile:575: all-recursive] Error 1
make[2]: Leaving directory '/tmp/B.IJFt9D/BUILD/thrift-0.11.0/lib'
make[1]: *** [Makefile:659: all-recursive] Error 1
make[1]: Leaving directory '/tmp/B.IJFt9D/BUILD/thrift-0.11.0'
make: *** [Makefile:573: all] Error 2
error: Bad exit status from /tmp/B.IJFt9D/BUILD/tmp/rpm-tmp.66283 (%build)


RPM build errors:
    Bad exit status from /tmp/B.IJFt9D/BUILD/tmp/rpm-tmp.66283 (%build)
ended at: Thu Sep 27 15:58:05 2018, done in 0:08:56.887128
error: No files produced.
mesg: ttyname failed: Inappropriate ioctl for device
+ chmod -R u+rwX /tmp/B.IJFt9D/BUILD
+ rm -rf /tmp/B.IJFt9D/tmp /tmp/B.IJFt9D/BUILD
mesg: ttyname failed: Inappropriate ioctl for device
+ rm -rf /tmp/B.IJFt9D
Begin-PLD-Builder-Info
Build-Time: user:521.72s sys:32.47s real:540.26s (faults io:0 non-io:10379816)

End-PLD-Builder-Info
[Back to list of logs] [View rpm -qa of builder]