FailedOk

th/SRPMS[OK]
th/x32[OK]
th/i686[OK]
th/x86_64[OK]

ac/SRPMS[OK]
ac/i386[OK]
ac/i586[OK]
ac/i686[OK]
ac/alpha[OK]
ac/amd64[OK]
ac/athlon[OK]
ac/ppc[OK]
ac/sparc[OK]
ac/sparc64[OK]

Advanced Search
main()
Powered by PLD Linux
(c) 2002-2019 PLD Team
$Revision: 1.37 $
Powered by ITS.
Your IP: 100.26.182.28

tpm_emulator 320d776f-bb53-4456-b4ec-a8d3e77d1e59

Status:Failed
Source URL:ftp://buildlogs.pld-linux.org/th/x86_64/FAIL/tpm_emulator,320d776f-bb53-4456-b4ec-a8d3e77d1e59.bz2
text/plain URL:View!
full text:View!
rpm -qa of builder:View!
Date:2019/08/20 07:27:09
Runtime:0:00:17.442788

Toc:

  • error 1
  • include/linux/module.h:130:6: error: 'init_module' specifies less restrictive attribute than its target 'init_tpm_module': 'cold' [-Werror=missing-attributes]
  • error 2
  • include/linux/module.h:136:7: error: 'cleanup_module' specifies less restrictive attribute than its target 'cleanup_tpm_module': 'cold' [-Werror=missing-attributes]
  • error 3
  • make[1]: *** [scripts/Makefile.build:284: /tmp/B.jSJQYT/BUILD/tpm_emulator-0.7.4/tpmd_dev/linux/tpmd_dev.o] Error 1
  • error 4
  • error: Bad exit status from /tmp/B.jSJQYT/BUILD/tmp/rpm-tmp.52324 (%build)
  • error 5
  • RPM build errors:
  • error 6
  • error: No files produced.

Content:

+ ln -sf /usr/src/linux-4.19/scripts o/scripts
+ /usr/bin/make -Otarget -j9 -C /usr/src/linux-4.19 clean 'RCS_FIND_IGNORE=-name '\''*.[ks]o'\'' -o' 'M=/tmp/B.jSJQYT/BUILD/tpm_emulator-0.7.4/tpmd_dev/linux' 'HOSTCC=x86_64-pld-linux-gcc' 'SYSSRC=/usr/src/linux-4.19' 'SYSOUT=/tmp/B.jSJQYT/BUILD/tpm_emulator-0.7.4/tpmd_dev/linux/o' 'CC=x86_64-pld-linux-gcc'
make: Entering directory '/usr/src/linux-4.19-4.19.67'
  CLEAN   /tmp/B.jSJQYT/BUILD/tpm_emulator-0.7.4/tpmd_dev/linux/.tmp_versions
  CLEAN   /tmp/B.jSJQYT/BUILD/tpm_emulator-0.7.4/tpmd_dev/linux/Module.symvers
make: Leaving directory '/usr/src/linux-4.19-4.19.67'
+ /usr/bin/make -Otarget -j9 -C /usr/src/linux-4.19 modules 'M=/tmp/B.jSJQYT/BUILD/tpm_emulator-0.7.4/tpmd_dev/linux' 'CONSTIFY_PLUGIN=' 'HOSTCC=x86_64-pld-linux-gcc' 'SYSSRC=/usr/src/linux-4.19' 'SYSOUT=/tmp/B.jSJQYT/BUILD/tpm_emulator-0.7.4/tpmd_dev/linux/o' 'CC=x86_64-pld-linux-gcc'
  CC [M]  /tmp/B.jSJQYT/BUILD/tpm_emulator-0.7.4/tpmd_dev/linux/tpmd_dev.o
make: Entering directory '/usr/src/linux-4.19-4.19.67'
  Building modules, stage 2.
make: Leaving directory '/usr/src/linux-4.19-4.19.67'
  MODPOST 1 modules
  CC      /tmp/B.jSJQYT/BUILD/tpm_emulator-0.7.4/tpmd_dev/linux/tpmd_dev.mod.o
  LD [M]  /tmp/B.jSJQYT/BUILD/tpm_emulator-0.7.4/tpmd_dev/linux/tpmd_dev.ko
+ cd -
/tmp/B.jSJQYT/BUILD/tpm_emulator-0.7.4
+ '[' -r /usr/src/linux-4.14/.config ']'
+ rm -rf o
+ install -d o/include/linux o/include/generated o/arch/x86/include o/arch/powerpc/lib
+ ln -sf /usr/src/linux-4.14/.config o/.config
+ ln -sf /usr/src/linux-4.14/Module.symvers o/Module.symvers
+ '[' -f /usr/src/linux-4.14/include/generated/autoconf.h ']'
+ ln -sf /usr/src/linux-4.14/include/generated/autoconf.h o/include/generated/autoconf.h
+ ln -s ../generated/autoconf.h o/include/linux/autoconf.h
+ '[' -d /usr/src/linux-4.14/arch/x86/include/generated ']'
+ ln -s /usr/src/linux-4.14/arch/x86/include/generated o/arch/x86/include
+ set +x
+ install -d o/include/config
+ touch o/include/config/MARKER
+ ln -sf /usr/src/linux-4.14/include/config/auto.conf o/include/config/auto.conf
+ ln -sf /usr/src/linux-4.14/scripts o/scripts
+ /usr/bin/make -Otarget -j9 -C /usr/src/linux-4.14 clean 'RCS_FIND_IGNORE=-name '\''*.[ks]o'\'' -o' 'M=/tmp/B.jSJQYT/BUILD/tpm_emulator-0.7.4/tpmd_dev/linux' 'HOSTCC=x86_64-pld-linux-gcc' 'SYSSRC=/usr/src/linux-4.14' 'SYSOUT=/tmp/B.jSJQYT/BUILD/tpm_emulator-0.7.4/tpmd_dev/linux/o' 'CC=x86_64-pld-linux-gcc'
make: Entering directory '/usr/src/linux-4.14-4.14.139'
  CLEAN   /tmp/B.jSJQYT/BUILD/tpm_emulator-0.7.4/tpmd_dev/linux/.tmp_versions
  CLEAN   /tmp/B.jSJQYT/BUILD/tpm_emulator-0.7.4/tpmd_dev/linux/Module.symvers
make: Leaving directory '/usr/src/linux-4.14-4.14.139'
+ /usr/bin/make -Otarget -j9 -C /usr/src/linux-4.14 modules 'M=/tmp/B.jSJQYT/BUILD/tpm_emulator-0.7.4/tpmd_dev/linux' 'CONSTIFY_PLUGIN=' 'HOSTCC=x86_64-pld-linux-gcc' 'SYSSRC=/usr/src/linux-4.14' 'SYSOUT=/tmp/B.jSJQYT/BUILD/tpm_emulator-0.7.4/tpmd_dev/linux/o' 'CC=x86_64-pld-linux-gcc'
  CC [M]  /tmp/B.jSJQYT/BUILD/tpm_emulator-0.7.4/tpmd_dev/linux/tpmd_dev.o
make: Entering directory '/usr/src/linux-4.14-4.14.139'
  Building modules, stage 2.
make: Leaving directory '/usr/src/linux-4.14-4.14.139'
  MODPOST 1 modules
  CC      /tmp/B.jSJQYT/BUILD/tpm_emulator-0.7.4/tpmd_dev/linux/tpmd_dev.mod.o
  LD [M]  /tmp/B.jSJQYT/BUILD/tpm_emulator-0.7.4/tpmd_dev/linux/tpmd_dev.ko
+ cd -
/tmp/B.jSJQYT/BUILD/tpm_emulator-0.7.4
+ '[' -r /usr/src/linux-4.9/.config ']'
+ rm -rf o
+ install -d o/include/linux o/include/generated o/arch/x86/include o/arch/powerpc/lib
+ ln -sf /usr/src/linux-4.9/.config o/.config
+ ln -sf /usr/src/linux-4.9/Module.symvers o/Module.symvers
+ '[' -f /usr/src/linux-4.9/include/generated/autoconf.h ']'
+ ln -sf /usr/src/linux-4.9/include/generated/autoconf.h o/include/generated/autoconf.h
+ ln -s ../generated/autoconf.h o/include/linux/autoconf.h
+ '[' -d /usr/src/linux-4.9/arch/x86/include/generated ']'
+ ln -s /usr/src/linux-4.9/arch/x86/include/generated o/arch/x86/include
+ set +x
+ install -d o/include/config
+ touch o/include/config/MARKER
+ ln -sf /usr/src/linux-4.9/include/config/auto.conf o/include/config/auto.conf
+ ln -sf /usr/src/linux-4.9/scripts o/scripts
+ /usr/bin/make -Otarget -j9 -C /usr/src/linux-4.9 clean 'RCS_FIND_IGNORE=-name '\''*.[ks]o'\'' -o' 'M=/tmp/B.jSJQYT/BUILD/tpm_emulator-0.7.4/tpmd_dev/linux' 'HOSTCC=x86_64-pld-linux-gcc' 'SYSSRC=/usr/src/linux-4.9' 'SYSOUT=/tmp/B.jSJQYT/BUILD/tpm_emulator-0.7.4/tpmd_dev/linux/o' 'CC=x86_64-pld-linux-gcc'
make: Entering directory '/usr/src/linux-4.9-4.9.189'
  CLEAN   /tmp/B.jSJQYT/BUILD/tpm_emulator-0.7.4/tpmd_dev/linux/.tmp_versions
  CLEAN   /tmp/B.jSJQYT/BUILD/tpm_emulator-0.7.4/tpmd_dev/linux/Module.symvers
make: Leaving directory '/usr/src/linux-4.9-4.9.189'
+ /usr/bin/make -Otarget -j9 -C /usr/src/linux-4.9 modules 'M=/tmp/B.jSJQYT/BUILD/tpm_emulator-0.7.4/tpmd_dev/linux' 'CONSTIFY_PLUGIN=' 'HOSTCC=x86_64-pld-linux-gcc' 'SYSSRC=/usr/src/linux-4.9' 'SYSOUT=/tmp/B.jSJQYT/BUILD/tpm_emulator-0.7.4/tpmd_dev/linux/o' 'CC=x86_64-pld-linux-gcc'
  CC [M]  /tmp/B.jSJQYT/BUILD/tpm_emulator-0.7.4/tpmd_dev/linux/tpmd_dev.o
make: Entering directory '/usr/src/linux-4.9-4.9.189'
  Building modules, stage 2.
make: Leaving directory '/usr/src/linux-4.9-4.9.189'
  MODPOST 1 modules
  CC      /tmp/B.jSJQYT/BUILD/tpm_emulator-0.7.4/tpmd_dev/linux/tpmd_dev.mod.o
  LD [M]  /tmp/B.jSJQYT/BUILD/tpm_emulator-0.7.4/tpmd_dev/linux/tpmd_dev.ko
+ cd -
/tmp/B.jSJQYT/BUILD/tpm_emulator-0.7.4
+ '[' -r /usr/src/linux-4.4/.config ']'
+ rm -rf o
+ install -d o/include/linux o/include/generated o/arch/x86/include o/arch/powerpc/lib
+ ln -sf /usr/src/linux-4.4/.config o/.config
+ ln -sf /usr/src/linux-4.4/Module.symvers o/Module.symvers
+ '[' -f /usr/src/linux-4.4/include/generated/autoconf.h ']'
+ ln -sf /usr/src/linux-4.4/include/generated/autoconf.h o/include/generated/autoconf.h
+ ln -s ../generated/autoconf.h o/include/linux/autoconf.h
+ '[' -d /usr/src/linux-4.4/arch/x86/include/generated ']'
+ ln -s /usr/src/linux-4.4/arch/x86/include/generated o/arch/x86/include
+ set +x
+ install -d o/include/config
+ touch o/include/config/MARKER
+ ln -sf /usr/src/linux-4.4/include/config/auto.conf o/include/config/auto.conf
+ ln -sf /usr/src/linux-4.4/scripts o/scripts
+ /usr/bin/make -Otarget -j9 -C /usr/src/linux-4.4 clean 'RCS_FIND_IGNORE=-name '\''*.[ks]o'\'' -o' 'M=/tmp/B.jSJQYT/BUILD/tpm_emulator-0.7.4/tpmd_dev/linux' 'HOSTCC=x86_64-pld-linux-gcc' 'SYSSRC=/usr/src/linux-4.4' 'SYSOUT=/tmp/B.jSJQYT/BUILD/tpm_emulator-0.7.4/tpmd_dev/linux/o' 'CC=x86_64-pld-linux-gcc'
make: Entering directory '/usr/src/linux-4.4-4.4.189'
  CLEAN   /tmp/B.jSJQYT/BUILD/tpm_emulator-0.7.4/tpmd_dev/linux/.tmp_versions
  CLEAN   /tmp/B.jSJQYT/BUILD/tpm_emulator-0.7.4/tpmd_dev/linux/Module.symvers
make: Leaving directory '/usr/src/linux-4.4-4.4.189'
+ /usr/bin/make -Otarget -j9 -C /usr/src/linux-4.4 modules 'M=/tmp/B.jSJQYT/BUILD/tpm_emulator-0.7.4/tpmd_dev/linux' 'CONSTIFY_PLUGIN=' 'HOSTCC=x86_64-pld-linux-gcc' 'SYSSRC=/usr/src/linux-4.4' 'SYSOUT=/tmp/B.jSJQYT/BUILD/tpm_emulator-0.7.4/tpmd_dev/linux/o' 'CC=x86_64-pld-linux-gcc'
  CC [M]  /tmp/B.jSJQYT/BUILD/tpm_emulator-0.7.4/tpmd_dev/linux/tpmd_dev.o
In file included from /tmp/B.jSJQYT/BUILD/tpm_emulator-0.7.4/tpmd_dev/linux/tpmd_dev.c:17:
include/linux/module.h:130:6: error: 'init_module' specifies less restrictive attribute than its target 'init_tpm_module': 'cold' [-Werror=missing-attributes]
  130 |  int init_module(void) __attribute__((alias(#initfn)));
      |      ^~~~~~~~~~~
/tmp/B.jSJQYT/BUILD/tpm_emulator-0.7.4/tpmd_dev/linux/tpmd_dev.c:290:1: note: in expansion of macro 'module_init'
  290 | module_init(init_tpm_module);
      | ^~~~~~~~~~~
/tmp/B.jSJQYT/BUILD/tpm_emulator-0.7.4/tpmd_dev/linux/tpmd_dev.c:267:12: note: 'init_module' target declared here
  267 | int __init init_tpm_module(void)
      |            ^~~~~~~~~~~~~~~
In file included from /tmp/B.jSJQYT/BUILD/tpm_emulator-0.7.4/tpmd_dev/linux/tpmd_dev.c:17:
include/linux/module.h:136:7: error: 'cleanup_module' specifies less restrictive attribute than its target 'cleanup_tpm_module': 'cold' [-Werror=missing-attributes]
  136 |  void cleanup_module(void) __attribute__((alias(#exitfn)));
      |       ^~~~~~~~~~~~~~
/tmp/B.jSJQYT/BUILD/tpm_emulator-0.7.4/tpmd_dev/linux/tpmd_dev.c:291:1: note: in expansion of macro 'module_exit'
  291 | module_exit(cleanup_tpm_module);
      | ^~~~~~~~~~~
/tmp/B.jSJQYT/BUILD/tpm_emulator-0.7.4/tpmd_dev/linux/tpmd_dev.c:283:13: note: 'cleanup_module' target declared here
  283 | void __exit cleanup_tpm_module(void)
      |             ^~~~~~~~~~~~~~~~~~
cc1: all warnings being treated as errors
make[1]: *** [scripts/Makefile.build:284: /tmp/B.jSJQYT/BUILD/tpm_emulator-0.7.4/tpmd_dev/linux/tpmd_dev.o] Error 1
make: *** [Makefile:1439: _module_/tmp/B.jSJQYT/BUILD/tpm_emulator-0.7.4/tpmd_dev/linux] Error 2
error: Bad exit status from /tmp/B.jSJQYT/BUILD/tmp/rpm-tmp.52324 (%build)


RPM build errors:
    Bad exit status from /tmp/B.jSJQYT/BUILD/tmp/rpm-tmp.52324 (%build)
ended at: Tue Aug 20 07:27:09 2019, done in 0:00:17.442788
error: No files produced.
+ chmod -R u+rwX /tmp/B.jSJQYT/BUILD
+ rm -rf /tmp/B.jSJQYT/tmp /tmp/B.jSJQYT/BUILD
+ rm -rf /tmp/B.jSJQYT
Begin-PLD-Builder-Info
Build-Time: user:13.03s sys:3.70s real:23.84s (faults io:0 non-io:2081005)

End-PLD-Builder-Info
[Back to list of logs] [View rpm -qa of builder]