FailedOk

th/SRPMS[OK]
th/x32[OK]
th/i686[OK]
th/x86_64[OK]

ac/SRPMS[OK]
ac/i386[OK]
ac/i586[OK]
ac/i686[OK]
ac/alpha[OK]
ac/amd64[OK]
ac/athlon[OK]
ac/ppc[OK]
ac/sparc[OK]
ac/sparc64[OK]

Advanced Search
main()
Powered by PLD Linux
(c) 2002-2017 PLD Team
$Revision: 1.37 $
Powered by nasi tu byli.
Your IP: 23.22.136.56

ufraw 6b222c0b-302f-404a-b47f-98efa169334a

Status:Failed
Source URL:ftp://buildlogs.pld-linux.org/th/x86_64/FAIL/ufraw,6b222c0b-302f-404a-b47f-98efa169334a.bz2
text/plain URL:View!
rpm -qa of builder:View!
Date:2017/09/25 22:27:40
Runtime:0:00:04.784693

Toc:

  • prep
  • Executing(%prep): /bin/sh -e /tmp/B.x7nDim/BUILD/tmp/rpm-tmp.74122
  • build
  • Executing(%build): /bin/sh -e /tmp/B.x7nDim/BUILD/tmp/rpm-tmp.74122
  • error 1
  • dcraw.cc:9245:16: error: call of overloaded 'abs(unsigned int&)' is ambiguous
  • error 2
  • dcraw.cc:9245:25: error: call of overloaded 'abs(unsigned int&)' is ambiguous
  • error 3
  • error: Bad exit status from /tmp/B.x7nDim/BUILD/tmp/rpm-tmp.74122 (%build)
  • error 4
  • RPM build errors:
  • error 5
  • error: No files produced.

Content:

request from: baggins
checking if we should skip the build
started at: Mon Sep 25 22:27:31 2017
fetching https://srcbuilder.pld-linux.org/th//srpms/6b222c0b-302f-404a-b47f-98efa169334a/ufraw-0.22-8.src.rpm
fetched 1116189 bytes, 482.8 K/s
installing srpm: ufraw-0.22-8.src.rpm
mesg: ttyname failed: Inappropriate ioctl for device
+ install -d /tmp/B.x7nDim/BUILD /tmp/B.x7nDim/RPMS
+ LC_ALL=en_US.UTF-8
+ rpm -qp --changelog ufraw-0.22-8.src.rpm
* Mon Sep 25 2017 PLD Linux Team <feedback@pld-linux.org>
- For complete changelog see: http://git.pld-linux.org/?p=packages/ufraw.git;a=log;h=master
* Mon Sep 25 2017 Jan Rękorajski <baggins@pld-linux.org> 0e8dc96
- rebuild with exiv2 0.26 - release 8 (by relup.sh) * Mon Sep 25 2017 Jan Rękorajski <baggins@pld-linux.org> 6e92879
- rebuild with exiv2 0.26 - release 7 (by relup.sh) * Mon Sep 25 2017 Jan Rękorajski <baggins@pld-linux.org> a7c1e56
- rebuild with exiv2 0.26 - release 6 (by relup.sh) * Sat Feb 25 2017 Jan Rękorajski <baggins@pld-linux.org> a3f948c
- release 5 (by relup.sh) + rpm -Uhv --nodeps --define '_topdir /tmp/B.x7nDim' --define '_specdir %{_topdir}' --define '_sourcedir %{_specdir}' --define '_rpmdir %{_topdir}/RPMS' --define '_builddir %{_topdir}/BUILD' ufraw-0.22-8.src.rpm Preparing... ################################################## ufraw ################################################## + rm -f ufraw-0.22-8.src.rpm mesg: ttyname failed: Inappropriate ioctl for device + install -m 700 -d /tmp/B.x7nDim/BUILD/tmp mesg: ttyname failed: Inappropriate ioctl for device + TMPDIR=/tmp/B.x7nDim/BUILD/tmp + exec nice -n 0 rpmbuild -bp --short-circuit --nodeps --define '_topdir /tmp/B.x7nDim' --define '_specdir %{_topdir}' --define '_sourcedir %{_specdir}' --define '_rpmdir %{_topdir}/RPMS' --define '_builddir %{_topdir}/BUILD' --target x86_64-pld-linux --define 'prep exit 0' /tmp/B.x7nDim/ufraw.spec Building target platforms: x86_64-pld-linux checking BuildConflict-ing packages no BuildConflicts found checking BR rpm: Building target platforms: x86_64-pld-linux no BR needed building RPM using: set -ex; : build-id: 6b222c0b-302f-404a-b47f-98efa169334a; TMPDIR=/tmp/B.x7nDim/BUILD/tmp exec nice -n 0 rpmbuild -bb --define '_smp_mflags -j5' --define '_make_opts -Otarget' --define '_pld_builder 1' --define '_topdir /tmp/B.x7nDim' --define '_specdir %{_topdir}' --define '_sourcedir %{_specdir}' --define '_rpmdir %{_topdir}/RPMS' --define '_builddir %{_topdir}/BUILD' --target x86_64-pld-linux /tmp/B.x7nDim/ufraw.spec mesg: ttyname failed: Inappropriate ioctl for device + : build-id: 6b222c0b-302f-404a-b47f-98efa169334a + TMPDIR=/tmp/B.x7nDim/BUILD/tmp + exec nice -n 0 rpmbuild -bb --define '_smp_mflags -j5' --define '_make_opts -Otarget' --define '_pld_builder 1' --define '_topdir /tmp/B.x7nDim' --define '_specdir %{_topdir}' --define '_sourcedir %{_specdir}' --define '_rpmdir %{_topdir}/RPMS' --define '_builddir %{_topdir}/BUILD' --target x86_64-pld-linux /tmp/B.x7nDim/ufraw.spec Building target platforms: x86_64-pld-linux Executing(%prep): /bin/sh -e /tmp/B.x7nDim/BUILD/tmp/rpm-tmp.74122 + umask 022 + cd /tmp/B.x7nDim/BUILD + cd /tmp/B.x7nDim/BUILD + rm -rf ufraw-0.22 + /usr/bin/gzip -dc /tmp/B.x7nDim/ufraw-0.22.tar.gz + /bin/tar -xf - + STATUS=0 + '[' 0 -ne 0 ']' + cd ufraw-0.22 + /bin/id -u + '[' 1000 '=' 0 ']' + /bin/id -u + '[' 1000 '=' 0 ']' + /bin/chmod -Rf a+rX,u+w,g-w,o-w . + exit 0 Executing(%build): /bin/sh -e /tmp/B.x7nDim/BUILD/tmp/rpm-tmp.74122 TMP=/home/users/builder/tmp HOME=/home/users/builder PATH=/home/users/builder/GNUstep/Tools:/usr/local/bin:/usr/bin:/bin:/home/users/builder/bin TMPDIR=/tmp/B.x7nDim/BUILD/tmp + umask 022 + cd /tmp/B.x7nDim/BUILD + cd ufraw-0.22 + cp -f /usr/share/automake/mkinstalldirs . + ./configure 'LDFLAGS=-Wl,--as-needed -Wl,--no-copy-dt-needed-entries -Wl,-z,relro -Wl,-z,combreloc ' 'CFLAGS=-O2 -fwrapv -pipe -Wformat -Werror=format-security -gdwarf-4 -fno-debug-types-section -fvar-tracking-assignments -g2 -Wp,-D_FORTIFY_SOURCE=2 -fstack-protector-strong --param=ssp-buffer-size=4 -fPIC -march=x86-64 -gdwarf-4 -fno-debug-types-section -fvar-tracking-assignments -g2 ' 'CXXFLAGS=-O2 -fwrapv -pipe -Wformat -Werror=format-security -gdwarf-4 -fno-debug-types-section -fvar-tracking-assignments -g2 -Wp,-D_FORTIFY_SOURCE=2 -fstack-protector-strong --param=ssp-buffer-size=4 -fPIC -march=x86-64 -gdwarf-4 -fno-debug-types-section -fvar-tracking-assignments -g2 ' 'FFLAGS=-O2 -fwrapv -pipe -Wformat -Werror=format-security -gdwarf-4 -fno-debug-types-section -fvar-tracking-assignments -g2 -Wp,-D_FORTIFY_SOURCE=2 -fstack-protector-strong --param=ssp-buffer-size=4 -fPIC -march=x86-64 -gdwarf-4 -fno-debug-types-section -fvar-tracking-assignments -g2 ' 'FCFLAGS=-O2 -fwrapv -pipe -Wformat -Werror=format-security -gdwarf-4 -fno-debug-types-section -fvar-tracking-assignments -g2 -Wp,-D_FORTIFY_SOURCE=2 -fstack-protector-strong --param=ssp-buffer-size=4 -fPIC -march=x86-64 -gdwarf-4 -fno-debug-types-section -fvar-tracking-assignments -g2 ' 'CPPFLAGS=' 'CC=x86_64-pld-linux-gcc' 'CXX=x86_64-pld-linux-g++' '--host=x86_64-pld-linux' '--build=x86_64-pld-linux' '--prefix=/usr' '--exec-prefix=/usr' '--bindir=/usr/bin' '--sbindir=/usr/sbin' '--sysconfdir=/etc' '--datadir=/usr/share' '--includedir=/usr/include' '--libdir=/usr/lib64' '--libexecdir=/usr/lib64' '--localstatedir=/var' '--sharedstatedir=/var/lib' '--mandir=/usr/share/man' '--infodir=/usr/share/info' '--x-libraries=/usr/lib64' --disable-silent-rules --enable-contrast --enable-dst-correction --enable-extras --enable-mime --with-gimp --with-gtk checking build system type... x86_64-pld-linux-gnu checking host system type... x86_64-pld-linux-gnu checking for a BSD-compatible install... /usr/bin/install -c checking whether build environment is sane... yes /tmp/B.x7nDim/BUILD/ufraw-0.22/missing: Unknown `--is-lightweight' option Try `/tmp/B.x7nDim/BUILD/ufraw-0.22/missing --help' for more information configure: WARNING: 'missing' script is too old or missing checking for a thread-safe mkdir -p... /bin/mkdir -p checking for gawk... gawk checking whether make sets $(MAKE)... yes checking whether make supports nested variables... yes checking whether make supports nested variables... (cached) yes checking for x86_64-pld-linux-gcc... x86_64-pld-linux-gcc checking whether the C compiler works... yes checking for C compiler default output file name... a.out checking for suffix of executables... checking whether we are cross compiling... no checking for suffix of object files... o checking whether we are using the GNU C compiler... yes checking whether x86_64-pld-linux-gcc accepts -g... yes checking for x86_64-pld-linux-gcc option to accept ISO C89... none needed checking whether x86_64-pld-linux-gcc understands -c and -o together... yes checking for style of include used by make... GNU checking dependency style of x86_64-pld-linux-gcc... gcc3 checking whether we are using the GNU C++ compiler... yes checking whether x86_64-pld-linux-g++ accepts -g... yes checking dependency style of x86_64-pld-linux-g++... gcc3 checking how to run the C preprocessor... x86_64-pld-linux-gcc -E checking for x86_64-pld-linux-ranlib... no checking for ranlib... ranlib checking for pod2man... pod2man checking for _LARGEFILE_SOURCE value needed for large files... no checking for library containing getopt_long... none required checking for library containing pow... -lm checking for canonicalize_file_name... yes checking for memmem... yes checking for strcasecmp... yes checking for strcasestr... yes checking for x86_64-pld-linux-gcc option to support OpenMP... -fopenmp checking for x86_64-pld-linux-pkg-config... no checking for pkg-config... /usr/bin/pkg-config checking pkg-config is at least version 0.9.0... yes checking for GLIB... yes checking for LCMS2... yes checking for GTKBASE... yes checking for GTK... yes checking for GIMP... yes checking for GIMP_2_4... yes checking for GIMP_2_9... no checking for deflate in -lz... yes checking for BZ2_bzReadOpen in -lbz2... yes checking for grep that handles long lines and -e... /bin/grep checking for egrep... /bin/grep -E checking for ANSI C header files... yes checking for sys/types.h... yes checking for sys/stat.h... yes checking for stdlib.h... yes checking for string.h... yes checking for memory.h... yes checking for strings.h... yes checking for inttypes.h... yes checking for stdint.h... yes checking for unistd.h... yes checking jpeglib.h usability... yes checking jpeglib.h presence... yes checking for jpeglib.h... yes checking for jpeg_CreateCompress in -ljpeg... yes checking for jas_image_decode in -ljasper... yes checking for LIBTIFF... yes checking for LIBPNG... yes checking for CFITSIO... yes checking for EXIV2... yes checking for LENSFUN... yes checking locale.h usability... yes checking locale.h presence... yes checking for locale.h... yes checking for LC_MESSAGES... yes checking libintl.h usability... yes checking libintl.h presence... yes checking for libintl.h... yes checking for ngettext in libc... yes checking for dgettext in libc... yes checking for bind_textdomain_codeset... yes checking for msgfmt... /usr/bin/msgfmt checking for dcgettext... yes checking if msgfmt accepts -c... yes checking for gmsgfmt... /usr/bin/msgfmt checking for xgettext... /usr/bin/xgettext checking for catalogs to be installed... ca cs da de es fr it ja ko nb nl pl pt ru sr sr@latin sv zh_CN zh_TW checking whether to install mime types... yes checking whether to build extras... yes checking whether to enable DST correction for file timestamps... yes checking whether to enable the contrast setting option... yes checking whether to enable 'None' interpolation... no checking whether to enable debugging with valgrind... no checking that generated files are newer than configure... done configure: creating ./config.status config.status: creating Makefile config.status: creating icons/Makefile config.status: creating po/Makefile.in config.status: creating ufraw-setup.iss config.status: creating config.h config.status: executing depfiles commands config.status: executing default-1 commands configure: ====================== summary ===================== configure: build GTK GUI: yes configure: build GIMP plug-in: yes configure: EXIF support using exiv2: yes configure: JPEG support: yes configure: JPEG2000 (libjasper) support: yes configure: TIFF support: yes configure: PNG support: yes configure: FITS support: yes configure: gzip compressed raw support: yes configure: bzip2 compressed raw support: yes configure: lens defects correction support using lensfun: yes + /usr/bin/make -Otarget -j5 /usr/bin/make all-recursive Making all in po make[2]: Entering directory '/tmp/B.x7nDim/BUILD/ufraw-0.22/po' file=./`echo cs | sed 's,.*/,,'`.gmo \ && rm -f $file && /usr/bin/msgfmt -c -o $file cs.po make[2]: Leaving directory '/tmp/B.x7nDim/BUILD/ufraw-0.22/po' make[2]: Entering directory '/tmp/B.x7nDim/BUILD/ufraw-0.22/po' file=./`echo es | sed 's,.*/,,'`.gmo \ && rm -f $file && /usr/bin/msgfmt -c -o $file es.po make[2]: Leaving directory '/tmp/B.x7nDim/BUILD/ufraw-0.22/po' make[2]: Entering directory '/tmp/B.x7nDim/BUILD/ufraw-0.22/po' file=./`echo da | sed 's,.*/,,'`.gmo \ && rm -f $file && /usr/bin/msgfmt -c -o $file da.po make[2]: Leaving directory '/tmp/B.x7nDim/BUILD/ufraw-0.22/po' make[2]: Entering directory '/tmp/B.x7nDim/BUILD/ufraw-0.22/po' file=./`echo de | sed 's,.*/,,'`.gmo \ && rm -f $file && /usr/bin/msgfmt -c -o $file de.po make[2]: Leaving directory '/tmp/B.x7nDim/BUILD/ufraw-0.22/po' make[2]: Entering directory '/tmp/B.x7nDim/BUILD/ufraw-0.22/po' file=./`echo ca | sed 's,.*/,,'`.gmo \ && rm -f $file && /usr/bin/msgfmt -c -o $file ca.po make[2]: Leaving directory '/tmp/B.x7nDim/BUILD/ufraw-0.22/po' make[2]: Entering directory '/tmp/B.x7nDim/BUILD/ufraw-0.22/po' file=./`echo it | sed 's,.*/,,'`.gmo \ && rm -f $file && /usr/bin/msgfmt -c -o $file it.po make[2]: Leaving directory '/tmp/B.x7nDim/BUILD/ufraw-0.22/po' make[2]: Entering directory '/tmp/B.x7nDim/BUILD/ufraw-0.22/po' file=./`echo ja | sed 's,.*/,,'`.gmo \ && rm -f $file && /usr/bin/msgfmt -c -o $file ja.po make[2]: Leaving directory '/tmp/B.x7nDim/BUILD/ufraw-0.22/po' make[2]: Entering directory '/tmp/B.x7nDim/BUILD/ufraw-0.22/po' file=./`echo fr | sed 's,.*/,,'`.gmo \ && rm -f $file && /usr/bin/msgfmt -c -o $file fr.po make[2]: Leaving directory '/tmp/B.x7nDim/BUILD/ufraw-0.22/po' make[2]: Entering directory '/tmp/B.x7nDim/BUILD/ufraw-0.22/po' file=./`echo nl | sed 's,.*/,,'`.gmo \ && rm -f $file && /usr/bin/msgfmt -c -o $file nl.po make[2]: Leaving directory '/tmp/B.x7nDim/BUILD/ufraw-0.22/po' make[2]: Entering directory '/tmp/B.x7nDim/BUILD/ufraw-0.22/po' file=./`echo nb | sed 's,.*/,,'`.gmo \ && rm -f $file && /usr/bin/msgfmt -c -o $file nb.po make[2]: Leaving directory '/tmp/B.x7nDim/BUILD/ufraw-0.22/po' make[2]: Entering directory '/tmp/B.x7nDim/BUILD/ufraw-0.22/po' file=./`echo pl | sed 's,.*/,,'`.gmo \ && rm -f $file && /usr/bin/msgfmt -c -o $file pl.po make[2]: Leaving directory '/tmp/B.x7nDim/BUILD/ufraw-0.22/po' make[2]: Entering directory '/tmp/B.x7nDim/BUILD/ufraw-0.22/po' file=./`echo ko | sed 's,.*/,,'`.gmo \ && rm -f $file && /usr/bin/msgfmt -c -o $file ko.po make[2]: Leaving directory '/tmp/B.x7nDim/BUILD/ufraw-0.22/po' make[2]: Entering directory '/tmp/B.x7nDim/BUILD/ufraw-0.22/po' file=./`echo ru | sed 's,.*/,,'`.gmo \ && rm -f $file && /usr/bin/msgfmt -c -o $file ru.po make[2]: Leaving directory '/tmp/B.x7nDim/BUILD/ufraw-0.22/po' make[2]: Entering directory '/tmp/B.x7nDim/BUILD/ufraw-0.22/po' file=./`echo sr | sed 's,.*/,,'`.gmo \ && rm -f $file && /usr/bin/msgfmt -c -o $file sr.po make[2]: Leaving directory '/tmp/B.x7nDim/BUILD/ufraw-0.22/po' make[2]: Entering directory '/tmp/B.x7nDim/BUILD/ufraw-0.22/po' file=./`echo sr@latin | sed 's,.*/,,'`.gmo \ && rm -f $file && /usr/bin/msgfmt -c -o $file sr@latin.po make[2]: Leaving directory '/tmp/B.x7nDim/BUILD/ufraw-0.22/po' make[2]: Entering directory '/tmp/B.x7nDim/BUILD/ufraw-0.22/po' file=./`echo pt | sed 's,.*/,,'`.gmo \ && rm -f $file && /usr/bin/msgfmt -c -o $file pt.po make[2]: Leaving directory '/tmp/B.x7nDim/BUILD/ufraw-0.22/po' make[2]: Entering directory '/tmp/B.x7nDim/BUILD/ufraw-0.22/po' file=./`echo zh_CN | sed 's,.*/,,'`.gmo \ && rm -f $file && /usr/bin/msgfmt -c -o $file zh_CN.po make[2]: Leaving directory '/tmp/B.x7nDim/BUILD/ufraw-0.22/po' make[2]: Entering directory '/tmp/B.x7nDim/BUILD/ufraw-0.22/po' file=./`echo zh_TW | sed 's,.*/,,'`.gmo \ && rm -f $file && /usr/bin/msgfmt -c -o $file zh_TW.po make[2]: Leaving directory '/tmp/B.x7nDim/BUILD/ufraw-0.22/po' make[2]: Entering directory '/tmp/B.x7nDim/BUILD/ufraw-0.22/po' file=./`echo sv | sed 's,.*/,,'`.gmo \ && rm -f $file && /usr/bin/msgfmt -c -o $file sv.po make[2]: Leaving directory '/tmp/B.x7nDim/BUILD/ufraw-0.22/po' Making all in icons make[2]: Nothing to be done for 'all'. make[2]: Entering directory '/tmp/B.x7nDim/BUILD/ufraw-0.22' x86_64-pld-linux-gcc -DHAVE_CONFIG_H -I. -pthread -I/usr/include/gtk-2.0 -I/usr/lib64/gtk-2.0/include -I/usr/include/pango-1.0 -I/usr/include/gio-unix-2.0/ -I/usr/include/cairo -I/usr/include/atk-1.0 -I/usr/include/cairo -I/usr/include/pixman-1 -I/usr/include/gdk-pixbuf-2.0 -I/usr/include/pango-1.0 -I/usr/include/freetype2 -I/usr/include/libpng16 -I/usr/include/harfbuzz -I/usr/include/glib-2.0 -I/usr/lib64/glib-2.0/include -I/usr/include/freetype2 -I/usr/include/libpng16 -I/usr/include/harfbuzz -I/usr/include/glib-2.0 -I/usr/lib64/glib-2.0/include -pthread -I/usr/include/glib-2.0 -I/usr/lib64/glib-2.0/include -I/usr/include/lensfun -I/usr/include/glib-2.0 -I/usr/lib64/glib-2.0/include -I/usr/include/libpng16 -DDCRAW_NOMAIN -DUFRAW_LOCALEDIR=\"/usr/share/locale\" -O2 -fwrapv -pipe -Wformat -Werror=format-security -gdwarf-4 -fno-debug-types-section -fvar-tracking-assignments -g2 -Wp,-D_FORTIFY_SOURCE=2 -fstack-protector-strong --param=ssp-buffer-size=4 -fPIC -march=x86-64 -gdwarf-4 -fno-debug-types-section -fvar-tracking-assignments -g2 -fopenmp -MT ufraw_colorspaces.o -MD -MP -MF .deps/ufraw_colorspaces.Tpo -c -o ufraw_colorspaces.o ufraw_colorspaces.c mv -f .deps/ufraw_colorspaces.Tpo .deps/ufraw_colorspaces.Po make[2]: Leaving directory '/tmp/B.x7nDim/BUILD/ufraw-0.22' make[2]: Entering directory '/tmp/B.x7nDim/BUILD/ufraw-0.22' x86_64-pld-linux-gcc -DHAVE_CONFIG_H -I. -pthread -I/usr/include/gtk-2.0 -I/usr/lib64/gtk-2.0/include -I/usr/include/pango-1.0 -I/usr/include/gio-unix-2.0/ -I/usr/include/cairo -I/usr/include/atk-1.0 -I/usr/include/cairo -I/usr/include/pixman-1 -I/usr/include/gdk-pixbuf-2.0 -I/usr/include/pango-1.0 -I/usr/include/freetype2 -I/usr/include/libpng16 -I/usr/include/harfbuzz -I/usr/include/glib-2.0 -I/usr/lib64/glib-2.0/include -I/usr/include/freetype2 -I/usr/include/libpng16 -I/usr/include/harfbuzz -I/usr/include/glib-2.0 -I/usr/lib64/glib-2.0/include -pthread -I/usr/include/glib-2.0 -I/usr/lib64/glib-2.0/include -I/usr/include/lensfun -I/usr/include/glib-2.0 -I/usr/lib64/glib-2.0/include -I/usr/include/libpng16 -DDCRAW_NOMAIN -DUFRAW_LOCALEDIR=\"/usr/share/locale\" -O2 -fwrapv -pipe -Wformat -Werror=format-security -gdwarf-4 -fno-debug-types-section -fvar-tracking-assignments -g2 -Wp,-D_FORTIFY_SOURCE=2 -fstack-protector-strong --param=ssp-buffer-size=4 -fPIC -march=x86-64 -gdwarf-4 -fno-debug-types-section -fvar-tracking-assignments -g2 -fopenmp -MT ufraw_routines.o -MD -MP -MF .deps/ufraw_routines.Tpo -c -o ufraw_routines.o ufraw_routines.c mv -f .deps/ufraw_routines.Tpo .deps/ufraw_routines.Po make[2]: Leaving directory '/tmp/B.x7nDim/BUILD/ufraw-0.22' make[2]: Entering directory '/tmp/B.x7nDim/BUILD/ufraw-0.22' x86_64-pld-linux-g++ -DHAVE_CONFIG_H -I. -pthread -I/usr/include/gtk-2.0 -I/usr/lib64/gtk-2.0/include -I/usr/include/pango-1.0 -I/usr/include/gio-unix-2.0/ -I/usr/include/cairo -I/usr/include/atk-1.0 -I/usr/include/cairo -I/usr/include/pixman-1 -I/usr/include/gdk-pixbuf-2.0 -I/usr/include/pango-1.0 -I/usr/include/freetype2 -I/usr/include/libpng16 -I/usr/include/harfbuzz -I/usr/include/glib-2.0 -I/usr/lib64/glib-2.0/include -I/usr/include/freetype2 -I/usr/include/libpng16 -I/usr/include/harfbuzz -I/usr/include/glib-2.0 -I/usr/lib64/glib-2.0/include -pthread -I/usr/include/glib-2.0 -I/usr/lib64/glib-2.0/include -I/usr/include/lensfun -I/usr/include/glib-2.0 -I/usr/lib64/glib-2.0/include -I/usr/include/libpng16 -DDCRAW_NOMAIN -DUFRAW_LOCALEDIR=\"/usr/share/locale\" -O2 -fwrapv -pipe -Wformat -Werror=format-security -gdwarf-4 -fno-debug-types-section -fvar-tracking-assignments -g2 -Wp,-D_FORTIFY_SOURCE=2 -fstack-protector-strong --param=ssp-buffer-size=4 -fPIC -march=x86-64 -gdwarf-4 -fno-debug-types-section -fvar-tracking-assignments -g2 -fopenmp -MT dcraw.o -MD -MP -MF .deps/dcraw.Tpo -c -o dcraw.o dcraw.cc dcraw.cc:10076:21: warning: invalid suffix on literal; C++11 requires a space between literal and string macro [-Wliteral-suffix] strcpy (th->soft, "dcraw v"DCRAW_VERSION); ^ dcraw.cc: In member function 'void DCRaw::identify()': dcraw.cc:9245:16: error: call of overloaded 'abs(unsigned int&)' is ambiguous if (abs(i) < abs(c)) { ^ In file included from /usr/include/c++/7.2.0/bits/std_abs.h:38:0, from /usr/include/c++/7.2.0/cmath:47, from /usr/include/c++/7.2.0/math.h:36, from dcraw.cc:36: /usr/include/stdlib.h:751:12: note: candidate: int abs(int) extern int abs (int __x) __THROW __attribute__ ((__const__)) __wur; ^~~ In file included from /usr/include/c++/7.2.0/cmath:47:0, from /usr/include/c++/7.2.0/math.h:36, from dcraw.cc:36: /usr/include/c++/7.2.0/bits/std_abs.h:56:3: note: candidate: long int std::abs(long int) abs(long __i) { return __builtin_labs(__i); } ^~~ /usr/include/c++/7.2.0/bits/std_abs.h:61:3: note: candidate: long long int std::abs(long long int) abs(long long __x) { return __builtin_llabs (__x); } ^~~ /usr/include/c++/7.2.0/bits/std_abs.h:70:3: note: candidate: constexpr double std::abs(double) abs(double __x) ^~~ /usr/include/c++/7.2.0/bits/std_abs.h:74:3: note: candidate: constexpr float std::abs(float) abs(float __x) ^~~ /usr/include/c++/7.2.0/bits/std_abs.h:78:3: note: candidate: constexpr long double std::abs(long double) abs(long double __x) ^~~ /usr/include/c++/7.2.0/bits/std_abs.h:84:3: note: candidate: constexpr __int128 std::abs(__int128) abs(__GLIBCXX_TYPE_INT_N_0 __x) { return __x >= 0 ? __x : -__x; } ^~~ /usr/include/c++/7.2.0/bits/std_abs.h:102:3: note: candidate: constexpr __float128 std::abs(__float128) abs(__float128 __x) ^~~ dcraw.cc:9245:25: error: call of overloaded 'abs(unsigned int&)' is ambiguous if (abs(i) < abs(c)) { ^ In file included from /usr/include/c++/7.2.0/bits/std_abs.h:38:0, from /usr/include/c++/7.2.0/cmath:47, from /usr/include/c++/7.2.0/math.h:36, from dcraw.cc:36: /usr/include/stdlib.h:751:12: note: candidate: int abs(int) extern int abs (int __x) __THROW __attribute__ ((__const__)) __wur; ^~~ In file included from /usr/include/c++/7.2.0/cmath:47:0, from /usr/include/c++/7.2.0/math.h:36, from dcraw.cc:36: /usr/include/c++/7.2.0/bits/std_abs.h:56:3: note: candidate: long int std::abs(long int) abs(long __i) { return __builtin_labs(__i); } ^~~ /usr/include/c++/7.2.0/bits/std_abs.h:61:3: note: candidate: long long int std::abs(long long int) abs(long long __x) { return __builtin_llabs (__x); } ^~~ /usr/include/c++/7.2.0/bits/std_abs.h:70:3: note: candidate: constexpr double std::abs(double) abs(double __x) ^~~ /usr/include/c++/7.2.0/bits/std_abs.h:74:3: note: candidate: constexpr float std::abs(float) abs(float __x) ^~~ /usr/include/c++/7.2.0/bits/std_abs.h:78:3: note: candidate: constexpr long double std::abs(long double) abs(long double __x) ^~~ /usr/include/c++/7.2.0/bits/std_abs.h:84:3: note: candidate: constexpr __int128 std::abs(__int128) abs(__GLIBCXX_TYPE_INT_N_0 __x) { return __x >= 0 ? __x : -__x; } ^~~ /usr/include/c++/7.2.0/bits/std_abs.h:102:3: note: candidate: constexpr __float128 std::abs(__float128) abs(__float128 __x) ^~~ make[2]: *** [Makefile:886: dcraw.o] Error 1 make[2]: Leaving directory '/tmp/B.x7nDim/BUILD/ufraw-0.22' make[2]: *** Waiting for unfinished jobs.... make[2]: Entering directory '/tmp/B.x7nDim/BUILD/ufraw-0.22' x86_64-pld-linux-gcc -DHAVE_CONFIG_H -I. -pthread -I/usr/include/gtk-2.0 -I/usr/lib64/gtk-2.0/include -I/usr/include/pango-1.0 -I/usr/include/gio-unix-2.0/ -I/usr/include/cairo -I/usr/include/atk-1.0 -I/usr/include/cairo -I/usr/include/pixman-1 -I/usr/include/gdk-pixbuf-2.0 -I/usr/include/pango-1.0 -I/usr/include/freetype2 -I/usr/include/libpng16 -I/usr/include/harfbuzz -I/usr/include/glib-2.0 -I/usr/lib64/glib-2.0/include -I/usr/include/freetype2 -I/usr/include/libpng16 -I/usr/include/harfbuzz -I/usr/include/glib-2.0 -I/usr/lib64/glib-2.0/include -pthread -I/usr/include/glib-2.0 -I/usr/lib64/glib-2.0/include -I/usr/include/lensfun -I/usr/include/glib-2.0 -I/usr/lib64/glib-2.0/include -I/usr/include/libpng16 -DDCRAW_NOMAIN -DUFRAW_LOCALEDIR=\"/usr/share/locale\" -O2 -fwrapv -pipe -Wformat -Werror=format-security -gdwarf-4 -fno-debug-types-section -fvar-tracking-assignments -g2 -Wp,-D_FORTIFY_SOURCE=2 -fstack-protector-strong --param=ssp-buffer-size=4 -fPIC -march=x86-64 -gdwarf-4 -fno-debug-types-section -fvar-tracking-assignments -g2 -fopenmp -MT ufraw_developer.o -MD -MP -MF .deps/ufraw_developer.Tpo -c -o ufraw_developer.o ufraw_developer.c mv -f .deps/ufraw_developer.Tpo .deps/ufraw_developer.Po make[2]: Leaving directory '/tmp/B.x7nDim/BUILD/ufraw-0.22' make[2]: Entering directory '/tmp/B.x7nDim/BUILD/ufraw-0.22' x86_64-pld-linux-gcc -DHAVE_CONFIG_H -I. -pthread -I/usr/include/gtk-2.0 -I/usr/lib64/gtk-2.0/include -I/usr/include/pango-1.0 -I/usr/include/gio-unix-2.0/ -I/usr/include/cairo -I/usr/include/atk-1.0 -I/usr/include/cairo -I/usr/include/pixman-1 -I/usr/include/gdk-pixbuf-2.0 -I/usr/include/pango-1.0 -I/usr/include/freetype2 -I/usr/include/libpng16 -I/usr/include/harfbuzz -I/usr/include/glib-2.0 -I/usr/lib64/glib-2.0/include -I/usr/include/freetype2 -I/usr/include/libpng16 -I/usr/include/harfbuzz -I/usr/include/glib-2.0 -I/usr/lib64/glib-2.0/include -pthread -I/usr/include/glib-2.0 -I/usr/lib64/glib-2.0/include -I/usr/include/lensfun -I/usr/include/glib-2.0 -I/usr/lib64/glib-2.0/include -I/usr/include/libpng16 -DDCRAW_NOMAIN -DUFRAW_LOCALEDIR=\"/usr/share/locale\" -O2 -fwrapv -pipe -Wformat -Werror=format-security -gdwarf-4 -fno-debug-types-section -fvar-tracking-assignments -g2 -Wp,-D_FORTIFY_SOURCE=2 -fstack-protector-strong --param=ssp-buffer-size=4 -fPIC -march=x86-64 -gdwarf-4 -fno-debug-types-section -fvar-tracking-assignments -g2 -fopenmp -MT ufraw_writer.o -MD -MP -MF .deps/ufraw_writer.Tpo -c -o ufraw_writer.o ufraw_writer.c mv -f .deps/ufraw_writer.Tpo .deps/ufraw_writer.Po make[2]: Leaving directory '/tmp/B.x7nDim/BUILD/ufraw-0.22' make[2]: Entering directory '/tmp/B.x7nDim/BUILD/ufraw-0.22' x86_64-pld-linux-gcc -DHAVE_CONFIG_H -I. -pthread -I/usr/include/gtk-2.0 -I/usr/lib64/gtk-2.0/include -I/usr/include/pango-1.0 -I/usr/include/gio-unix-2.0/ -I/usr/include/cairo -I/usr/include/atk-1.0 -I/usr/include/cairo -I/usr/include/pixman-1 -I/usr/include/gdk-pixbuf-2.0 -I/usr/include/pango-1.0 -I/usr/include/freetype2 -I/usr/include/libpng16 -I/usr/include/harfbuzz -I/usr/include/glib-2.0 -I/usr/lib64/glib-2.0/include -I/usr/include/freetype2 -I/usr/include/libpng16 -I/usr/include/harfbuzz -I/usr/include/glib-2.0 -I/usr/lib64/glib-2.0/include -pthread -I/usr/include/glib-2.0 -I/usr/lib64/glib-2.0/include -I/usr/include/lensfun -I/usr/include/glib-2.0 -I/usr/lib64/glib-2.0/include -I/usr/include/libpng16 -DDCRAW_NOMAIN -DUFRAW_LOCALEDIR=\"/usr/share/locale\" -O2 -fwrapv -pipe -Wformat -Werror=format-security -gdwarf-4 -fno-debug-types-section -fvar-tracking-assignments -g2 -Wp,-D_FORTIFY_SOURCE=2 -fstack-protector-strong --param=ssp-buffer-size=4 -fPIC -march=x86-64 -gdwarf-4 -fno-debug-types-section -fvar-tracking-assignments -g2 -fopenmp -MT ufraw_ufraw.o -MD -MP -MF .deps/ufraw_ufraw.Tpo -c -o ufraw_ufraw.o ufraw_ufraw.c mv -f .deps/ufraw_ufraw.Tpo .deps/ufraw_ufraw.Po make[2]: Leaving directory '/tmp/B.x7nDim/BUILD/ufraw-0.22' make[2]: Entering directory '/tmp/B.x7nDim/BUILD/ufraw-0.22' x86_64-pld-linux-gcc -DHAVE_CONFIG_H -I. -pthread -I/usr/include/gtk-2.0 -I/usr/lib64/gtk-2.0/include -I/usr/include/pango-1.0 -I/usr/include/gio-unix-2.0/ -I/usr/include/cairo -I/usr/include/atk-1.0 -I/usr/include/cairo -I/usr/include/pixman-1 -I/usr/include/gdk-pixbuf-2.0 -I/usr/include/pango-1.0 -I/usr/include/freetype2 -I/usr/include/libpng16 -I/usr/include/harfbuzz -I/usr/include/glib-2.0 -I/usr/lib64/glib-2.0/include -I/usr/include/freetype2 -I/usr/include/libpng16 -I/usr/include/harfbuzz -I/usr/include/glib-2.0 -I/usr/lib64/glib-2.0/include -pthread -I/usr/include/glib-2.0 -I/usr/lib64/glib-2.0/include -I/usr/include/lensfun -I/usr/include/glib-2.0 -I/usr/lib64/glib-2.0/include -I/usr/include/libpng16 -DDCRAW_NOMAIN -DUFRAW_LOCALEDIR=\"/usr/share/locale\" -O2 -fwrapv -pipe -Wformat -Werror=format-security -gdwarf-4 -fno-debug-types-section -fvar-tracking-assignments -g2 -Wp,-D_FORTIFY_SOURCE=2 -fstack-protector-strong --param=ssp-buffer-size=4 -fPIC -march=x86-64 -gdwarf-4 -fno-debug-types-section -fvar-tracking-assignments -g2 -fopenmp -MT ufraw_conf.o -MD -MP -MF .deps/ufraw_conf.Tpo -c -o ufraw_conf.o ufraw_conf.c mv -f .deps/ufraw_conf.Tpo .deps/ufraw_conf.Po make[2]: Leaving directory '/tmp/B.x7nDim/BUILD/ufraw-0.22' make[1]: *** [Makefile:1026: all-recursive] Error 1 make: *** [Makefile:581: all] Error 2 error: Bad exit status from /tmp/B.x7nDim/BUILD/tmp/rpm-tmp.74122 (%build) RPM build errors: Bad exit status from /tmp/B.x7nDim/BUILD/tmp/rpm-tmp.74122 (%build) ended at: Mon Sep 25 22:27:40 2017, done in 0:00:04.784693 error: No files produced. mesg: ttyname failed: Inappropriate ioctl for device + chmod -R u+rwX /tmp/B.x7nDim/BUILD + rm -rf /tmp/B.x7nDim/tmp /tmp/B.x7nDim/BUILD mesg: ttyname failed: Inappropriate ioctl for device + rm -rf /tmp/B.x7nDim Begin-PLD-Builder-Info Build-Time: user:6.18s sys:0.89s real:8.90s (faults io:0 non-io:489815) End-PLD-Builder-Info
[Back to list of logs] [View rpm -qa of builder]