FailedOk

th/SRPMS[OK]
th/x32[OK]
th/i686[OK]
th/x86_64[OK]

ac/SRPMS[OK]
ac/i386[OK]
ac/i586[OK]
ac/i686[OK]
ac/alpha[OK]
ac/amd64[OK]
ac/athlon[OK]
ac/ppc[OK]
ac/sparc[OK]
ac/sparc64[OK]

Advanced Search
main()
Powered by PLD Linux
(c) 2002-2018 PLD Team
$Revision: 1.37 $
Powered by ed.
Your IP: 54.80.87.166

volume_key 27bf8e0c-872b-4dff-94a5-19a0a7c31045

Status:Failed
Source URL:ftp://buildlogs.pld-linux.org/th/x86_64/FAIL/volume_key,27bf8e0c-872b-4dff-94a5-19a0a7c31045.bz2
text/plain URL:View!
full text:View!
rpm -qa of builder:View!
Date:2018/05/15 12:31:02
Runtime:0:00:13.582149

Toc:

  • error 1
  • lib/.libs/libvolume_key.so: undefined reference to `crypt_get_error'
  • error 2
  • collect2: error: ld returned 1 exit status
  • error 3
  • make[2]: *** [Makefile:960: src/volume_key] Error 1
  • error 4
  • make[1]: *** [Makefile:1224: all-recursive] Error 1
  • error 5
  • error: Bad exit status from /tmp/B.ZjNokT/BUILD/tmp/rpm-tmp.98164 (%build)
  • error 6
  • RPM build errors:
  • error 7
  • error: No files produced.

Content:

mv -f lib/.deps/libvolume_key_la-libvolume_key.Tpo lib/.deps/libvolume_key_la-libvolume_key.Plo
make[2]: Leaving directory '/tmp/B.ZjNokT/BUILD/volume_key-0.3.9'
make[2]: Entering directory '/tmp/B.ZjNokT/BUILD/volume_key-0.3.9'
/bin/sh ./libtool  --tag=CC   --mode=compile x86_64-pld-linux-gcc -DHAVE_CONFIG_H -I.  -I/usr/include/blkid -I/usr/include/uuid -I/usr/include/glib-2.0 -I/usr/lib64/glib-2.0/include   -I/usr/include/nss -I/usr/include/nspr -DLOCALEDIR='"/usr/share/locale"'   -O2 -fwrapv -pipe -Wformat -Werror=format-security -gdwarf-4 -fno-debug-types-section -fvar-tracking-assignments -g2 -Wp,-D_FORTIFY_SOURCE=2 -fstack-protector-strong --param=ssp-buffer-size=4 -fPIC -march=x86-64 -gdwarf-4 -fno-debug-types-section -fvar-tracking-assignments -g2   -Wall -W -Wcast-align -Wmissing-noreturn -Wnested-externs -Wpointer-arith -Wshadow -Wundef -Wwrite-strings -MT lib/libvolume_key_la-crypto.lo -MD -MP -MF lib/.deps/libvolume_key_la-crypto.Tpo -c -o lib/libvolume_key_la-crypto.lo `test -f 'lib/crypto.c' || echo './'`lib/crypto.c
libtool: compile:  x86_64-pld-linux-gcc -DHAVE_CONFIG_H -I. -I/usr/include/blkid -I/usr/include/uuid -I/usr/include/glib-2.0 -I/usr/lib64/glib-2.0/include -I/usr/include/nss -I/usr/include/nspr -DLOCALEDIR=\"/usr/share/locale\" -O2 -fwrapv -pipe -Wformat -Werror=format-security -gdwarf-4 -fno-debug-types-section -fvar-tracking-assignments -g2 -Wp,-D_FORTIFY_SOURCE=2 -fstack-protector-strong --param=ssp-buffer-size=4 -fPIC -march=x86-64 -gdwarf-4 -fno-debug-types-section -fvar-tracking-assignments -g2 -Wall -W -Wcast-align -Wmissing-noreturn -Wnested-externs -Wpointer-arith -Wshadow -Wundef -Wwrite-strings -MT lib/libvolume_key_la-crypto.lo -MD -MP -MF lib/.deps/libvolume_key_la-crypto.Tpo -c lib/crypto.c  -fPIC -DPIC -o lib/.libs/libvolume_key_la-crypto.o
mv -f lib/.deps/libvolume_key_la-crypto.Tpo lib/.deps/libvolume_key_la-crypto.Plo
make[2]: Leaving directory '/tmp/B.ZjNokT/BUILD/volume_key-0.3.9'
make[2]: Entering directory '/tmp/B.ZjNokT/BUILD/volume_key-0.3.9'
x86_64-pld-linux-gcc -DHAVE_CONFIG_H -I.  -I/usr/include/blkid -I/usr/include/uuid -I/usr/include/glib-2.0 -I/usr/lib64/glib-2.0/include   -I/usr/include/nss -I/usr/include/nspr -DLOCALEDIR='"/usr/share/locale"'   -O2 -fwrapv -pipe -Wformat -Werror=format-security -gdwarf-4 -fno-debug-types-section -fvar-tracking-assignments -g2 -Wp,-D_FORTIFY_SOURCE=2 -fstack-protector-strong --param=ssp-buffer-size=4 -fPIC -march=x86-64 -gdwarf-4 -fno-debug-types-section -fvar-tracking-assignments -g2   -Wall -W -Wcast-align -Wmissing-noreturn -Wnested-externs -Wpointer-arith -Wshadow -Wundef -Wwrite-strings -MT src/volume_key-volume_key.o -MD -MP -MF src/.deps/volume_key-volume_key.Tpo -c -o src/volume_key-volume_key.o `test -f 'src/volume_key.c' || echo './'`src/volume_key.c
mv -f src/.deps/volume_key-volume_key.Tpo src/.deps/volume_key-volume_key.Po
make[2]: Leaving directory '/tmp/B.ZjNokT/BUILD/volume_key-0.3.9'
make[2]: Entering directory '/tmp/B.ZjNokT/BUILD/volume_key-0.3.9'
/bin/sh ./libtool  --tag=CC   --mode=compile x86_64-pld-linux-gcc -DHAVE_CONFIG_H -I.  -I/usr/include/blkid -I/usr/include/uuid -I/usr/include/glib-2.0 -I/usr/lib64/glib-2.0/include   -I/usr/include/nss -I/usr/include/nspr -DLOCALEDIR='"/usr/share/locale"'   -O2 -fwrapv -pipe -Wformat -Werror=format-security -gdwarf-4 -fno-debug-types-section -fvar-tracking-assignments -g2 -Wp,-D_FORTIFY_SOURCE=2 -fstack-protector-strong --param=ssp-buffer-size=4 -fPIC -march=x86-64 -gdwarf-4 -fno-debug-types-section -fvar-tracking-assignments -g2   -Wall -W -Wcast-align -Wmissing-noreturn -Wnested-externs -Wpointer-arith -Wshadow -Wundef -Wwrite-strings -MT lib/libvolume_key_la-volume_luks.lo -MD -MP -MF lib/.deps/libvolume_key_la-volume_luks.Tpo -c -o lib/libvolume_key_la-volume_luks.lo `test -f 'lib/volume_luks.c' || echo './'`lib/volume_luks.c
libtool: compile:  x86_64-pld-linux-gcc -DHAVE_CONFIG_H -I. -I/usr/include/blkid -I/usr/include/uuid -I/usr/include/glib-2.0 -I/usr/lib64/glib-2.0/include -I/usr/include/nss -I/usr/include/nspr -DLOCALEDIR=\"/usr/share/locale\" -O2 -fwrapv -pipe -Wformat -Werror=format-security -gdwarf-4 -fno-debug-types-section -fvar-tracking-assignments -g2 -Wp,-D_FORTIFY_SOURCE=2 -fstack-protector-strong --param=ssp-buffer-size=4 -fPIC -march=x86-64 -gdwarf-4 -fno-debug-types-section -fvar-tracking-assignments -g2 -Wall -W -Wcast-align -Wmissing-noreturn -Wnested-externs -Wpointer-arith -Wshadow -Wundef -Wwrite-strings -MT lib/libvolume_key_la-volume_luks.lo -MD -MP -MF lib/.deps/libvolume_key_la-volume_luks.Tpo -c lib/volume_luks.c  -fPIC -DPIC -o lib/.libs/libvolume_key_la-volume_luks.o
lib/volume_luks.c: In function 'error_from_cryptsetup':
lib/volume_luks.c:72:3: warning: implicit declaration of function 'crypt_get_error'; did you mean 'crypt_get_dir'? [-Wimplicit-function-declaration]
   crypt_get_error (crypt_msg, sizeof (crypt_msg));
   ^~~~~~~~~~~~~~~
   crypt_get_dir
lib/volume_luks.c:72:3: warning: nested extern declaration of 'crypt_get_error' [-Wnested-externs]
mv -f lib/.deps/libvolume_key_la-volume_luks.Tpo lib/.deps/libvolume_key_la-volume_luks.Plo
make[2]: Leaving directory '/tmp/B.ZjNokT/BUILD/volume_key-0.3.9'
make[2]: Entering directory '/tmp/B.ZjNokT/BUILD/volume_key-0.3.9'
/bin/sh ./libtool  --tag=CC   --mode=compile x86_64-pld-linux-gcc -DHAVE_CONFIG_H -I.  -I/usr/include/blkid -I/usr/include/uuid -I/usr/include/glib-2.0 -I/usr/lib64/glib-2.0/include   -I/usr/include/nss -I/usr/include/nspr -DLOCALEDIR='"/usr/share/locale"'   -O2 -fwrapv -pipe -Wformat -Werror=format-security -gdwarf-4 -fno-debug-types-section -fvar-tracking-assignments -g2 -Wp,-D_FORTIFY_SOURCE=2 -fstack-protector-strong --param=ssp-buffer-size=4 -fPIC -march=x86-64 -gdwarf-4 -fno-debug-types-section -fvar-tracking-assignments -g2   -Wall -W -Wcast-align -Wmissing-noreturn -Wnested-externs -Wpointer-arith -Wshadow -Wundef -Wwrite-strings -MT lib/libvolume_key_la-volume.lo -MD -MP -MF lib/.deps/libvolume_key_la-volume.Tpo -c -o lib/libvolume_key_la-volume.lo `test -f 'lib/volume.c' || echo './'`lib/volume.c
libtool: compile:  x86_64-pld-linux-gcc -DHAVE_CONFIG_H -I. -I/usr/include/blkid -I/usr/include/uuid -I/usr/include/glib-2.0 -I/usr/lib64/glib-2.0/include -I/usr/include/nss -I/usr/include/nspr -DLOCALEDIR=\"/usr/share/locale\" -O2 -fwrapv -pipe -Wformat -Werror=format-security -gdwarf-4 -fno-debug-types-section -fvar-tracking-assignments -g2 -Wp,-D_FORTIFY_SOURCE=2 -fstack-protector-strong --param=ssp-buffer-size=4 -fPIC -march=x86-64 -gdwarf-4 -fno-debug-types-section -fvar-tracking-assignments -g2 -Wall -W -Wcast-align -Wmissing-noreturn -Wnested-externs -Wpointer-arith -Wshadow -Wundef -Wwrite-strings -MT lib/libvolume_key_la-volume.lo -MD -MP -MF lib/.deps/libvolume_key_la-volume.Tpo -c lib/volume.c  -fPIC -DPIC -o lib/.libs/libvolume_key_la-volume.o
mv -f lib/.deps/libvolume_key_la-volume.Tpo lib/.deps/libvolume_key_la-volume.Plo
make[2]: Leaving directory '/tmp/B.ZjNokT/BUILD/volume_key-0.3.9'
make[2]: Entering directory '/tmp/B.ZjNokT/BUILD/volume_key-0.3.9'
/bin/sh ./libtool  --tag=CC   --mode=compile x86_64-pld-linux-gcc -DHAVE_CONFIG_H -I.  -I/usr/include/blkid -I/usr/include/uuid -I/usr/include/glib-2.0 -I/usr/lib64/glib-2.0/include   -I/usr/include/nss -I/usr/include/nspr -DLOCALEDIR='"/usr/share/locale"'   -O2 -fwrapv -pipe -Wformat -Werror=format-security -gdwarf-4 -fno-debug-types-section -fvar-tracking-assignments -g2 -Wp,-D_FORTIFY_SOURCE=2 -fstack-protector-strong --param=ssp-buffer-size=4 -fPIC -march=x86-64 -gdwarf-4 -fno-debug-types-section -fvar-tracking-assignments -g2   -Wall -W -Wcast-align -Wmissing-noreturn -Wnested-externs -Wpointer-arith -Wshadow -Wundef -Wwrite-strings -MT lib/libvolume_key_la-kmip.lo -MD -MP -MF lib/.deps/libvolume_key_la-kmip.Tpo -c -o lib/libvolume_key_la-kmip.lo `test -f 'lib/kmip.c' || echo './'`lib/kmip.c
libtool: compile:  x86_64-pld-linux-gcc -DHAVE_CONFIG_H -I. -I/usr/include/blkid -I/usr/include/uuid -I/usr/include/glib-2.0 -I/usr/lib64/glib-2.0/include -I/usr/include/nss -I/usr/include/nspr -DLOCALEDIR=\"/usr/share/locale\" -O2 -fwrapv -pipe -Wformat -Werror=format-security -gdwarf-4 -fno-debug-types-section -fvar-tracking-assignments -g2 -Wp,-D_FORTIFY_SOURCE=2 -fstack-protector-strong --param=ssp-buffer-size=4 -fPIC -march=x86-64 -gdwarf-4 -fno-debug-types-section -fvar-tracking-assignments -g2 -Wall -W -Wcast-align -Wmissing-noreturn -Wnested-externs -Wpointer-arith -Wshadow -Wundef -Wwrite-strings -MT lib/libvolume_key_la-kmip.lo -MD -MP -MF lib/.deps/libvolume_key_la-kmip.Tpo -c lib/kmip.c  -fPIC -DPIC -o lib/.libs/libvolume_key_la-kmip.o
mv -f lib/.deps/libvolume_key_la-kmip.Tpo lib/.deps/libvolume_key_la-kmip.Plo
make[2]: Leaving directory '/tmp/B.ZjNokT/BUILD/volume_key-0.3.9'
make[2]: Entering directory '/tmp/B.ZjNokT/BUILD/volume_key-0.3.9'
/bin/sh ./libtool  --tag=CC   --mode=compile x86_64-pld-linux-gcc -DHAVE_CONFIG_H -I.  -I/usr/include/blkid -I/usr/include/uuid -I/usr/include/glib-2.0 -I/usr/lib64/glib-2.0/include   -I/usr/include/nss -I/usr/include/nspr -I/usr/include/python2.7   -O2 -fwrapv -pipe -Wformat -Werror=format-security -gdwarf-4 -fno-debug-types-section -fvar-tracking-assignments -g2 -Wp,-D_FORTIFY_SOURCE=2 -fstack-protector-strong --param=ssp-buffer-size=4 -fPIC -march=x86-64 -gdwarf-4 -fno-debug-types-section -fvar-tracking-assignments -g2   -Wall -W -Wcast-align -Wmissing-noreturn -Wnested-externs -Wpointer-arith -Wshadow -Wundef -Wwrite-strings -MT python/_volume_key_la-volume_key_wrap.lo -MD -MP -MF python/.deps/_volume_key_la-volume_key_wrap.Tpo -c -o python/_volume_key_la-volume_key_wrap.lo `test -f 'python/volume_key_wrap.c' || echo './'`python/volume_key_wrap.c
libtool: compile:  x86_64-pld-linux-gcc -DHAVE_CONFIG_H -I. -I/usr/include/blkid -I/usr/include/uuid -I/usr/include/glib-2.0 -I/usr/lib64/glib-2.0/include -I/usr/include/nss -I/usr/include/nspr -I/usr/include/python2.7 -O2 -fwrapv -pipe -Wformat -Werror=format-security -gdwarf-4 -fno-debug-types-section -fvar-tracking-assignments -g2 -Wp,-D_FORTIFY_SOURCE=2 -fstack-protector-strong --param=ssp-buffer-size=4 -fPIC -march=x86-64 -gdwarf-4 -fno-debug-types-section -fvar-tracking-assignments -g2 -Wall -W -Wcast-align -Wmissing-noreturn -Wnested-externs -Wpointer-arith -Wshadow -Wundef -Wwrite-strings -MT python/_volume_key_la-volume_key_wrap.lo -MD -MP -MF python/.deps/_volume_key_la-volume_key_wrap.Tpo -c python/volume_key_wrap.c  -fPIC -DPIC -o python/.libs/_volume_key_la-volume_key_wrap.o
python/volume_key_wrap.c: In function 'SWIG_PyInstanceMethod_New':
python/volume_key_wrap.c:1049:59: warning: unused parameter 'self' [-Wunused-parameter]
 SWIGRUNTIME PyObject* SWIG_PyInstanceMethod_New(PyObject *self, PyObject *func)
                                                           ^~~~
python/volume_key_wrap.c:1049:75: warning: unused parameter 'func' [-Wunused-parameter]
 SWIGRUNTIME PyObject* SWIG_PyInstanceMethod_New(PyObject *self, PyObject *func)
                                                                           ^~~~
python/volume_key_wrap.c: In function '_PySwigObject_type':
python/volume_key_wrap.c:1829:7: warning: missing initializer for field 'tp_version_tag' of 'PyTypeObject {aka const struct _typeobject}' [-Wmissing-field-initializers]
       };
       ^
In file included from /usr/include/python2.7/Python.h:83:0,
                 from python/volume_key_wrap.c:125:
/usr/include/python2.7/object.h:401:18: note: 'tp_version_tag' declared here
     unsigned int tp_version_tag;
                  ^~~~~~~~~~~~~~
python/volume_key_wrap.c: In function '_PySwigPacked_type':
python/volume_key_wrap.c:2004:7: warning: missing initializer for field 'tp_version_tag' of 'PyTypeObject {aka const struct _typeobject}' [-Wmissing-field-initializers]
       };
       ^
In file included from /usr/include/python2.7/Python.h:83:0,
                 from python/volume_key_wrap.c:125:
/usr/include/python2.7/object.h:401:18: note: 'tp_version_tag' declared here
     unsigned int tp_version_tag;
                  ^~~~~~~~~~~~~~
python/volume_key_wrap.c: In function 'SWIG_Python_NewShadowInstance':
python/volume_key_wrap.c:2287:65: warning: declaration of 'swig_this' shadows a global declaration [-Wshadow]
 SWIG_Python_NewShadowInstance(SwigPyClientData *data, PyObject *swig_this)
                                                                 ^~~~~~~~~
python/volume_key_wrap.c:2057:18: note: shadowed declaration is here
 static PyObject *swig_this = NULL;
                  ^~~~~~~~~
python/volume_key_wrap.c: In function 'SWIG_Python_SetSwigThis':
python/volume_key_wrap.c:2356:51: warning: declaration of 'swig_this' shadows a global declaration [-Wshadow]
 SWIG_Python_SetSwigThis(PyObject *inst, PyObject *swig_this)
                                                   ^~~~~~~~~
python/volume_key_wrap.c:2057:18: note: shadowed declaration is here
 static PyObject *swig_this = NULL;
                  ^~~~~~~~~
python/volume_key_wrap.c: In function 'SWIG_Python_MustGetPtr':
python/volume_key_wrap.c:2666:63: warning: unused parameter 'argnum' [-Wunused-parameter]
 SWIG_Python_MustGetPtr(PyObject *obj, swig_type_info *ty, int argnum, int flags) {
                                                               ^~~~~~
python/volume_key_wrap.c: In function 'swig_varlink_type':
python/volume_key_wrap.c:5472:7: warning: missing initializer for field 'tp_version_tag' of 'PyTypeObject {aka const struct _typeobject}' [-Wmissing-field-initializers]
       };
       ^
In file included from /usr/include/python2.7/Python.h:83:0,
                 from python/volume_key_wrap.c:125:
/usr/include/python2.7/object.h:401:18: note: 'tp_version_tag' declared here
     unsigned int tp_version_tag;
                  ^~~~~~~~~~~~~~
mv -f python/.deps/_volume_key_la-volume_key_wrap.Tpo python/.deps/_volume_key_la-volume_key_wrap.Plo
make[2]: Leaving directory '/tmp/B.ZjNokT/BUILD/volume_key-0.3.9'
make[2]: Entering directory '/tmp/B.ZjNokT/BUILD/volume_key-0.3.9'
/bin/sh ./libtool  --tag=CC   --mode=link x86_64-pld-linux-gcc  -O2 -fwrapv -pipe -Wformat -Werror=format-security -gdwarf-4 -fno-debug-types-section -fvar-tracking-assignments -g2 -Wp,-D_FORTIFY_SOURCE=2 -fstack-protector-strong --param=ssp-buffer-size=4 -fPIC -march=x86-64 -gdwarf-4 -fno-debug-types-section -fvar-tracking-assignments -g2   -Wall -W -Wcast-align -Wmissing-noreturn -Wnested-externs -Wpointer-arith -Wshadow -Wundef -Wwrite-strings -version-info 3:2:2 -Wl,--as-needed -Wl,--no-copy-dt-needed-entries -Wl,-z,relro -Wl,-z,combreloc  -o lib/libvolume_key.la -rpath /usr/lib64 lib/libvolume_key_la-crypto.lo lib/libvolume_key_la-kmip.lo lib/libvolume_key_la-libvolume_key.lo lib/libvolume_key_la-nss_error.lo lib/libvolume_key_la-ui.lo lib/libvolume_key_la-volume.lo lib/libvolume_key_la-volume_luks.lo -lblkid -lglib-2.0 -L/usr/lib64 -lgpgme -lassuan -lgpg-error  -lcryptsetup -lnss3 -lnssutil3 -lsmime3 -lssl3 -lsoftokn3 -lplds4 -lplc4 -lnspr4 
libtool: link: x86_64-pld-linux-gcc -shared  -fPIC -DPIC  -O2 -gdwarf-4 -g2 -fstack-protector-strong -march=x86-64 -gdwarf-4 -g2 -Wl,--as-needed -Wl,--no-copy-dt-needed-entries -Wl,-z -Wl,relro -Wl,-z -Wl,combreloc   -pthread  lib/.libs/libvolume_key_la-crypto.o lib/.libs/libvolume_key_la-kmip.o lib/.libs/libvolume_key_la-libvolume_key.o lib/.libs/libvolume_key_la-nss_error.o lib/.libs/libvolume_key_la-ui.o lib/.libs/libvolume_key_la-volume.o lib/.libs/libvolume_key_la-volume_luks.o   -lblkid /usr/lib64/libglib-2.0.so -L/usr/lib64 /usr/lib64/libpcre.so -lpthread /usr/lib64/libgpgme.so /usr/lib64/libassuan.so /usr/lib64/libcryptsetup.so /usr/lib64/libuuid.so -ldevmapper /usr/lib64/libgcrypt.so /usr/lib64/libgpg-error.so -largon2 -lrt -ldl -ljson-c -lnss3 -lnssutil3 -lsmime3 -lssl3 -lsoftokn3 -lplds4 -lplc4 -lnspr4 -Wl,-soname -Wl,libvolume_key.so.1 -o lib/.libs/libvolume_key.so.1.2.2
libtool: link: (cd "lib/.libs" && rm -f "libvolume_key.so.1" && ln -s "libvolume_key.so.1.2.2" "libvolume_key.so.1")
libtool: link: (cd "lib/.libs" && rm -f "libvolume_key.so" && ln -s "libvolume_key.so.1.2.2" "libvolume_key.so")
libtool: link: ( cd "lib/.libs" && rm -f "libvolume_key.la" && ln -s "../libvolume_key.la" "libvolume_key.la" )
make[2]: Leaving directory '/tmp/B.ZjNokT/BUILD/volume_key-0.3.9'
make[2]: Entering directory '/tmp/B.ZjNokT/BUILD/volume_key-0.3.9'
/bin/sh ./libtool  --tag=CC   --mode=link x86_64-pld-linux-gcc  -O2 -fwrapv -pipe -Wformat -Werror=format-security -gdwarf-4 -fno-debug-types-section -fvar-tracking-assignments -g2 -Wp,-D_FORTIFY_SOURCE=2 -fstack-protector-strong --param=ssp-buffer-size=4 -fPIC -march=x86-64 -gdwarf-4 -fno-debug-types-section -fvar-tracking-assignments -g2   -Wall -W -Wcast-align -Wmissing-noreturn -Wnested-externs -Wpointer-arith -Wshadow -Wundef -Wwrite-strings  -Wl,--as-needed -Wl,--no-copy-dt-needed-entries -Wl,-z,relro -Wl,-z,combreloc  -o src/volume_key src/volume_key-volume_key.o lib/libvolume_key.la -lglib-2.0 -lnss3 -lnssutil3 -lsmime3 -lssl3 -lsoftokn3 -lplds4 -lplc4 -lnspr4 
libtool: link: x86_64-pld-linux-gcc -O2 -fwrapv -pipe -Wformat -Werror=format-security -gdwarf-4 -fno-debug-types-section -fvar-tracking-assignments -g2 -Wp,-D_FORTIFY_SOURCE=2 -fstack-protector-strong --param=ssp-buffer-size=4 -fPIC -march=x86-64 -gdwarf-4 -fno-debug-types-section -fvar-tracking-assignments -g2 -Wall -W -Wcast-align -Wmissing-noreturn -Wnested-externs -Wpointer-arith -Wshadow -Wundef -Wwrite-strings -Wl,--as-needed -Wl,--no-copy-dt-needed-entries -Wl,-z -Wl,relro -Wl,-z -Wl,combreloc -o src/.libs/volume_key src/volume_key-volume_key.o  lib/.libs/libvolume_key.so -L/usr/lib64 -lblkid /usr/lib64/libgpgme.so /usr/lib64/libassuan.so /usr/lib64/libcryptsetup.so /usr/lib64/libuuid.so -ldevmapper /usr/lib64/libgcrypt.so /usr/lib64/libgpg-error.so -largon2 -lrt -ldl -ljson-c /usr/lib64/libglib-2.0.so /usr/lib64/libpcre.so -lpthread -lnss3 -lnssutil3 -lsmime3 -lssl3 -lsoftokn3 -lplds4 -lplc4 -lnspr4 -pthread
lib/.libs/libvolume_key.so: undefined reference to `crypt_get_error'
collect2: error: ld returned 1 exit status
make[2]: *** [Makefile:960: src/volume_key] Error 1
make[2]: Leaving directory '/tmp/B.ZjNokT/BUILD/volume_key-0.3.9'
make[2]: *** Waiting for unfinished jobs....
make[2]: Entering directory '/tmp/B.ZjNokT/BUILD/volume_key-0.3.9'
/bin/sh ./libtool  --tag=CC   --mode=link x86_64-pld-linux-gcc  -O2 -fwrapv -pipe -Wformat -Werror=format-security -gdwarf-4 -fno-debug-types-section -fvar-tracking-assignments -g2 -Wp,-D_FORTIFY_SOURCE=2 -fstack-protector-strong --param=ssp-buffer-size=4 -fPIC -march=x86-64 -gdwarf-4 -fno-debug-types-section -fvar-tracking-assignments -g2   -Wall -W -Wcast-align -Wmissing-noreturn -Wnested-externs -Wpointer-arith -Wshadow -Wundef -Wwrite-strings -module -avoid-version -lglib-2.0 -Wl,--as-needed -Wl,--no-copy-dt-needed-entries -Wl,-z,relro -Wl,-z,combreloc  -o python/_volume_key.la -rpath /usr/lib64/python2.7/site-packages python/_volume_key_la-volume_key_wrap.lo lib/libvolume_key.la -lpython2.7 -lglib-2.0 -lnss3 -lnssutil3 -lsmime3 -lssl3 -lsoftokn3 -lplds4 -lplc4 -lnspr4 
libtool: link: x86_64-pld-linux-gcc -shared  -fPIC -DPIC  -O2 -gdwarf-4 -g2 -fstack-protector-strong -march=x86-64 -gdwarf-4 -g2 -Wl,--as-needed -Wl,--no-copy-dt-needed-entries -Wl,-z -Wl,relro -Wl,-z -Wl,combreloc   -pthread  python/.libs/_volume_key_la-volume_key_wrap.o   -Wl,-rpath -Wl,/tmp/B.ZjNokT/BUILD/volume_key-0.3.9/lib/.libs lib/.libs/libvolume_key.so -L/usr/lib64 -lblkid /usr/lib64/libgpgme.so /usr/lib64/libassuan.so /usr/lib64/libcryptsetup.so /usr/lib64/libuuid.so -ldevmapper /usr/lib64/libgcrypt.so /usr/lib64/libgpg-error.so -largon2 -lrt -ldl -ljson-c -lpython2.7 /usr/lib64/libglib-2.0.so /usr/lib64/libpcre.so -lpthread -lnss3 -lnssutil3 -lsmime3 -lssl3 -lsoftokn3 -lplds4 -lplc4 -lnspr4 -Wl,-soname -Wl,_volume_key.so -o python/.libs/_volume_key.so
libtool: link: ( cd "python/.libs" && rm -f "_volume_key.la" && ln -s "../_volume_key.la" "_volume_key.la" )
make[2]: Leaving directory '/tmp/B.ZjNokT/BUILD/volume_key-0.3.9'
make[1]: *** [Makefile:1224: all-recursive] Error 1
make: *** [Makefile:735: all] Error 2
error: Bad exit status from /tmp/B.ZjNokT/BUILD/tmp/rpm-tmp.98164 (%build)


RPM build errors:
    Bad exit status from /tmp/B.ZjNokT/BUILD/tmp/rpm-tmp.98164 (%build)
ended at: Tue May 15 12:31:02 2018, done in 0:00:13.582149
error: No files produced.
mesg: ttyname failed: Inappropriate ioctl for device
+ chmod -R u+rwX /tmp/B.ZjNokT/BUILD
+ rm -rf /tmp/B.ZjNokT/tmp /tmp/B.ZjNokT/BUILD
mesg: ttyname failed: Inappropriate ioctl for device
+ rm -rf /tmp/B.ZjNokT
Begin-PLD-Builder-Info
Build-Time: user:16.46s sys:2.18s real:18.39s (faults io:0 non-io:1073092)

End-PLD-Builder-Info
[Back to list of logs] [View rpm -qa of builder]