FailedOk

th/SRPMS[OK]
th/x32[OK]
th/i686[OK]
th/x86_64[OK]

ac/SRPMS[OK]
ac/i386[OK]
ac/i586[OK]
ac/i686[OK]
ac/alpha[OK]
ac/amd64[OK]
ac/athlon[OK]
ac/ppc[OK]
ac/sparc[OK]
ac/sparc64[OK]

Advanced Search
main()
Powered by PLD Linux
(c) 2002-2017 PLD Team
$Revision: 1.37 $
Powered by VAX.
Your IP: 54.80.30.49

wl 19ce97ba-5db8-42ec-9029-ab530ad366f8

Status:Failed
Source URL:ftp://buildlogs.pld-linux.org/th/x86_64/FAIL/wl,19ce97ba-5db8-42ec-9029-ab530ad366f8.bz2
text/plain URL:View!
rpm -qa of builder:View!
Date:2017/08/01 18:47:01
Runtime:0:00:05.603217

Toc:

  • prep
  • Executing(%prep): /bin/sh -e /tmp/B.hds137/BUILD/tmp/rpm-tmp.58713
  • build
  • Executing(%build): /bin/sh -e /tmp/B.hds137/BUILD/tmp/rpm-tmp.58713
  • error 1
  • /tmp/B.hds137/BUILD/wl-6.30.223.271/wl/src/wl/sys/wl_cfg80211_hybrid.c:1804:25: error: initialization from incompatible pointer type [-Werror=incompatible-pointer-types]
  • error 2
  • /tmp/B.hds137/BUILD/wl-6.30.223.271/wl/src/wl/sys/wl_cfg80211_hybrid.c:2412:4: error: passing argument 2 of 'cfg80211_roamed' from incompatible pointer type [-Werror=incompatible-pointer-types]
  • error 3
  • /tmp/B.hds137/BUILD/wl-6.30.223.271/wl/src/wl/sys/wl_cfg80211_hybrid.c:2410:2: error: too many arguments to function 'cfg80211_roamed'
  • error 4
  • error: Bad exit status from /tmp/B.hds137/BUILD/tmp/rpm-tmp.58713 (%build)
  • error 5
  • RPM build errors:
  • error 6
  • error: No files produced.

Content:

request from: baggins
checking if we should skip the build
started at: Tue Aug  1 18:46:50 2017
fetching https://srcbuilder.pld-linux.org/th//srpms/19ce97ba-5db8-42ec-9029-ab530ad366f8/wl-kernel-6.30.223.271-6%404.12.4_1.src.rpm
fetched 5775621 bytes, 3625.8 K/s
installing srpm: wl-kernel-6.30.223.271-6@4.12.4_1.src.rpm
mesg: ttyname failed: Inappropriate ioctl for device
+ install -d /tmp/B.hds137/BUILD /tmp/B.hds137/RPMS
+ LC_ALL=en_US.UTF-8
+ rpm -qp --changelog wl-kernel-6.30.223.271-6@4.12.4_1.src.rpm
* Tue Aug 01 2017 PLD Linux Team <feedback@pld-linux.org>
- For complete changelog see: http://git.pld-linux.org/?p=packages/wl.git;a=log;h=auto/th/wl-6.30.223.271-6
* Tue May 09 2017 Jan Rękorajski <baggins@pld-linux.org> 94191af
- fix building with kerbel 4.11 - rel 6 * Thu Jan 19 2017 Jan Rękorajski <baggins@pld-linux.org> f316d7d
- * added 17-fix-kernel-warnings.patch from Debian (avoid useless kernel warnings and possibly add better tracibility of bogus auth failures) - rel 5 * Tue Dec 27 2016 Jan Rękorajski <baggins@pld-linux.org> 18f1113
- rel 4 * Mon Nov 21 2016 Jan Rękorajski <baggins@pld-linux.org> f36814b
- updated URL * Mon Oct 10 2016 Jan Rękorajski <baggins@pld-linux.org> 0e2168f
- added patches from Debian to fix old crash and new one on linux 4.8 - rel 3 + rpm -Uhv --nodeps --define '_topdir /tmp/B.hds137' --define '_specdir %{_topdir}' --define '_sourcedir %{_specdir}' --define '_rpmdir %{_topdir}/RPMS' --define '_builddir %{_topdir}/BUILD' --without userspace --define 'build_kernels head,4.9,4.4,4.1' wl-kernel-6.30.223.271-6@4.12.4_1.src.rpm Preparing... ################################################## wl-kernel ################################################## + rm -f wl-kernel-6.30.223.271-6@4.12.4_1.src.rpm mesg: ttyname failed: Inappropriate ioctl for device + install -m 700 -d /tmp/B.hds137/BUILD/tmp mesg: ttyname failed: Inappropriate ioctl for device + TMPDIR=/tmp/B.hds137/BUILD/tmp + exec nice -n 0 rpmbuild -bp --short-circuit --nodeps --define '_topdir /tmp/B.hds137' --define '_specdir %{_topdir}' --define '_sourcedir %{_specdir}' --define '_rpmdir %{_topdir}/RPMS' --define '_builddir %{_topdir}/BUILD' --without userspace --target x86_64-pld-linux --define 'build_kernels head,4.9,4.4,4.1' --define 'prep exit 0' /tmp/B.hds137/wl.spec Building target platforms: x86_64-pld-linux checking BuildConflict-ing packages no BuildConflicts found checking BR rpm: Building target platforms: x86_64-pld-linux no BR needed building RPM using: set -ex; : build-id: 19ce97ba-5db8-42ec-9029-ab530ad366f8; TMPDIR=/tmp/B.hds137/BUILD/tmp exec nice -n 0 rpmbuild -bb --define '_smp_mflags -j5' --define '_make_opts -Otarget' --define '_pld_builder 1' --define '_topdir /tmp/B.hds137' --define '_specdir %{_topdir}' --define '_sourcedir %{_specdir}' --define '_rpmdir %{_topdir}/RPMS' --define '_builddir %{_topdir}/BUILD' --without userspace --target x86_64-pld-linux --define 'build_kernels head,4.9,4.4,4.1' /tmp/B.hds137/wl.spec mesg: ttyname failed: Inappropriate ioctl for device + : build-id: 19ce97ba-5db8-42ec-9029-ab530ad366f8 + TMPDIR=/tmp/B.hds137/BUILD/tmp + exec nice -n 0 rpmbuild -bb --define '_smp_mflags -j5' --define '_make_opts -Otarget' --define '_pld_builder 1' --define '_topdir /tmp/B.hds137' --define '_specdir %{_topdir}' --define '_sourcedir %{_specdir}' --define '_rpmdir %{_topdir}/RPMS' --define '_builddir %{_topdir}/BUILD' --without userspace --target x86_64-pld-linux --define 'build_kernels head,4.9,4.4,4.1' /tmp/B.hds137/wl.spec Building target platforms: x86_64-pld-linux Executing(%prep): /bin/sh -e /tmp/B.hds137/BUILD/tmp/rpm-tmp.58713 + umask 022 + cd /tmp/B.hds137/BUILD + cd /tmp/B.hds137/BUILD + rm -rf wl-6.30.223.271 + /bin/mkdir -p wl-6.30.223.271 + cd wl-6.30.223.271 + /usr/bin/gzip -dc /tmp/B.hds137/hybrid-v35_64-nodebug-pcoem-6_30_223_271.tar.gz + /bin/tar -xf - + STATUS=0 + '[' 0 -ne 0 ']' + /bin/id -u + '[' 1000 '=' 0 ']' + /bin/id -u + '[' 1000 '=' 0 ']' + /bin/chmod -Rf a+rX,u+w,g-w,o-w . + echo 'Patch #0 (13-broadcom-sta-6.30.223.248-linux-3.18-null-pointer-crash.patch):' Patch #0 (13-broadcom-sta-6.30.223.248-linux-3.18-null-pointer-crash.patch): + '[' -f /tmp/B.hds137/13-broadcom-sta-6.30.223.248-linux-3.18-null-pointer-crash.patch ']' + /bin/cat /tmp/B.hds137/13-broadcom-sta-6.30.223.248-linux-3.18-null-pointer-crash.patch + /usr/bin/patch -s -p1 + echo 'Patch #1 (gcc-4.9.patch):' Patch #1 (gcc-4.9.patch): + '[' -f /tmp/B.hds137/gcc-4.9.patch ']' + /bin/cat /tmp/B.hds137/gcc-4.9.patch + /usr/bin/patch -s -p1 + echo 'Patch #2 (no-dead-code.patch):' Patch #2 (no-dead-code.patch): + '[' -f /tmp/B.hds137/no-dead-code.patch ']' + /bin/cat /tmp/B.hds137/no-dead-code.patch + /usr/bin/patch -s -p1 + echo 'Patch #3 (linux-4.7.patch):' Patch #3 (linux-4.7.patch): + '[' -f /tmp/B.hds137/linux-4.7.patch ']' + /bin/cat /tmp/B.hds137/linux-4.7.patch + /usr/bin/patch -s -p1 + echo 'Patch #4 (linux-4.8.patch):' Patch #4 (linux-4.8.patch): + '[' -f /tmp/B.hds137/linux-4.8.patch ']' + /bin/cat /tmp/B.hds137/linux-4.8.patch + /usr/bin/patch -s -p1 + echo 'Patch #5 (17-fix-kernel-warnings.patch):' Patch #5 (17-fix-kernel-warnings.patch): + '[' -f /tmp/B.hds137/17-fix-kernel-warnings.patch ']' + /bin/cat /tmp/B.hds137/17-fix-kernel-warnings.patch + /usr/bin/patch -s -p2 + echo 'Patch #6 (linux-4.11.patch):' Patch #6 (linux-4.11.patch): + '[' -f /tmp/B.hds137/linux-4.11.patch ']' + /bin/cat /tmp/B.hds137/linux-4.11.patch + /usr/bin/patch -s -p1 + mkdir wl + mv lib src Makefile wl/ + cp -p /tmp/B.hds137/README.txt . + find '(' -name '*~' -o -name '*.orig' ')' -print0 + xargs -0 -r -l512 rm -f + exit 0 Executing(%build): /bin/sh -e /tmp/B.hds137/BUILD/tmp/rpm-tmp.58713 TMP=/home/users/builder/tmp HOME=/home/users/builder PATH=/home/users/builder/GNUstep/Tools:/usr/local/bin:/usr/bin:/bin:/home/users/builder/bin TMPDIR=/tmp/B.hds137/BUILD/tmp + umask 022 + cd /tmp/B.hds137/BUILD + cd wl-6.30.223.271 + /usr/bin/make -Otarget -j5 -C wl 'KERNELRELEASE=4.12.4-1' 'KBUILD_DIR=/usr/src/linux' clean make: Entering directory '/tmp/B.hds137/BUILD/wl-6.30.223.271/wl' Wireless Extension is the only possible API for this kernel version Using Wireless Extension API make: Leaving directory '/tmp/B.hds137/BUILD/wl-6.30.223.271/wl' make: Entering directory '/tmp/B.hds137/BUILD/wl-6.30.223.271/wl' KBUILD_NOPEDANTIC=1 make -C /usr/src/linux M=`pwd` clean make[1]: Entering directory '/usr/src/linux-4.12.4' make[1]: warning: jobserver unavailable: using -j1. Add '+' to parent make rule. make[1]: Leaving directory '/usr/src/linux-4.12.4' make[1]: Entering directory '/usr/src/linux-4.12.4' CFG80211 API is prefered for this kernel version /tmp/B.hds137/BUILD/wl-6.30.223.271/wl/Makefile:85: Neither CFG80211 nor Wireless Extension is enabled in kernel make[1]: Leaving directory '/usr/src/linux-4.12.4' make: Leaving directory '/tmp/B.hds137/BUILD/wl-6.30.223.271/wl' + /usr/bin/make -Otarget -j5 -C wl 'KERNELRELEASE=4.12.4-1' 'KBUILD_DIR=/usr/src/linux' make: Entering directory '/tmp/B.hds137/BUILD/wl-6.30.223.271/wl' Wireless Extension is the only possible API for this kernel version Using Wireless Extension API make: Leaving directory '/tmp/B.hds137/BUILD/wl-6.30.223.271/wl' make: Entering directory '/tmp/B.hds137/BUILD/wl-6.30.223.271/wl' KBUILD_NOPEDANTIC=1 make -C /usr/src/linux M=`pwd` make[1]: Entering directory '/usr/src/linux-4.12.4' make[1]: warning: jobserver unavailable: using -j1. Add '+' to parent make rule. make[1]: Leaving directory '/usr/src/linux-4.12.4' make[1]: Entering directory '/usr/src/linux-4.12.4' CFG80211 API is prefered for this kernel version Using CFG80211 API LD /tmp/B.hds137/BUILD/wl-6.30.223.271/wl/built-in.o CC [M] /tmp/B.hds137/BUILD/wl-6.30.223.271/wl/src/shared/linux_osl.o CC [M] /tmp/B.hds137/BUILD/wl-6.30.223.271/wl/src/wl/sys/wl_linux.o /tmp/B.hds137/BUILD/wl-6.30.223.271/wl/src/wl/sys/wl_linux.c: In function 'wl_pci_probe': /tmp/B.hds137/BUILD/wl-6.30.223.271/wl/src/wl/sys/wl_linux.c:779:2: warning: this 'if' clause does not guard... [-Wmisleading-indentation] if ((val & 0x0000ff00) != 0) ^~ /tmp/B.hds137/BUILD/wl-6.30.223.271/wl/src/wl/sys/wl_linux.c:781:3: note: ...this statement, but the latter is misleadingly indented as if it is guarded by the 'if' bar1_size = pci_resource_len(pdev, 2); ^~~~~~~~~ CC [M] /tmp/B.hds137/BUILD/wl-6.30.223.271/wl/src/wl/sys/wl_iw.o CC [M] /tmp/B.hds137/BUILD/wl-6.30.223.271/wl/src/wl/sys/wl_cfg80211_hybrid.o /tmp/B.hds137/BUILD/wl-6.30.223.271/wl/src/wl/sys/wl_cfg80211_hybrid.c:1804:25: error: initialization from incompatible pointer type [-Werror=incompatible-pointer-types] .change_virtual_intf = wl_cfg80211_change_iface, ^~~~~~~~~~~~~~~~~~~~~~~~ /tmp/B.hds137/BUILD/wl-6.30.223.271/wl/src/wl/sys/wl_cfg80211_hybrid.c:1804:25: note: (near initialization for 'wl_cfg80211_ops.change_virtual_intf') /tmp/B.hds137/BUILD/wl-6.30.223.271/wl/src/wl/sys/wl_cfg80211_hybrid.c: In function 'wl_bss_roaming_done': /tmp/B.hds137/BUILD/wl-6.30.223.271/wl/src/wl/sys/wl_cfg80211_hybrid.c:2412:4: error: passing argument 2 of 'cfg80211_roamed' from incompatible pointer type [-Werror=incompatible-pointer-types] &wl->conf->channel, ^ In file included from /tmp/B.hds137/BUILD/wl-6.30.223.271/wl/src/wl/sys/wl_cfg80211_hybrid.c:36:0: ./include/net/cfg80211.h:5435:6: note: expected 'struct cfg80211_roam_info *' but argument is of type 'struct ieee80211_channel *' void cfg80211_roamed(struct net_device *dev, struct cfg80211_roam_info *info, ^~~~~~~~~~~~~~~ /tmp/B.hds137/BUILD/wl-6.30.223.271/wl/src/wl/sys/wl_cfg80211_hybrid.c:2414:4: warning: passing argument 3 of 'cfg80211_roamed' makes integer from pointer without a cast [-Wint-conversion] (u8 *)&wl->bssid, ^ In file included from /tmp/B.hds137/BUILD/wl-6.30.223.271/wl/src/wl/sys/wl_cfg80211_hybrid.c:36:0: ./include/net/cfg80211.h:5435:6: note: expected 'gfp_t {aka unsigned int}' but argument is of type 'u8 * {aka unsigned char *}' void cfg80211_roamed(struct net_device *dev, struct cfg80211_roam_info *info, ^~~~~~~~~~~~~~~ /tmp/B.hds137/BUILD/wl-6.30.223.271/wl/src/wl/sys/wl_cfg80211_hybrid.c:2410:2: error: too many arguments to function 'cfg80211_roamed' cfg80211_roamed(ndev, ^~~~~~~~~~~~~~~ In file included from /tmp/B.hds137/BUILD/wl-6.30.223.271/wl/src/wl/sys/wl_cfg80211_hybrid.c:36:0: ./include/net/cfg80211.h:5435:6: note: declared here void cfg80211_roamed(struct net_device *dev, struct cfg80211_roam_info *info, ^~~~~~~~~~~~~~~ cc1: some warnings being treated as errors make[2]: *** [scripts/Makefile.build:303: /tmp/B.hds137/BUILD/wl-6.30.223.271/wl/src/wl/sys/wl_cfg80211_hybrid.o] Error 1 make[1]: *** [Makefile:1515: _module_/tmp/B.hds137/BUILD/wl-6.30.223.271/wl] Error 2 make[1]: Leaving directory '/usr/src/linux-4.12.4' make: *** [Makefile:159: all] Error 2 make: Leaving directory '/tmp/B.hds137/BUILD/wl-6.30.223.271/wl' error: Bad exit status from /tmp/B.hds137/BUILD/tmp/rpm-tmp.58713 (%build) RPM build errors: Bad exit status from /tmp/B.hds137/BUILD/tmp/rpm-tmp.58713 (%build) ended at: Tue Aug 1 18:47:00 2017, done in 0:00:05.603217 error: No files produced. mesg: ttyname failed: Inappropriate ioctl for device + chmod -R u+rwX /tmp/B.hds137/BUILD + rm -rf /tmp/B.hds137/tmp /tmp/B.hds137/BUILD mesg: ttyname failed: Inappropriate ioctl for device + rm -rf /tmp/B.hds137 Begin-PLD-Builder-Info Build-Time: user:5.77s sys:1.13s real:10.89s (faults io:0 non-io:618676) End-PLD-Builder-Info
[Back to list of logs] [View rpm -qa of builder]