FailedOk

th/SRPMS[OK]
th/x32[OK]
th/i686[OK]
th/x86_64[OK]

ac/SRPMS[OK]
ac/i386[OK]
ac/i586[OK]
ac/i686[OK]
ac/alpha[OK]
ac/amd64[OK]
ac/athlon[OK]
ac/ppc[OK]
ac/sparc[OK]
ac/sparc64[OK]

Advanced Search
main()
Powered by PLD Linux
(c) 2002-2017 PLD Team
$Revision: 1.37 $
Powered by The Golden Path.
Your IP: 54.81.131.189

wmfire b2fdfa18-c5f6-48cf-a220-095f52ea71da

Status:Failed
Source URL:ftp://buildlogs.pld-linux.org/th/x86_64/FAIL/wmfire,b2fdfa18-c5f6-48cf-a220-095f52ea71da.bz2
text/plain URL:View!
rpm -qa of builder:View!
Date:2017/09/24 20:56:28
Runtime:0:00:04.180509

Toc:

  • prep
  • Executing(%prep): /bin/sh -e /tmp/B.0iLXBV/BUILD/tmp/rpm-tmp.49014
  • build
  • Executing(%build): /bin/sh -e /tmp/B.0iLXBV/BUILD/tmp/rpm-tmp.49014
  • error 1
  • /usr/bin/ld: wmfire.o: undefined reference to symbol 'floor@@GLIBC_2.2.5'
  • error 2
  • collect2: error: ld returned 1 exit status
  • error 3
  • error: Bad exit status from /tmp/B.0iLXBV/BUILD/tmp/rpm-tmp.49014 (%build)
  • error 4
  • RPM build errors:
  • error 5
  • error: No files produced.

Content:

request from: megabajt
checking if we should skip the build
started at: Sun Sep 24 20:56:21 2017
fetching https://srcbuilder.pld-linux.org/th//srpms/b2fdfa18-c5f6-48cf-a220-095f52ea71da/wmfire-1.2.3-3.src.rpm
fetched 103059 bytes, 210.3 K/s
installing srpm: wmfire-1.2.3-3.src.rpm
mesg: ttyname failed: Inappropriate ioctl for device
+ install -d /tmp/B.0iLXBV/BUILD /tmp/B.0iLXBV/RPMS
+ LC_ALL=en_US.UTF-8
+ rpm -qp --changelog wmfire-1.2.3-3.src.rpm
* Sun Sep 24 2017 PLD Linux Team <feedback@pld-linux.org>
- For complete changelog see: http://git.pld-linux.org/?p=packages/wmfire.git;a=log;h=master
+ rpm -Uhv --nodeps --define '_topdir /tmp/B.0iLXBV' --define '_specdir %{_topdir}' --define '_sourcedir %{_specdir}' --define '_rpmdir %{_topdir}/RPMS' --define '_builddir %{_topdir}/BUILD' wmfire-1.2.3-3.src.rpm Preparing... ################################################## wmfire ################################################## + rm -f wmfire-1.2.3-3.src.rpm mesg: ttyname failed: Inappropriate ioctl for device + install -m 700 -d /tmp/B.0iLXBV/BUILD/tmp mesg: ttyname failed: Inappropriate ioctl for device + TMPDIR=/tmp/B.0iLXBV/BUILD/tmp + exec nice -n 0 rpmbuild -bp --short-circuit --nodeps --define '_topdir /tmp/B.0iLXBV' --define '_specdir %{_topdir}' --define '_sourcedir %{_specdir}' --define '_rpmdir %{_topdir}/RPMS' --define '_builddir %{_topdir}/BUILD' --target x86_64-pld-linux --define 'prep exit 0' /tmp/B.0iLXBV/wmfire.spec Building target platforms: x86_64-pld-linux checking BuildConflict-ing packages no BuildConflicts found checking BR rpm: Building target platforms: x86_64-pld-linux no BR needed building RPM using: set -ex; : build-id: b2fdfa18-c5f6-48cf-a220-095f52ea71da; TMPDIR=/tmp/B.0iLXBV/BUILD/tmp exec nice -n 0 rpmbuild -bb --define '_smp_mflags -j5' --define '_make_opts -Otarget' --define '_pld_builder 1' --define '_topdir /tmp/B.0iLXBV' --define '_specdir %{_topdir}' --define '_sourcedir %{_specdir}' --define '_rpmdir %{_topdir}/RPMS' --define '_builddir %{_topdir}/BUILD' --target x86_64-pld-linux /tmp/B.0iLXBV/wmfire.spec mesg: ttyname failed: Inappropriate ioctl for device + : build-id: b2fdfa18-c5f6-48cf-a220-095f52ea71da + TMPDIR=/tmp/B.0iLXBV/BUILD/tmp + exec nice -n 0 rpmbuild -bb --define '_smp_mflags -j5' --define '_make_opts -Otarget' --define '_pld_builder 1' --define '_topdir /tmp/B.0iLXBV' --define '_specdir %{_topdir}' --define '_sourcedir %{_specdir}' --define '_rpmdir %{_topdir}/RPMS' --define '_builddir %{_topdir}/BUILD' --target x86_64-pld-linux /tmp/B.0iLXBV/wmfire.spec Building target platforms: x86_64-pld-linux Executing(%prep): /bin/sh -e /tmp/B.0iLXBV/BUILD/tmp/rpm-tmp.49014 + umask 022 + cd /tmp/B.0iLXBV/BUILD + cd /tmp/B.0iLXBV/BUILD + rm -rf wmfire-1.2.3 + /usr/bin/gzip -dc /tmp/B.0iLXBV/wmfire-1.2.3.tar.gz + /bin/tar -xf - + STATUS=0 + '[' 0 -ne 0 ']' + cd wmfire-1.2.3 + /bin/id -u + '[' 1000 '=' 0 ']' + /bin/id -u + '[' 1000 '=' 0 ']' + /bin/chmod -Rf a+rX,u+w,g-w,o-w . + exit 0 Executing(%build): /bin/sh -e /tmp/B.0iLXBV/BUILD/tmp/rpm-tmp.49014 TMP=/home/users/builder/tmp HOME=/home/users/builder PATH=/home/users/builder/GNUstep/Tools:/usr/local/bin:/usr/bin:/bin:/home/users/builder/bin TMPDIR=/tmp/B.0iLXBV/BUILD/tmp + umask 022 + cd /tmp/B.0iLXBV/BUILD + cd wmfire-1.2.3 + rm -f missing + aclocal aclocal: warning: autoconf input should be named 'configure.ac', not 'configure.in' configure.in:37: warning: AC_CACHE_VAL(GDKINCS, ...): suspicious cache-id, must contain _cv_ to be cached ../../lib/autoconf/general.m4:2031: AC_CACHE_VAL is expanded from... ../../lib/autoconf/general.m4:2052: AC_CACHE_CHECK is expanded from... configure.in:37: the top level configure.in:38: warning: AC_CACHE_VAL(GDKLIBS, ...): suspicious cache-id, must contain _cv_ to be cached ../../lib/autoconf/general.m4:2031: AC_CACHE_VAL is expanded from... ../../lib/autoconf/general.m4:2052: AC_CACHE_CHECK is expanded from... configure.in:38: the top level configure.in:40: warning: AC_CACHE_VAL(GTOPINCS, ...): suspicious cache-id, must contain _cv_ to be cached ../../lib/autoconf/general.m4:2031: AC_CACHE_VAL is expanded from... ../../lib/autoconf/general.m4:2052: AC_CACHE_CHECK is expanded from... configure.in:40: the top level configure.in:41: warning: AC_CACHE_VAL(GTOPLIBS, ...): suspicious cache-id, must contain _cv_ to be cached ../../lib/autoconf/general.m4:2031: AC_CACHE_VAL is expanded from... ../../lib/autoconf/general.m4:2052: AC_CACHE_CHECK is expanded from... configure.in:41: the top level + autoconf configure.in:37: warning: AC_CACHE_VAL(GDKINCS, ...): suspicious cache-id, must contain _cv_ to be cached ../../lib/autoconf/general.m4:2031: AC_CACHE_VAL is expanded from... ../../lib/autoconf/general.m4:2052: AC_CACHE_CHECK is expanded from... configure.in:37: the top level configure.in:38: warning: AC_CACHE_VAL(GDKLIBS, ...): suspicious cache-id, must contain _cv_ to be cached ../../lib/autoconf/general.m4:2031: AC_CACHE_VAL is expanded from... ../../lib/autoconf/general.m4:2052: AC_CACHE_CHECK is expanded from... configure.in:38: the top level configure.in:40: warning: AC_CACHE_VAL(GTOPINCS, ...): suspicious cache-id, must contain _cv_ to be cached ../../lib/autoconf/general.m4:2031: AC_CACHE_VAL is expanded from... ../../lib/autoconf/general.m4:2052: AC_CACHE_CHECK is expanded from... configure.in:40: the top level configure.in:41: warning: AC_CACHE_VAL(GTOPLIBS, ...): suspicious cache-id, must contain _cv_ to be cached ../../lib/autoconf/general.m4:2031: AC_CACHE_VAL is expanded from... ../../lib/autoconf/general.m4:2052: AC_CACHE_CHECK is expanded from... configure.in:41: the top level + automake -a -c -f --foreign automake: warning: autoconf input should be named 'configure.ac', not 'configure.in' configure.in:37: warning: AC_CACHE_VAL(GDKINCS, ...): suspicious cache-id, must contain _cv_ to be cached ../../lib/autoconf/general.m4:2031: AC_CACHE_VAL is expanded from... ../../lib/autoconf/general.m4:2052: AC_CACHE_CHECK is expanded from... configure.in:37: the top level configure.in:38: warning: AC_CACHE_VAL(GDKLIBS, ...): suspicious cache-id, must contain _cv_ to be cached ../../lib/autoconf/general.m4:2031: AC_CACHE_VAL is expanded from... ../../lib/autoconf/general.m4:2052: AC_CACHE_CHECK is expanded from... configure.in:38: the top level configure.in:40: warning: AC_CACHE_VAL(GTOPINCS, ...): suspicious cache-id, must contain _cv_ to be cached ../../lib/autoconf/general.m4:2031: AC_CACHE_VAL is expanded from... ../../lib/autoconf/general.m4:2052: AC_CACHE_CHECK is expanded from... configure.in:40: the top level configure.in:41: warning: AC_CACHE_VAL(GTOPLIBS, ...): suspicious cache-id, must contain _cv_ to be cached ../../lib/autoconf/general.m4:2031: AC_CACHE_VAL is expanded from... ../../lib/autoconf/general.m4:2052: AC_CACHE_CHECK is expanded from... configure.in:41: the top level configure.in:3: warning: AM_INIT_AUTOMAKE: two- and three-arguments forms are deprecated. For more info, see: configure.in:3: http://www.gnu.org/software/automake/manual/automake.html#Modernize-AM_005fINIT_005fAUTOMAKE-invocation configure.in:6: installing './compile' configure.in:3: installing './missing' src/Makefile.am:17: warning: 'INCLUDES' is the old name for 'AM_CPPFLAGS' (or '*_CPPFLAGS') automake: warning: autoconf input should be named 'configure.ac', not 'configure.in' + ./configure 'LDFLAGS=-Wl,--as-needed -Wl,--no-copy-dt-needed-entries -Wl,-z,relro -Wl,-z,combreloc ' 'CFLAGS=-O2 -fwrapv -pipe -Wformat -Werror=format-security -gdwarf-4 -fno-debug-types-section -fvar-tracking-assignments -g2 -Wp,-D_FORTIFY_SOURCE=2 -fstack-protector-strong --param=ssp-buffer-size=4 -fPIC -march=x86-64 -gdwarf-4 -fno-debug-types-section -fvar-tracking-assignments -g2 ' 'CXXFLAGS=-O2 -fwrapv -pipe -Wformat -Werror=format-security -gdwarf-4 -fno-debug-types-section -fvar-tracking-assignments -g2 -Wp,-D_FORTIFY_SOURCE=2 -fstack-protector-strong --param=ssp-buffer-size=4 -fPIC -march=x86-64 -gdwarf-4 -fno-debug-types-section -fvar-tracking-assignments -g2 ' 'FFLAGS=-O2 -fwrapv -pipe -Wformat -Werror=format-security -gdwarf-4 -fno-debug-types-section -fvar-tracking-assignments -g2 -Wp,-D_FORTIFY_SOURCE=2 -fstack-protector-strong --param=ssp-buffer-size=4 -fPIC -march=x86-64 -gdwarf-4 -fno-debug-types-section -fvar-tracking-assignments -g2 ' 'FCFLAGS=-O2 -fwrapv -pipe -Wformat -Werror=format-security -gdwarf-4 -fno-debug-types-section -fvar-tracking-assignments -g2 -Wp,-D_FORTIFY_SOURCE=2 -fstack-protector-strong --param=ssp-buffer-size=4 -fPIC -march=x86-64 -gdwarf-4 -fno-debug-types-section -fvar-tracking-assignments -g2 ' 'CPPFLAGS=' 'CC=x86_64-pld-linux-gcc' 'CXX=x86_64-pld-linux-g++' '--host=x86_64-pld-linux' '--build=x86_64-pld-linux' '--prefix=/usr' '--exec-prefix=/usr' '--bindir=/usr/bin' '--sbindir=/usr/sbin' '--sysconfdir=/etc' '--datadir=/usr/share' '--includedir=/usr/include' '--libdir=/usr/lib64' '--libexecdir=/usr/lib64' '--localstatedir=/var' '--sharedstatedir=/var/lib' '--mandir=/usr/share/man' '--infodir=/usr/share/info' '--x-libraries=/usr/lib64' checking for a BSD-compatible install... /usr/bin/install -c checking whether build environment is sane... yes checking for a thread-safe mkdir -p... /bin/mkdir -p checking for mawk... mawk checking whether make sets $(MAKE)... yes checking whether make supports nested variables... yes checking for mawk... (cached) mawk checking for x86_64-pld-linux-gcc... x86_64-pld-linux-gcc checking whether the C compiler works... yes checking for C compiler default output file name... a.out checking for suffix of executables... checking whether we are cross compiling... no checking for suffix of object files... o checking whether we are using the GNU C compiler... yes checking whether x86_64-pld-linux-gcc accepts -g... yes checking for x86_64-pld-linux-gcc option to accept ISO C89... none needed checking whether x86_64-pld-linux-gcc understands -c and -o together... yes checking for style of include used by make... GNU checking dependency style of x86_64-pld-linux-gcc... gcc3 checking whether ln -s works... yes checking how to run the C preprocessor... x86_64-pld-linux-gcc -E checking for X... libraries /usr/lib64, headers checking for main in -lX11... yes checking for main in -lXext... yes checking for dirent.h that defines DIR... yes checking for library containing opendir... none required checking for grep that handles long lines and -e... /bin/grep checking for egrep... /bin/grep -E checking for ANSI C header files... yes checking for sys/wait.h that is POSIX.1 compatible... yes checking for sys/types.h... yes checking for sys/stat.h... yes checking for stdlib.h... yes checking for string.h... yes checking for memory.h... yes checking for strings.h... yes checking for inttypes.h... yes checking for stdint.h... yes checking for unistd.h... yes checking for unistd.h... (cached) yes checking for an ANSI C-conforming const... yes checking for pkg-config... /usr/bin/pkg-config checking for gdk2 includes... -pthread -I/usr/include/gtk-2.0 -I/usr/lib64/gtk-2.0/include -I/usr/include/pango-1.0 -I/usr/include/gio-unix-2.0/ -I/usr/include/cairo -I/usr/include/atk-1.0 -I/usr/include/cairo -I/usr/include/pixman-1 -I/usr/include/gdk-pixbuf-2.0 -I/usr/include/pango-1.0 -I/usr/include/freetype2 -I/usr/include/libpng16 -I/usr/include/harfbuzz -I/usr/include/glib-2.0 -I/usr/lib64/glib-2.0/include -I/usr/include/freetype2 -I/usr/include/libpng16 -I/usr/include/harfbuzz -I/usr/include/glib-2.0 -I/usr/lib64/glib-2.0/include checking for gdk2 libs... -lgdk-x11-2.0 -lpangocairo-1.0 -lgio-2.0 -lXrender -lXinerama -lXi -lXrandr -lXcursor -lXcomposite -lXdamage -lXfixes -lX11 -lXext -lcairo -lgdk_pixbuf-2.0 -lgio-2.0 -lpangoft2-1.0 -lpango-1.0 -lgobject-2.0 -lglib-2.0 -lfontconfig -lfreetype checking for libgtop2 includes... -I/usr/include/libgtop-2.0 -I/usr/include/glib-2.0 -I/usr/lib64/glib-2.0/include checking for libgtop2 libs... -lgtop-2.0 -lglib-2.0 checking for strstr... yes checking that generated files are newer than configure... done configure: creating ./config.status config.status: creating Makefile config.status: creating src/Makefile config.status: executing depfiles commands + /usr/bin/make -Otarget -j5 Making all in src make[1]: Entering directory '/tmp/B.0iLXBV/BUILD/wmfire-1.2.3/src' x86_64-pld-linux-gcc -DPACKAGE_NAME=\"\" -DPACKAGE_TARNAME=\"\" -DPACKAGE_VERSION=\"\" -DPACKAGE_STRING=\"\" -DPACKAGE_BUGREPORT=\"\" -DPACKAGE_URL=\"\" -DPACKAGE=\"wmfire\" -DVERSION=\"1.2.3\" -DHAVE_LIBX11=1 -DHAVE_LIBXEXT=1 -DHAVE_DIRENT_H=1 -DSTDC_HEADERS=1 -DHAVE_SYS_WAIT_H=1 -DHAVE_SYS_TYPES_H=1 -DHAVE_SYS_STAT_H=1 -DHAVE_STDLIB_H=1 -DHAVE_STRING_H=1 -DHAVE_MEMORY_H=1 -DHAVE_STRINGS_H=1 -DHAVE_INTTYPES_H=1 -DHAVE_STDINT_H=1 -DHAVE_UNISTD_H=1 -DHAVE_UNISTD_H=1 -DHAVE_STRSTR=1 -I. -I/usr/X11R6/include -I/usr/local/include -O2 -fwrapv -pipe -Wformat -Werror=format-security -gdwarf-4 -fno-debug-types-section -fvar-tracking-assignments -g2 -Wp,-D_FORTIFY_SOURCE=2 -fstack-protector-strong --param=ssp-buffer-size=4 -fPIC -march=x86-64 -gdwarf-4 -fno-debug-types-section -fvar-tracking-assignments -g2 -pthread -I/usr/include/gtk-2.0 -I/usr/lib64/gtk-2.0/include -I/usr/include/pango-1.0 -I/usr/include/gio-unix-2.0/ -I/usr/include/cairo -I/usr/include/atk-1.0 -I/usr/include/cairo -I/usr/include/pixman-1 -I/usr/include/gdk-pixbuf-2.0 -I/usr/include/pango-1.0 -I/usr/include/freetype2 -I/usr/include/libpng16 -I/usr/include/harfbuzz -I/usr/include/glib-2.0 -I/usr/lib64/glib-2.0/include -I/usr/include/freetype2 -I/usr/include/libpng16 -I/usr/include/harfbuzz -I/usr/include/glib-2.0 -I/usr/lib64/glib-2.0/include -I/usr/include/libgtop-2.0 -I/usr/include/glib-2.0 -I/usr/lib64/glib-2.0/include -MT wmfire.o -MD -MP -MF .deps/wmfire.Tpo -c -o wmfire.o wmfire.c wmfire.c:546:36: warning: 'bm' is static but used in inline function 'draw_fire' which is not static memcpy(&bm.rgb[i * 3], &bm.flame[bm.cmap[i] * 3], 3); ^~ wmfire.c:546:27: warning: 'bm' is static but used in inline function 'draw_fire' which is not static memcpy(&bm.rgb[i * 3], &bm.flame[bm.cmap[i] * 3], 3); ^~ wmfire.c:546:11: warning: 'bm' is static but used in inline function 'draw_fire' which is not static memcpy(&bm.rgb[i * 3], &bm.flame[bm.cmap[i] * 3], 3); ^~ wmfire.c:540:86: warning: 'bm' is static but used in inline function 'draw_fire' which is not static bm.cmap[j] = (bm.cmap[j + XMAX - 1] + bm.cmap[j + XMAX] + bm.cmap[j + XMAX + 1] + bm.cmap[j]) >> 2; ^~ wmfire.c:540:62: warning: 'bm' is static but used in inline function 'draw_fire' which is not static bm.cmap[j] = (bm.cmap[j + XMAX - 1] + bm.cmap[j + XMAX] + bm.cmap[j + XMAX + 1] + bm.cmap[j]) >> 2; ^~ wmfire.c:540:42: warning: 'bm' is static but used in inline function 'draw_fire' which is not static bm.cmap[j] = (bm.cmap[j + XMAX - 1] + bm.cmap[j + XMAX] + bm.cmap[j + XMAX + 1] + bm.cmap[j]) >> 2; ^~ wmfire.c:540:18: warning: 'bm' is static but used in inline function 'draw_fire' which is not static bm.cmap[j] = (bm.cmap[j + XMAX - 1] + bm.cmap[j + XMAX] + bm.cmap[j + XMAX + 1] + bm.cmap[j]) >> 2; ^~ wmfire.c:540:4: warning: 'bm' is static but used in inline function 'draw_fire' which is not static bm.cmap[j] = (bm.cmap[j + XMAX - 1] + bm.cmap[j + XMAX] + bm.cmap[j + XMAX + 1] + bm.cmap[j]) >> 2; ^~ wmfire.c:501:14: warning: 'bm' is static but used in inline function 'draw_fire' which is not static memset(&bm.cmap[29 * XMAX + 20], 255, 16); ^~ wmfire.c:500:14: warning: 'bm' is static but used in inline function 'draw_fire' which is not static memset(&bm.cmap[28 * XMAX + 20], 255, 16); ^~ wmfire.c:499:14: warning: 'bm' is static but used in inline function 'draw_fire' which is not static memset(&bm.cmap[27 * XMAX + 20], 255, 16); ^~ wmfire.c:487:26: warning: 'bm' is static but used in inline function 'draw_fire' which is not static gdk_window_get_pointer(bm.win, &x, &y, NULL); ^~ wmfire.c:483:54: warning: 'bm' is static but used in inline function 'draw_fire' which is not static bm.cmap[(random() % XMAX) + ((YMAX - 1) * XMAX)] = bm.cmap[i + ((YMAX - 1) * XMAX)] >> 1; ^~ wmfire.c:483:3: warning: 'bm' is static but used in inline function 'draw_fire' which is not static bm.cmap[(random() % XMAX) + ((YMAX - 1) * XMAX)] = bm.cmap[i + ((YMAX - 1) * XMAX)] >> 1; ^~ wmfire.c:481:3: warning: 'bm' is static but used in inline function 'draw_fire' which is not static bm.cmap[(random() % XMAX) + ((YMAX - 1) * XMAX)] = random() % NCOLOURS; ^~ wmfire.c: In function 'update_file': wmfire.c:373:2: warning: ignoring return value of 'fgets', declared with attribute warn_unused_result [-Wunused-result] fgets(buf, sizeof (buf), fp); ^~~~~~~~~~~~~~~~~~~~~~~~~~~~ mv -f .deps/wmfire.Tpo .deps/wmfire.Po make[1]: Leaving directory '/tmp/B.0iLXBV/BUILD/wmfire-1.2.3/src' make[1]: Entering directory '/tmp/B.0iLXBV/BUILD/wmfire-1.2.3/src' x86_64-pld-linux-gcc -O2 -fwrapv -pipe -Wformat -Werror=format-security -gdwarf-4 -fno-debug-types-section -fvar-tracking-assignments -g2 -Wp,-D_FORTIFY_SOURCE=2 -fstack-protector-strong --param=ssp-buffer-size=4 -fPIC -march=x86-64 -gdwarf-4 -fno-debug-types-section -fvar-tracking-assignments -g2 -pthread -I/usr/include/gtk-2.0 -I/usr/lib64/gtk-2.0/include -I/usr/include/pango-1.0 -I/usr/include/gio-unix-2.0/ -I/usr/include/cairo -I/usr/include/atk-1.0 -I/usr/include/cairo -I/usr/include/pixman-1 -I/usr/include/gdk-pixbuf-2.0 -I/usr/include/pango-1.0 -I/usr/include/freetype2 -I/usr/include/libpng16 -I/usr/include/harfbuzz -I/usr/include/glib-2.0 -I/usr/lib64/glib-2.0/include -I/usr/include/freetype2 -I/usr/include/libpng16 -I/usr/include/harfbuzz -I/usr/include/glib-2.0 -I/usr/lib64/glib-2.0/include -I/usr/include/libgtop-2.0 -I/usr/include/glib-2.0 -I/usr/lib64/glib-2.0/include -lXext -lX11 -L/usr/X11R6/lib -L/usr/local/lib -Wl,--as-needed -Wl,--no-copy-dt-needed-entries -Wl,-z,relro -Wl,-z,combreloc -lgdk-x11-2.0 -lpangocairo-1.0 -lgio-2.0 -lXrender -lXinerama -lXi -lXrandr -lXcursor -lXcomposite -lXdamage -lXfixes -lX11 -lXext -lcairo -lgdk_pixbuf-2.0 -lgio-2.0 -lpangoft2-1.0 -lpango-1.0 -lgobject-2.0 -lglib-2.0 -lfontconfig -lfreetype -lgtop-2.0 -lglib-2.0 -o wmfire wmfire.o -Wl,--as-needed -Wl,--no-copy-dt-needed-entries -Wl,-z,relro -Wl,-z,combreloc -lgdk-x11-2.0 -lpangocairo-1.0 -lgio-2.0 -lXrender -lXinerama -lXi -lXrandr -lXcursor -lXcomposite -lXdamage -lXfixes -lX11 -lXext -lcairo -lgdk_pixbuf-2.0 -lgio-2.0 -lpangoft2-1.0 -lpango-1.0 -lgobject-2.0 -lglib-2.0 -lfontconfig -lfreetype -lgtop-2.0 -lglib-2.0 -lXext -lX11 /usr/bin/ld: wmfire.o: undefined reference to symbol 'floor@@GLIBC_2.2.5' /lib64/libm.so.6: error adding symbols: DSO missing from command line collect2: error: ld returned 1 exit status make[1]: *** [Makefile:345: wmfire] Error 1 make[1]: Leaving directory '/tmp/B.0iLXBV/BUILD/wmfire-1.2.3/src' make: *** [Makefile:411: all-recursive] Error 1 error: Bad exit status from /tmp/B.0iLXBV/BUILD/tmp/rpm-tmp.49014 (%build) RPM build errors: Bad exit status from /tmp/B.0iLXBV/BUILD/tmp/rpm-tmp.49014 (%build) ended at: Sun Sep 24 20:56:27 2017, done in 0:00:04.180509 error: No files produced. mesg: ttyname failed: Inappropriate ioctl for device + chmod -R u+rwX /tmp/B.0iLXBV/BUILD + rm -rf /tmp/B.0iLXBV/tmp /tmp/B.0iLXBV/BUILD mesg: ttyname failed: Inappropriate ioctl for device + rm -rf /tmp/B.0iLXBV Begin-PLD-Builder-Info Build-Time: user:4.19s sys:0.51s real:6.68s (faults io:0 non-io:343871) End-PLD-Builder-Info
[Back to list of logs] [View rpm -qa of builder]