FailedOk

th/SRPMS[OK]
th/x32[OK]
th/i686[OK]
th/x86_64[OK]

ac/SRPMS[OK]
ac/i386[OK]
ac/i586[OK]
ac/i686[OK]
ac/alpha[OK]
ac/amd64[OK]
ac/athlon[OK]
ac/ppc[OK]
ac/sparc[OK]
ac/sparc64[OK]

Advanced Search
main()
Powered by PLD Linux
(c) 2002-2017 PLD Team
$Revision: 1.37 $
Powered by ITS.
Your IP: 54.166.152.111

xavs a16011d4-36db-4a90-b866-f6c33014e525

Status:Failed
Source URL:ftp://buildlogs.pld-linux.org/th/x86_64/FAIL/xavs,a16011d4-36db-4a90-b866-f6c33014e525.bz2
text/plain URL:View!
full text:View!
rpm -qa of builder:View!
Date:2017/07/20 20:24:55
Runtime:0:00:06.286700

Toc:

  • error 1
  • collect2: error: ld returned 1 exit status
  • error 2
  • error: Bad exit status from /tmp/B.NImvEC/BUILD/tmp/rpm-tmp.44502 (%build)
  • error 3
  • RPM build errors:
  • error 4
  • error: No files produced.

Content:

             ^~~~~~~~~~~~~~~~~~~~~~
common/i386/dct-c.c:120:61: warning: passing argument 3 of 'xavs_add8x8_idct8_sse2' makes pointer from integer without a cast [-Wint-conversion]
     xavs_add8x8_idct8_sse2( p_dst+8*FDEC_STRIDE,   dct[2] , tmp[2]);
                                                             ^~~
common/i386/dct-c.c:113:13: note: expected 'int16_t * {aka short int *}' but argument is of type 'int16_t {aka short int}'
 extern void xavs_add8x8_idct8_sse2  (uint8_t *dst, int16_t dct[8][8],   int16_t *tmp);
             ^~~~~~~~~~~~~~~~~~~~~~
common/i386/dct-c.c:121:61: warning: passing argument 3 of 'xavs_add8x8_idct8_sse2' makes pointer from integer without a cast [-Wint-conversion]
     xavs_add8x8_idct8_sse2( p_dst+8*FDEC_STRIDE+8, dct[3] , tmp[3]);
                                                             ^~~
common/i386/dct-c.c:113:13: note: expected 'int16_t * {aka short int *}' but argument is of type 'int16_t {aka short int}'
 extern void xavs_add8x8_idct8_sse2  (uint8_t *dst, int16_t dct[8][8],   int16_t *tmp);
             ^~~~~~~~~~~~~~~~~~~~~~
x86_64-pld-linux-gcc -O4 -ffast-math  -Wall -I. -DHAVE_MMX -DHAVE_MMXEXT -DHAVE_SSE -DHAVE_SSE2 -O2 -fwrapv -pipe -Wformat -Werror=format-security -gdwarf-4 -fno-debug-types-section -fvar-tracking-assignments -g2 -Wp,-D_FORTIFY_SOURCE=2 -fstack-protector-strong --param=ssp-buffer-size=4 -fPIC -march=x86-64 -gdwarf-4 -fno-debug-types-section -fvar-tracking-assignments -g2   -fno-strict-aliasing -DHAVE_MALLOC_H -std=gnu99 -DHAVE_PTHREAD -fPIC -s -fomit-frame-pointer   -c -o encoder/me.o encoder/me.c
x86_64-pld-linux-gcc -O4 -ffast-math  -Wall -I. -DHAVE_MMX -DHAVE_MMXEXT -DHAVE_SSE -DHAVE_SSE2 -O2 -fwrapv -pipe -Wformat -Werror=format-security -gdwarf-4 -fno-debug-types-section -fvar-tracking-assignments -g2 -Wp,-D_FORTIFY_SOURCE=2 -fstack-protector-strong --param=ssp-buffer-size=4 -fPIC -march=x86-64 -gdwarf-4 -fno-debug-types-section -fvar-tracking-assignments -g2   -fno-strict-aliasing -DHAVE_MALLOC_H -std=gnu99 -DHAVE_PTHREAD -fPIC -s -fomit-frame-pointer   -c -o encoder/encoder.o encoder/encoder.c
yasm -f elf -m amd64 -DPIC -DARCH_X86_64 -Icommon/i386/ -o common/i386/cpu-a.o common/i386/cpu-a.asm
yasm -f elf -m amd64 -DPIC -DARCH_X86_64 -Icommon/i386/ -o common/i386/dct-sse2.o common/i386/dct-sse2.asm
common/i386/dct-sse2.asm:870: warning: redefining multi-line macro `XMM_EXTEND_CBA'
x86_64-pld-linux-gcc -O4 -ffast-math  -Wall -I. -DHAVE_MMX -DHAVE_MMXEXT -DHAVE_SSE -DHAVE_SSE2 -O2 -fwrapv -pipe -Wformat -Werror=format-security -gdwarf-4 -fno-debug-types-section -fvar-tracking-assignments -g2 -Wp,-D_FORTIFY_SOURCE=2 -fstack-protector-strong --param=ssp-buffer-size=4 -fPIC -march=x86-64 -gdwarf-4 -fno-debug-types-section -fvar-tracking-assignments -g2   -fno-strict-aliasing -DHAVE_MALLOC_H -std=gnu99 -DHAVE_PTHREAD -fPIC -s -fomit-frame-pointer   -c -o encoder/eval.o encoder/eval.c
yasm -f elf -m amd64 -DPIC -DARCH_X86_64 -Icommon/i386/ -o common/i386/deblock.o common/i386/deblock.asm
common/i386/deblock.asm:6: warning: Unrecognized qualifier `data'
yasm -f elf -m amd64 -DPIC -DARCH_X86_64 -Icommon/i386/ -o common/i386/deblock_intra.o common/i386/deblock_intra.asm
common/i386/deblock_intra.asm:4: warning: Unrecognized qualifier `data'
yasm -f elf -m amd64 -DPIC -DARCH_X86_64 -Icommon/i386/ -o common/i386/mc-a01.o common/i386/mc-a01.asm
common/i386/mc-a01.asm:33: warning: Unrecognized qualifier `data'
yasm -f elf -m amd64 -DPIC -DARCH_X86_64 -Icommon/i386/ -o common/i386/mc-a.o common/i386/mc-a.asm
common/i386/mc-a.asm:45: warning: Unrecognized qualifier `data'
x86_64-pld-linux-gcc -O4 -ffast-math  -Wall -I. -DHAVE_MMX -DHAVE_MMXEXT -DHAVE_SSE -DHAVE_SSE2 -O2 -fwrapv -pipe -Wformat -Werror=format-security -gdwarf-4 -fno-debug-types-section -fvar-tracking-assignments -g2 -Wp,-D_FORTIFY_SOURCE=2 -fstack-protector-strong --param=ssp-buffer-size=4 -fPIC -march=x86-64 -gdwarf-4 -fno-debug-types-section -fvar-tracking-assignments -g2   -fno-strict-aliasing -DHAVE_MALLOC_H -std=gnu99 -DHAVE_PTHREAD -fPIC -s -fomit-frame-pointer   -c -o common/i386/predict-c.o common/i386/predict-c.c
common/i386/predict-c.c:34:1: warning: parameter names (without types) in function declaration
 extern void predict_8x8c_p_core_mmxext( src, i00, b, c );
 ^~~~~~
yasm -f elf -m amd64 -DPIC -DARCH_X86_64 -Icommon/i386/ -o common/i386/pixel-a.o common/i386/pixel-a.asm
yasm -f elf -m amd64 -DPIC -DARCH_X86_64 -Icommon/i386/ -o common/i386/pixel-sse2.o common/i386/pixel-sse2.asm
common/i386/pixel-sse2.asm:31: warning: Unrecognized qualifier `data'
yasm -f elf -m amd64 -DPIC -DARCH_X86_64 -Icommon/i386/ -o common/i386/qpel.o common/i386/qpel.asm
common/i386/qpel.asm:13: warning: Unrecognized qualifier `data'
yasm -f elf -m amd64 -DPIC -DARCH_X86_64 -Icommon/i386/ -o common/i386/predict-a.o common/i386/predict-a.asm
common/i386/predict-a.asm:15: warning: Unrecognized qualifier `data'
yasm -f elf -m amd64 -DPIC -DARCH_X86_64 -Icommon/i386/ -o common/i386/quant_sse2.o common/i386/quant_sse2.asm
common/i386/quant_sse2.asm:28: warning: Unrecognized qualifier `data'
x86_64-pld-linux-gcc -O4 -ffast-math  -Wall -I. -DHAVE_MMX -DHAVE_MMXEXT -DHAVE_SSE -DHAVE_SSE2 -O2 -fwrapv -pipe -Wformat -Werror=format-security -gdwarf-4 -fno-debug-types-section -fvar-tracking-assignments -g2 -Wp,-D_FORTIFY_SOURCE=2 -fstack-protector-strong --param=ssp-buffer-size=4 -fPIC -march=x86-64 -gdwarf-4 -fno-debug-types-section -fvar-tracking-assignments -g2   -fno-strict-aliasing -DHAVE_MALLOC_H -std=gnu99 -DHAVE_PTHREAD -fPIC -s -fomit-frame-pointer   -c -o common/i386/mc-c.o common/i386/mc-c.c
common/i386/mc-c.c: In function 'pixel_avg':
common/i386/mc-c.c:117:12: warning: unused variable 'y' [-Wunused-variable]
     int x, y;
            ^
common/i386/mc-c.c:117:9: warning: unused variable 'x' [-Wunused-variable]
     int x, y;
         ^
common/i386/mc-c.c: In function 'mc_luma_mmx':
common/i386/mc-c.c:239:15: warning: unused variable 'src2' [-Wunused-variable]
      uint8_t *src2 = src[hpel_ref1[qpel_idx]] + offset;
               ^~~~
common/i386/mc-c.c:238:21: warning: unused variable 'src1' [-Wunused-variable]
            uint8_t *src1 = src[hpel_ref0[qpel_idx]] + offset +  i_src_stride+ 1;
                     ^~~~
common/i386/mc-c.c: In function 'get_ref_mmx':
common/i386/mc-c.c:279:18: warning: unused variable 'src2' [-Wunused-variable]
         uint8_t *src2 = src[hpel_ref1[qpel_idx]] + offset;
                  ^~~~
common/i386/mc-c.c:278:12: warning: unused variable 'src1' [-Wunused-variable]
   uint8_t *src1 = src[hpel_ref0[qpel_idx]] + offset +  i_src_stride+ 1;
            ^~~~
x86_64-pld-linux-gcc -O4 -ffast-math  -Wall -I. -DHAVE_MMX -DHAVE_MMXEXT -DHAVE_SSE -DHAVE_SSE2 -O2 -fwrapv -pipe -Wformat -Werror=format-security -gdwarf-4 -fno-debug-types-section -fvar-tracking-assignments -g2 -Wp,-D_FORTIFY_SOURCE=2 -fstack-protector-strong --param=ssp-buffer-size=4 -fPIC -march=x86-64 -gdwarf-4 -fno-debug-types-section -fvar-tracking-assignments -g2   -fno-strict-aliasing -DHAVE_MALLOC_H -std=gnu99 -DHAVE_PTHREAD -fPIC -s -fomit-frame-pointer   -c -o matroska.o matroska.c
x86_64-pld-linux-gcc -O4 -ffast-math  -Wall -I. -DHAVE_MMX -DHAVE_MMXEXT -DHAVE_SSE -DHAVE_SSE2 -O2 -fwrapv -pipe -Wformat -Werror=format-security -gdwarf-4 -fno-debug-types-section -fvar-tracking-assignments -g2 -Wp,-D_FORTIFY_SOURCE=2 -fstack-protector-strong --param=ssp-buffer-size=4 -fPIC -march=x86-64 -gdwarf-4 -fno-debug-types-section -fvar-tracking-assignments -g2   -fno-strict-aliasing -DHAVE_MALLOC_H -std=gnu99 -DHAVE_PTHREAD -fPIC -s -fomit-frame-pointer   -c -o muxers.o muxers.c
muxers.c: In function 'open_file_y4m':
muxers.c:134:7: warning: variable 'interlaced' set but not used [-Wunused-but-set-variable]
   int interlaced;
       ^~~~~~~~~~
x86_64-pld-linux-gcc -O4 -ffast-math  -Wall -I. -DHAVE_MMX -DHAVE_MMXEXT -DHAVE_SSE -DHAVE_SSE2 -O2 -fwrapv -pipe -Wformat -Werror=format-security -gdwarf-4 -fno-debug-types-section -fvar-tracking-assignments -g2 -Wp,-D_FORTIFY_SOURCE=2 -fstack-protector-strong --param=ssp-buffer-size=4 -fPIC -march=x86-64 -gdwarf-4 -fno-debug-types-section -fvar-tracking-assignments -g2   -fno-strict-aliasing -DHAVE_MALLOC_H -std=gnu99 -DHAVE_PTHREAD -fPIC -s -fomit-frame-pointer   -c -o encoder/analyse.o encoder/analyse.c
In file included from encoder/rdo.c:42:0,
                 from encoder/analyse.c:43:
encoder/cavlc.c: In function 'xavs_macroblock_size_cavlc':
encoder/cavlc.c:754:9: warning: variable 'b_sub_ref0' set but not used [-Wunused-but-set-variable]
     int b_sub_ref0;
         ^~~~~~~~~~
encoder/analyse.c: In function 'xavs_intra_rd_refine':
encoder/analyse.c:547:16: warning: variable 'p_src_by' set but not used [-Wunused-but-set-variable]
       uint8_t *p_src_by;
                ^~~~~~~~
encoder/analyse.c:494:7: warning: variable 'i_pred_mode' set but not used [-Wunused-but-set-variable]
   int i_pred_mode, i_mode;
       ^~~~~~~~~~~
In file included from encoder/analyse.c:2472:0:
encoder/slicetype.c: In function 'xavs_slicetype_decide':
encoder/slicetype.c:374:7: warning: variable 'i_coded' set but not used [-Wunused-but-set-variable]
   int i_coded;
       ^~~~~~~
ar rc libxavs.a common/mc.o common/predict.o common/pixel.o common/macroblock.o common/frame.o common/dct.o common/cpu.o common/common.o common/mdate.o common/csp.o common/set.o common/quant.o encoder/analyse.o encoder/me.o encoder/ratecontrol.o encoder/set.o encoder/macroblock.o encoder/cavlc.o encoder/encoder.o encoder/eval.o encoder/lookahead.o common/i386/dct-c.o common/i386/mc-c.o common/i386/predict-c.o common/i386/cpu-a.o common/i386/dct-sse2.o common/i386/deblock.o common/i386/deblock_intra.o common/i386/mc-a01.o common/i386/mc-a.o common/i386/pixel-a.o common/i386/pixel-sse2.o common/i386/predict-a.o common/i386/qpel.o common/i386/quant_sse2.o
ranlib libxavs.a
x86_64-pld-linux-gcc -shared -o libxavs.so.1 common/mc.o common/predict.o common/pixel.o common/macroblock.o common/frame.o common/dct.o common/cpu.o common/common.o common/mdate.o common/csp.o common/set.o common/quant.o encoder/analyse.o encoder/me.o encoder/ratecontrol.o encoder/set.o encoder/macroblock.o encoder/cavlc.o encoder/encoder.o encoder/eval.o encoder/lookahead.o common/i386/dct-c.o common/i386/mc-c.o common/i386/predict-c.o common/i386/cpu-a.o common/i386/dct-sse2.o common/i386/deblock.o common/i386/deblock_intra.o common/i386/mc-a01.o common/i386/mc-a.o common/i386/pixel-a.o common/i386/pixel-sse2.o common/i386/predict-a.o common/i386/qpel.o common/i386/quant_sse2.o -Wl,-soname,-Wl,-soname,libxavs.so.1 -Wl,--as-needed -Wl,--no-copy-dt-needed-entries -Wl,-z,relro -Wl,-z,combreloc  -lm -lpthread -Wl,-Bsymbolic -s
/usr/bin/ld: common/i386/deblock.o: relocation R_X86_64_32 against `.rodata' can not be used when making a shared object; recompile with -fPIC
/usr/bin/ld: common/i386/deblock_intra.o: relocation R_X86_64_32 against `.rodata' can not be used when making a shared object; recompile with -fPIC
/usr/bin/ld: common/i386/mc-a01.o: relocation R_X86_64_32 against `.rodata' can not be used when making a shared object; recompile with -fPIC
/usr/bin/ld: common/i386/mc-a.o: relocation R_X86_64_32 against `.rodata' can not be used when making a shared object; recompile with -fPIC
/usr/bin/ld: common/i386/pixel-sse2.o: relocation R_X86_64_32 against `.rodata' can not be used when making a shared object; recompile with -fPIC
/usr/bin/ld: common/i386/predict-a.o: relocation R_X86_64_32 against `.rodata' can not be used when making a shared object; recompile with -fPIC
/usr/bin/ld: common/i386/qpel.o: relocation R_X86_64_32 against `.rodata' can not be used when making a shared object; recompile with -fPIC
/usr/bin/ld: common/i386/quant_sse2.o: relocation R_X86_64_32 against `.rodata' can not be used when making a shared object; recompile with -fPIC
/usr/bin/ld: final link failed: Nonrepresentable section on output
collect2: error: ld returned 1 exit status
make: *** [Makefile:69: libxavs.so.1] Error 1
make: *** Waiting for unfinished jobs....
x86_64-pld-linux-gcc -O4 -ffast-math  -Wall -I. -DHAVE_MMX -DHAVE_MMXEXT -DHAVE_SSE -DHAVE_SSE2 -O2 -fwrapv -pipe -Wformat -Werror=format-security -gdwarf-4 -fno-debug-types-section -fvar-tracking-assignments -g2 -Wp,-D_FORTIFY_SOURCE=2 -fstack-protector-strong --param=ssp-buffer-size=4 -fPIC -march=x86-64 -gdwarf-4 -fno-debug-types-section -fvar-tracking-assignments -g2   -fno-strict-aliasing -DHAVE_MALLOC_H -std=gnu99 -DHAVE_PTHREAD -fPIC -s -fomit-frame-pointer   -c -o xavs.o xavs.c
xavs.c: In function 'Parse':
xavs.c:848:7: warning: variable 'b_user_ref' set but not used [-Wunused-but-set-variable]
   int b_user_ref = 0;
       ^~~~~~~~~~
error: Bad exit status from /tmp/B.NImvEC/BUILD/tmp/rpm-tmp.44502 (%build)


RPM build errors:
    Bad exit status from /tmp/B.NImvEC/BUILD/tmp/rpm-tmp.44502 (%build)
ended at: Thu Jul 20 20:24:55 2017, done in 0:00:06.286700
error: No files produced.
mesg: ttyname failed: Inappropriate ioctl for device
+ chmod -R u+rwX /tmp/B.NImvEC/BUILD
+ rm -rf /tmp/B.NImvEC/tmp /tmp/B.NImvEC/BUILD
mesg: ttyname failed: Inappropriate ioctl for device
+ rm -rf /tmp/B.NImvEC
Begin-PLD-Builder-Info
Build-Time: user:17.45s sys:0.90s real:9.08s (faults io:0 non-io:374255)

End-PLD-Builder-Info
[Back to list of logs] [View rpm -qa of builder]