FailedOk

th/SRPMS[OK]
th/x32[OK]
th/i686[OK]
th/x86_64[OK]

ac/SRPMS[OK]
ac/i386[OK]
ac/i586[OK]
ac/i686[OK]
ac/alpha[OK]
ac/amd64[OK]
ac/athlon[OK]
ac/ppc[OK]
ac/sparc[OK]
ac/sparc64[OK]

Advanced Search
main()
Powered by PLD Linux
(c) 2002-2017 PLD Team
$Revision: 1.37 $
Powered by ITS.
Your IP: 54.221.73.186

xorg-driver-video-nvidia c7ce3338-7bc5-4b75-913e-08a9e8c13bc0

Status:Failed
Source URL:ftp://buildlogs.pld-linux.org/th/x86_64/FAIL/xorg-driver-video-nvidia,c7ce3338-7bc5-4b75-913e-08a9e8c13bc0.bz2
text/plain URL:View!
rpm -qa of builder:View!
Date:2017/07/26 15:57:44
Runtime:0:00:17.313573

Toc:

  • prep
  • Executing(%prep): /bin/sh -e /tmp/B.miPlDw/BUILD/tmp/rpm-tmp.1741
  • build
  • Executing(%build): /bin/sh -e /tmp/B.miPlDw/BUILD/tmp/rpm-tmp.29203
  • error 1
  • echo >&2 " ERROR: Kernel configuration is invalid."; \
  • error 2
  • cc1: error: incompatible gcc/plugin versions
  • error 3
  • cc1: error: fail to initialize plugin ./scripts/gcc-plugins/structleak_plugin.so
  • error 4
  • cc1: error: incompatible gcc/plugin versions
  • error 5
  • cc1: error: fail to initialize plugin ./scripts/gcc-plugins/structleak_plugin.so
  • error 6
  • cc1: error: incompatible gcc/plugin versions
  • error 7
  • cc1: error: fail to initialize plugin ./scripts/gcc-plugins/structleak_plugin.so
  • error 8
  • cc1: error: incompatible gcc/plugin versions
  • error 9
  • cc1: error: fail to initialize plugin ./scripts/gcc-plugins/structleak_plugin.so
  • error 10
  • cc1: error: incompatible gcc/plugin versions
  • error 11
  • cc1: error: fail to initialize plugin ./scripts/gcc-plugins/structleak_plugin.so
  • error 12
  • error: Bad exit status from /tmp/B.miPlDw/BUILD/tmp/rpm-tmp.29203 (%build)
  • error 13
  • RPM build errors:
  • error 14
  • error: No files produced.

Content:

request from: atler
checking if we should skip the build
started at: Wed Jul 26 15:57:17 2017
fetching https://srcbuilder.pld-linux.org/th//srpms/c7ce3338-7bc5-4b75-913e-08a9e8c13bc0/xorg-driver-video-nvidia-kernel-384.59-1%404.11.11_1.src.rpm
fetched 93820014 bytes, 24353.8 K/s
installing srpm: xorg-driver-video-nvidia-kernel-384.59-1@4.11.11_1.src.rpm
mesg: ttyname failed: Inappropriate ioctl for device
+ install -d /tmp/B.miPlDw/BUILD /tmp/B.miPlDw/RPMS
+ LC_ALL=en_US.UTF-8
+ rpm -qp --changelog xorg-driver-video-nvidia-kernel-384.59-1@4.11.11_1.src.rpm
* Wed Jul 26 2017 PLD Linux Team <feedback@pld-linux.org>
- For complete changelog see: http://git.pld-linux.org/?p=packages/xorg-driver-video-nvidia.git;a=log;h=master
* Mon Jul 24 2017 Jan Palus <atler@pld-linux.org> 8d5d479
- up to 384.59 * Sun Jul 02 2017 Jan Palus <atler@pld-linux.org> 75de51d
- new bcond "system_libglvnd" (enabled by default) * Fri Jun 30 2017 Jan Palus <atler@pld-linux.org> 8d2b2a1
- select proper vulkan lib based on glvnd bcond * Fri Jun 30 2017 Jan Palus <atler@pld-linux.org> 538b2e0
- new bcond "glvnd" (disabled by default) * Sun May 14 2017 Jan Palus <atler@pld-linux.org> bb6d5ff
- updated vulkan api version * Wed May 10 2017 Jan Rękorajski <baggins@pld-linux.org> a31ddb6
- up to 381.22 * Sun Mar 26 2017 Jan Rękorajski <baggins@pld-linux.org> 1f8e26e
- rel 2 * Tue Feb 28 2017 Jan Palus <atler@pld-linux.org> a366fdb
- patch for kernel 4.10 * Wed Feb 15 2017 Jan Palus <atler@pld-linux.org> 2a07ccd
- up to 378.13 * Wed Jan 18 2017 Jan Palus <atler@pld-linux.org> 6c7b79f
- package vulkan icd; rel 2 * Thu Dec 15 2016 Jan Palus <atler@pld-linux.org> e2d14cb
- up to 375.26 * Sun Dec 11 2016 Elan Ruusamäe <glen@delfi.ee> fd356b8
- noarch -doc * Sun Dec 04 2016 Jan Rękorajski <baggins@pld-linux.org> 4ab31d9
- rel 2 - fix building on older kernels * Fri Nov 18 2016 Jan Palus <atler@pld-linux.org> d3f173f
- up to 375.20 (adds support for abi 23) * Thu Sep 08 2016 Jan Palus <atler@pld-linux.org> 0c455ac
- up to 370.28 * Tue Aug 23 2016 Jan Palus <atler@pld-linux.org> ef40d8b
- up to 367.44 * Tue Aug 02 2016 Jan Palus <atler@pld-linux.org> da1282c
- split kernel 4.7 compatibility patch into non-uvm and uvm parts * Tue Aug 02 2016 Jan Palus <atler@pld-linux.org> f6380d2
- kernel 4.7 compatibility patch + rpm -Uhv --nodeps --define '_topdir /tmp/B.miPlDw' --define '_specdir %{_topdir}' --define '_sourcedir %{_specdir}' --define '_rpmdir %{_topdir}/RPMS' --define '_builddir %{_topdir}/BUILD' --without userspace --define 'build_kernels head,4.9,4.4,4.1' xorg-driver-video-nvidia-kernel-384.59-1@4.11.11_1.src.rpm Preparing... ################################################## xorg-driver-video-nvidia-ker################################################## + rm -f xorg-driver-video-nvidia-kernel-384.59-1@4.11.11_1.src.rpm mesg: ttyname failed: Inappropriate ioctl for device + install -m 700 -d /tmp/B.miPlDw/BUILD/tmp mesg: ttyname failed: Inappropriate ioctl for device + TMPDIR=/tmp/B.miPlDw/BUILD/tmp + exec nice -n 0 rpmbuild -bp --short-circuit --nodeps --define '_topdir /tmp/B.miPlDw' --define '_specdir %{_topdir}' --define '_sourcedir %{_specdir}' --define '_rpmdir %{_topdir}/RPMS' --define '_builddir %{_topdir}/BUILD' --without userspace --target x86_64-pld-linux --define 'build_kernels head,4.9,4.4,4.1' --define 'prep exit 0' /tmp/B.miPlDw/xorg-driver-video-nvidia.spec Building target platforms: x86_64-pld-linux checking BuildConflict-ing packages no BuildConflicts found checking BR rpm: Building target platforms: x86_64-pld-linux no BR needed building RPM using: set -ex; : build-id: c7ce3338-7bc5-4b75-913e-08a9e8c13bc0; TMPDIR=/tmp/B.miPlDw/BUILD/tmp exec nice -n 0 rpmbuild -bb --define '_smp_mflags -j5' --define '_make_opts -Otarget' --define '_pld_builder 1' --define '_topdir /tmp/B.miPlDw' --define '_specdir %{_topdir}' --define '_sourcedir %{_specdir}' --define '_rpmdir %{_topdir}/RPMS' --define '_builddir %{_topdir}/BUILD' --without userspace --target x86_64-pld-linux --define 'build_kernels head,4.9,4.4,4.1' /tmp/B.miPlDw/xorg-driver-video-nvidia.spec mesg: ttyname failed: Inappropriate ioctl for device + : build-id: c7ce3338-7bc5-4b75-913e-08a9e8c13bc0 + TMPDIR=/tmp/B.miPlDw/BUILD/tmp + exec nice -n 0 rpmbuild -bb --define '_smp_mflags -j5' --define '_make_opts -Otarget' --define '_pld_builder 1' --define '_topdir /tmp/B.miPlDw' --define '_specdir %{_topdir}' --define '_sourcedir %{_specdir}' --define '_rpmdir %{_topdir}/RPMS' --define '_builddir %{_topdir}/BUILD' --without userspace --target x86_64-pld-linux --define 'build_kernels head,4.9,4.4,4.1' /tmp/B.miPlDw/xorg-driver-video-nvidia.spec Building target platforms: x86_64-pld-linux Executing(%prep): /bin/sh -e /tmp/B.miPlDw/BUILD/tmp/rpm-tmp.1741 + umask 022 + cd /tmp/B.miPlDw/BUILD + cd /tmp/B.miPlDw/BUILD + rm -rf 'NVIDIA-Linux-x86*-384.59*' + /bin/sh /tmp/B.miPlDw/NVIDIA-Linux-x86_64-384.59-no-compat32.run --extract-only Creating directory NVIDIA-Linux-x86_64-384.59-no-compat32 Verifying archive integrity... OK Uncompressing NVIDIA Accelerated Graphics Driver for Linux-x86_64 384.59................................................................................................................................................................................................................................................................................................................................................................................................................................................................ + cd /tmp/B.miPlDw/BUILD + cd NVIDIA-Linux-x86_64-384.59-no-compat32 + /bin/id -u + '[' 1000 '=' 0 ']' + /bin/id -u + '[' 1000 '=' 0 ']' + /bin/chmod -Rf a+rX,u+w,g-w,o-w . + echo 'Patch #0 (X11-driver-nvidia-GL.patch):' Patch #0 (X11-driver-nvidia-GL.patch): + '[' -f /tmp/B.miPlDw/X11-driver-nvidia-GL.patch ']' + /bin/cat /tmp/B.miPlDw/X11-driver-nvidia-GL.patch + /usr/bin/patch -s -p1 + echo 'Patch #1 (X11-driver-nvidia-desktop.patch):' Patch #1 (X11-driver-nvidia-desktop.patch): + '[' -f /tmp/B.miPlDw/X11-driver-nvidia-desktop.patch ']' + /bin/cat /tmp/B.miPlDw/X11-driver-nvidia-desktop.patch + /usr/bin/patch -s -p1 + echo 'Patch #2 (linux-4.1-and-older.patch):' Patch #2 (linux-4.1-and-older.patch): + '[' -f /tmp/B.miPlDw/linux-4.1-and-older.patch ']' + /bin/cat /tmp/B.miPlDw/linux-4.1-and-older.patch + /usr/bin/patch -s -p1 + >>kernel/Makefile.kbuild + echo 'EXTRA_CFLAGS += -Wno-pointer-arith -Wno-sign-compare -Wno-unused' + exit 0 Executing(%build): /bin/sh -e /tmp/B.miPlDw/BUILD/tmp/rpm-tmp.29203 TMP=/home/users/builder/tmp HOME=/home/users/builder PATH=/home/users/builder/GNUstep/Tools:/usr/local/bin:/usr/bin:/bin:/home/users/builder/bin TMPDIR=/tmp/B.miPlDw/BUILD/tmp + umask 022 + cd /tmp/B.miPlDw/BUILD + cd NVIDIA-Linux-x86_64-384.59-no-compat32 + cd kernel + /usr/bin/make -Otarget -j5 'SYSSRC=/usr/src/linux' clean rm -f -r conftest /usr/bin/make "CC=cc" KBUILD_VERBOSE= -C /usr/src/linux M=/tmp/B.miPlDw/BUILD/NVIDIA-Linux-x86_64-384.59-no-compat32/kernel ARCH=x86_64 NV_KERNEL_SOURCES=/usr/src/linux NV_KERNEL_OUTPUT=/usr/src/linux NV_KERNEL_MODULES="nvidia nvidia-uvm nvidia-modeset nvidia-drm" INSTALL_MOD_DIR=kernel/drivers/video clean + /usr/bin/make -Otarget -j5 'SYSSRC=/usr/src/linux' 'IGNORE_CC_MISMATCH=1' 'NV_VERBOSE=1' 'CC=x86_64-pld-linux-gcc' module /usr/bin/make "CC=x86_64-pld-linux-gcc" KBUILD_VERBOSE=1 -C /usr/src/linux M=/tmp/B.miPlDw/BUILD/NVIDIA-Linux-x86_64-384.59-no-compat32/kernel ARCH=x86_64 NV_KERNEL_SOURCES=/usr/src/linux NV_KERNEL_OUTPUT=/usr/src/linux NV_KERNEL_MODULES="nvidia nvidia-uvm nvidia-modeset nvidia-drm" INSTALL_MOD_DIR=kernel/drivers/video Q= modules make[1]: Entering directory '/usr/src/linux-4.11.11' test -e include/generated/autoconf.h -a -e include/config/auto.conf || ( \ echo >&2; \ echo >&2 " ERROR: Kernel configuration is invalid."; \ echo >&2 " include/generated/autoconf.h or include/config/auto.conf are missing.";\ echo >&2 " Run 'make oldconfig && make prepare' on kernel src to fix it."; \ echo >&2 ; \ /bin/false) make[1]: Leaving directory '/usr/src/linux-4.11.11' make[1]: Entering directory '/usr/src/linux-4.11.11' mkdir -p /tmp/B.miPlDw/BUILD/NVIDIA-Linux-x86_64-384.59-no-compat32/kernel/.tmp_versions ; rm -f /tmp/B.miPlDw/BUILD/NVIDIA-Linux-x86_64-384.59-no-compat32/kernel/.tmp_versions/* make[1]: Leaving directory '/usr/src/linux-4.11.11' /usr/bin/make -f ./scripts/Makefile.build obj=/tmp/B.miPlDw/BUILD/NVIDIA-Linux-x86_64-384.59-no-compat32/kernel ln -sf /tmp/B.miPlDw/BUILD/NVIDIA-Linux-x86_64-384.59-no-compat32/kernel/nvidia/nv-kernel.o_binary /tmp/B.miPlDw/BUILD/NVIDIA-Linux-x86_64-384.59-no-compat32/kernel/nvidia/nv-kernel.o ln -sf /tmp/B.miPlDw/BUILD/NVIDIA-Linux-x86_64-384.59-no-compat32/kernel/nvidia-modeset/nv-modeset-kernel.o_binary /tmp/B.miPlDw/BUILD/NVIDIA-Linux-x86_64-384.59-no-compat32/kernel/nvidia-modeset/nv-modeset-kernel.o (cat /dev/null; echo kernel//tmp/B.miPlDw/BUILD/NVIDIA-Linux-x86_64-384.59-no-compat32/kernel/nvidia.ko; echo kernel//tmp/B.miPlDw/BUILD/NVIDIA-Linux-x86_64-384.59-no-compat32/kernel/nvidia-uvm.ko; echo kernel//tmp/B.miPlDw/BUILD/NVIDIA-Linux-x86_64-384.59-no-compat32/kernel/nvidia-modeset.ko; echo kernel//tmp/B.miPlDw/BUILD/NVIDIA-Linux-x86_64-384.59-no-compat32/kernel/nvidia-drm.ko;) > /tmp/B.miPlDw/BUILD/NVIDIA-Linux-x86_64-384.59-no-compat32/kernel/modules.order CONFTEST: vmap CONFTEST: hash__remap_4k_pfn CONFTEST: INIT_WORK CONFTEST: remap_pfn_range CONFTEST: set_memory_array_uc CONFTEST: set_memory_uc CONFTEST: set_pages_uc CONFTEST: follow_pfn CONFTEST: vm_insert_page CONFTEST: acquire_console_sem CONFTEST: console_lock CONFTEST: change_page_attr CONFTEST: kmem_cache_create CONFTEST: acpi_device_id CONFTEST: pci_choose_state CONFTEST: pci_get_class CONFTEST: ioremap_wc CONFTEST: ioremap_cache CONFTEST: on_each_cpu CONFTEST: acpi_evaluate_integer CONFTEST: smp_call_function CONFTEST: sg_init_table CONFTEST: pci_domain_nr CONFTEST: pci_dma_mapping_error CONFTEST: get_num_physpages CONFTEST: acpi_walk_namespace CONFTEST: pci_get_domain_bus_and_slot CONFTEST: proc_create_data CONFTEST: sg_alloc_table CONFTEST: proc_remove CONFTEST: xen_ioemu_inject_msi CONFTEST: pde_data CONFTEST: pm_vt_switch_required CONFTEST: write_cr4 CONFTEST: get_dma_ops CONFTEST: phys_to_dma CONFTEST: of_node_to_nid CONFTEST: of_get_property CONFTEST: of_find_node_by_phandle CONFTEST: pnv_pci_get_npu_dev CONFTEST: for_each_online_node CONFTEST: node_end_pfn CONFTEST: pci_bus_address CONFTEST: request_threaded_irq CONFTEST: pci_stop_and_remove_bus_device CONFTEST: remap_page_range CONFTEST: pci_remove_bus_device CONFTEST: kbasename CONFTEST: address_space_init_once CONFTEST: cpuhp_setup_state CONFTEST: register_cpu_notifier CONFTEST: list_cut_position CONFTEST: bitmap_clear CONFTEST: wait_on_bit_lock_argument_count CONFTEST: vzalloc CONFTEST: radix_tree_empty CONFTEST: usleep_range CONFTEST: fatal_signal_pending CONFTEST: efi_enabled CONFTEST: get_user_pages_remote CONFTEST: drm_atomic_clean_old_fb CONFTEST: drm_atomic_set_mode_for_crtc CONFTEST: drm_reinit_primary_mode_group CONFTEST: drm_dev_unref CONFTEST: drm_atomic_state_free CONFTEST: i2c_adapter CONFTEST: drm_driver_has_gem_prime_res_obj CONFTEST: drm_gem_object_lookup CONFTEST: is_export_symbol_gpl_of_node_to_nid CONFTEST: pm_message_t CONFTEST: outer_flush_all CONFTEST: acpi_device_ops CONFTEST: irq_handler_t CONFTEST: acpi_op_remove CONFTEST: proc_dir_entry CONFTEST: scatterlist CONFTEST: atomic_long_type CONFTEST: sg_table CONFTEST: pci_save_state CONFTEST: task_struct CONFTEST: file_inode CONFTEST: vm_operations_struct CONFTEST: kuid_t CONFTEST: dma_map_ops CONFTEST: dma_ops CONFTEST: file_operations CONFTEST: noncoherent_swiotlb_dma_ops CONFTEST: vm_fault_present CONFTEST: atomic64_type CONFTEST: fault_flags CONFTEST: vm_fault_has_address CONFTEST: strnstr CONFTEST: address_space CONFTEST: backing_dev_info CONFTEST: kernel_write CONFTEST: kstrtoull CONFTEST: pnv_npu2_init_context CONFTEST: iterate_dir CONFTEST: mm_context_t CONFTEST: vm_ops_fault_removed_vma_arg CONFTEST: drm_bus_has_bus_type CONFTEST: drm_bus_present CONFTEST: drm_bus_has_get_irq CONFTEST: drm_bus_has_get_name CONFTEST: drm_driver_has_legacy_dev_list CONFTEST: drm_crtc_state_has_connectors_changed CONFTEST: drm_driver_has_set_busid CONFTEST: drm_init_functions_have_name_arg CONFTEST: drm_mode_config_funcs_has_atomic_state_alloc CONFTEST: drm_mode_connector_list_update_has_merge_type_bits_arg CONFTEST: dom0_kernel_present CONFTEST: nvidia_vgpu_kvm_build CONFTEST: nvidia_grid_build CONFTEST: drm_master_drop_has_from_release_arg CONFTEST: drm_driver_unload_has_int_return_type CONFTEST: drm_atomic_modeset_nonblocking_commit_available CONFTEST: is_export_symbol_gpl_refcount_inc CONFTEST: is_export_symbol_gpl_refcount_dec_and_test CONFTEST: drm_helper_mode_fill_fb_struct CONFTEST: drm_available CONFTEST: drm_atomic_available x86_64-pld-linux-gcc -Wp,-MD,/tmp/B.miPlDw/BUILD/NVIDIA-Linux-x86_64-384.59-no-compat32/kernel/nvidia/.nv-acpi.o.d -nostdinc -isystem /usr/lib64/gcc/x86_64-pld-linux/6.4.0/include -I./arch/x86/include -I./arch/x86/include/generated/uapi -I./arch/x86/include/generated -I./include -I./arch/x86/include/uapi -I./include/uapi -I./include/generated/uapi -include ./include/linux/kconfig.h -D__KERNEL__ -Wall -Wundef -Wstrict-prototypes -Wno-trigraphs -fno-strict-aliasing -fno-common -Werror-implicit-function-declaration -Wno-format-security -std=gnu89 -fno-PIE -mno-sse -mno-mmx -mno-sse2 -mno-3dnow -mno-avx -m64 -falign-jumps=1 -falign-loops=1 -mno-80387 -mno-fp-ret-in-387 -mpreferred-stack-boundary=3 -mskip-rax-setup -mtune=generic -mno-red-zone -mcmodel=kernel -funit-at-a-time -DCONFIG_X86_X32_ABI -DCONFIG_AS_CFI=1 -DCONFIG_AS_CFI_SIGNAL_FRAME=1 -DCONFIG_AS_CFI_SECTIONS=1 -DCONFIG_AS_FXSAVEQ=1 -DCONFIG_AS_SSSE3=1 -DCONFIG_AS_CRC32=1 -DCONFIG_AS_AVX=1 -DCONFIG_AS_AVX2=1 -DCONFIG_AS_AVX512=1 -DCONFIG_AS_SHA1_NI=1 -DCONFIG_AS_SHA256_NI=1 -pipe -Wno-sign-compare -fno-asynchronous-unwind-tables -fno-delete-null-pointer-checks -Wno-frame-address -O2 --param=allow-store-data-races=0 -DCC_HAVE_ASM_GOTO -fplugin=./scripts/gcc-plugins/structleak_plugin.so -DSTRUCTLEAK_PLUGIN -Wframe-larger-than=2048 -fstack-protector-strong -Wno-unused-but-set-variable -Wno-unused-const-variable -fno-omit-frame-pointer -fno-optimize-sibling-calls -fno-var-tracking-assignments -gsplit-dwarf -gdwarf-4 -pg -mfentry -DCC_USING_FENTRY -Wdeclaration-after-statement -Wno-pointer-sign -fno-strict-overflow -fconserve-stack -Werror=implicit-int -Werror=strict-prototypes -Werror=date-time -Werror=incompatible-pointer-types -I/tmp/B.miPlDw/BUILD/NVIDIA-Linux-x86_64-384.59-no-compat32/kernel/common/inc -I/tmp/B.miPlDw/BUILD/NVIDIA-Linux-x86_64-384.59-no-compat32/kernel -Wall -MD -Wsign-compare -Wno-cast-qual -Wno-error -D__KERNEL__ -DMODULE -DNVRM -DNV_VERSION_STRING=\"384.59\" -Wno-unused-function -Wuninitialized -fno-strict-aliasing -mno-red-zone -mcmodel=kernel -DNV_UVM_ENABLE -Wno-sign-compare -Wno-format-extra-args -Werror=undef -I/tmp/B.miPlDw/BUILD/NVIDIA-Linux-x86_64-384.59-no-compat32/kernel/nvidia -DNV_BUILD_MODULE_INSTANCES=0 -UDEBUG -U_DEBUG -DNDEBUG -DMODULE -DKBUILD_BASENAME='"nv_acpi"' -DKBUILD_MODNAME='"nvidia"' -c -o /tmp/B.miPlDw/BUILD/NVIDIA-Linux-x86_64-384.59-no-compat32/kernel/nvidia/nv-acpi.o /tmp/B.miPlDw/BUILD/NVIDIA-Linux-x86_64-384.59-no-compat32/kernel/nvidia/nv-acpi.c cc1: error: incompatible gcc/plugin versions cc1: error: fail to initialize plugin ./scripts/gcc-plugins/structleak_plugin.so make[2]: *** [scripts/Makefile.build:294: /tmp/B.miPlDw/BUILD/NVIDIA-Linux-x86_64-384.59-no-compat32/kernel/nvidia/nv-acpi.o] Error 1 make[2]: *** Waiting for unfinished jobs.... x86_64-pld-linux-gcc -Wp,-MD,/tmp/B.miPlDw/BUILD/NVIDIA-Linux-x86_64-384.59-no-compat32/kernel/nvidia/.nv-instance.o.d -nostdinc -isystem /usr/lib64/gcc/x86_64-pld-linux/6.4.0/include -I./arch/x86/include -I./arch/x86/include/generated/uapi -I./arch/x86/include/generated -I./include -I./arch/x86/include/uapi -I./include/uapi -I./include/generated/uapi -include ./include/linux/kconfig.h -D__KERNEL__ -Wall -Wundef -Wstrict-prototypes -Wno-trigraphs -fno-strict-aliasing -fno-common -Werror-implicit-function-declaration -Wno-format-security -std=gnu89 -fno-PIE -mno-sse -mno-mmx -mno-sse2 -mno-3dnow -mno-avx -m64 -falign-jumps=1 -falign-loops=1 -mno-80387 -mno-fp-ret-in-387 -mpreferred-stack-boundary=3 -mskip-rax-setup -mtune=generic -mno-red-zone -mcmodel=kernel -funit-at-a-time -DCONFIG_X86_X32_ABI -DCONFIG_AS_CFI=1 -DCONFIG_AS_CFI_SIGNAL_FRAME=1 -DCONFIG_AS_CFI_SECTIONS=1 -DCONFIG_AS_FXSAVEQ=1 -DCONFIG_AS_SSSE3=1 -DCONFIG_AS_CRC32=1 -DCONFIG_AS_AVX=1 -DCONFIG_AS_AVX2=1 -DCONFIG_AS_AVX512=1 -DCONFIG_AS_SHA1_NI=1 -DCONFIG_AS_SHA256_NI=1 -pipe -Wno-sign-compare -fno-asynchronous-unwind-tables -fno-delete-null-pointer-checks -Wno-frame-address -O2 --param=allow-store-data-races=0 -DCC_HAVE_ASM_GOTO -fplugin=./scripts/gcc-plugins/structleak_plugin.so -DSTRUCTLEAK_PLUGIN -Wframe-larger-than=2048 -fstack-protector-strong -Wno-unused-but-set-variable -Wno-unused-const-variable -fno-omit-frame-pointer -fno-optimize-sibling-calls -fno-var-tracking-assignments -gsplit-dwarf -gdwarf-4 -pg -mfentry -DCC_USING_FENTRY -Wdeclaration-after-statement -Wno-pointer-sign -fno-strict-overflow -fconserve-stack -Werror=implicit-int -Werror=strict-prototypes -Werror=date-time -Werror=incompatible-pointer-types -I/tmp/B.miPlDw/BUILD/NVIDIA-Linux-x86_64-384.59-no-compat32/kernel/common/inc -I/tmp/B.miPlDw/BUILD/NVIDIA-Linux-x86_64-384.59-no-compat32/kernel -Wall -MD -Wsign-compare -Wno-cast-qual -Wno-error -D__KERNEL__ -DMODULE -DNVRM -DNV_VERSION_STRING=\"384.59\" -Wno-unused-function -Wuninitialized -fno-strict-aliasing -mno-red-zone -mcmodel=kernel -DNV_UVM_ENABLE -Wno-sign-compare -Wno-format-extra-args -Werror=undef -I/tmp/B.miPlDw/BUILD/NVIDIA-Linux-x86_64-384.59-no-compat32/kernel/nvidia -DNV_BUILD_MODULE_INSTANCES=0 -UDEBUG -U_DEBUG -DNDEBUG -DMODULE -DKBUILD_BASENAME='"nv_instance"' -DKBUILD_MODNAME='"nvidia"' -c -o /tmp/B.miPlDw/BUILD/NVIDIA-Linux-x86_64-384.59-no-compat32/kernel/nvidia/nv-instance.o /tmp/B.miPlDw/BUILD/NVIDIA-Linux-x86_64-384.59-no-compat32/kernel/nvidia/nv-instance.c cc1: error: incompatible gcc/plugin versions cc1: error: fail to initialize plugin ./scripts/gcc-plugins/structleak_plugin.so make[2]: *** [scripts/Makefile.build:294: /tmp/B.miPlDw/BUILD/NVIDIA-Linux-x86_64-384.59-no-compat32/kernel/nvidia/nv-instance.o] Error 1 x86_64-pld-linux-gcc -Wp,-MD,/tmp/B.miPlDw/BUILD/NVIDIA-Linux-x86_64-384.59-no-compat32/kernel/nvidia/.nv.o.d -nostdinc -isystem /usr/lib64/gcc/x86_64-pld-linux/6.4.0/include -I./arch/x86/include -I./arch/x86/include/generated/uapi -I./arch/x86/include/generated -I./include -I./arch/x86/include/uapi -I./include/uapi -I./include/generated/uapi -include ./include/linux/kconfig.h -D__KERNEL__ -Wall -Wundef -Wstrict-prototypes -Wno-trigraphs -fno-strict-aliasing -fno-common -Werror-implicit-function-declaration -Wno-format-security -std=gnu89 -fno-PIE -mno-sse -mno-mmx -mno-sse2 -mno-3dnow -mno-avx -m64 -falign-jumps=1 -falign-loops=1 -mno-80387 -mno-fp-ret-in-387 -mpreferred-stack-boundary=3 -mskip-rax-setup -mtune=generic -mno-red-zone -mcmodel=kernel -funit-at-a-time -DCONFIG_X86_X32_ABI -DCONFIG_AS_CFI=1 -DCONFIG_AS_CFI_SIGNAL_FRAME=1 -DCONFIG_AS_CFI_SECTIONS=1 -DCONFIG_AS_FXSAVEQ=1 -DCONFIG_AS_SSSE3=1 -DCONFIG_AS_CRC32=1 -DCONFIG_AS_AVX=1 -DCONFIG_AS_AVX2=1 -DCONFIG_AS_AVX512=1 -DCONFIG_AS_SHA1_NI=1 -DCONFIG_AS_SHA256_NI=1 -pipe -Wno-sign-compare -fno-asynchronous-unwind-tables -fno-delete-null-pointer-checks -Wno-frame-address -O2 --param=allow-store-data-races=0 -DCC_HAVE_ASM_GOTO -fplugin=./scripts/gcc-plugins/structleak_plugin.so -DSTRUCTLEAK_PLUGIN -Wframe-larger-than=2048 -fstack-protector-strong -Wno-unused-but-set-variable -Wno-unused-const-variable -fno-omit-frame-pointer -fno-optimize-sibling-calls -fno-var-tracking-assignments -gsplit-dwarf -gdwarf-4 -pg -mfentry -DCC_USING_FENTRY -Wdeclaration-after-statement -Wno-pointer-sign -fno-strict-overflow -fconserve-stack -Werror=implicit-int -Werror=strict-prototypes -Werror=date-time -Werror=incompatible-pointer-types -I/tmp/B.miPlDw/BUILD/NVIDIA-Linux-x86_64-384.59-no-compat32/kernel/common/inc -I/tmp/B.miPlDw/BUILD/NVIDIA-Linux-x86_64-384.59-no-compat32/kernel -Wall -MD -Wsign-compare -Wno-cast-qual -Wno-error -D__KERNEL__ -DMODULE -DNVRM -DNV_VERSION_STRING=\"384.59\" -Wno-unused-function -Wuninitialized -fno-strict-aliasing -mno-red-zone -mcmodel=kernel -DNV_UVM_ENABLE -Wno-sign-compare -Wno-format-extra-args -Werror=undef -I/tmp/B.miPlDw/BUILD/NVIDIA-Linux-x86_64-384.59-no-compat32/kernel/nvidia -DNV_BUILD_MODULE_INSTANCES=0 -UDEBUG -U_DEBUG -DNDEBUG -DMODULE -DKBUILD_BASENAME='"nv"' -DKBUILD_MODNAME='"nvidia"' -c -o /tmp/B.miPlDw/BUILD/NVIDIA-Linux-x86_64-384.59-no-compat32/kernel/nvidia/nv.o /tmp/B.miPlDw/BUILD/NVIDIA-Linux-x86_64-384.59-no-compat32/kernel/nvidia/nv.c cc1: error: incompatible gcc/plugin versions cc1: error: fail to initialize plugin ./scripts/gcc-plugins/structleak_plugin.so make[2]: *** [scripts/Makefile.build:294: /tmp/B.miPlDw/BUILD/NVIDIA-Linux-x86_64-384.59-no-compat32/kernel/nvidia/nv.o] Error 1 x86_64-pld-linux-gcc -Wp,-MD,/tmp/B.miPlDw/BUILD/NVIDIA-Linux-x86_64-384.59-no-compat32/kernel/nvidia/.nv-frontend.o.d -nostdinc -isystem /usr/lib64/gcc/x86_64-pld-linux/6.4.0/include -I./arch/x86/include -I./arch/x86/include/generated/uapi -I./arch/x86/include/generated -I./include -I./arch/x86/include/uapi -I./include/uapi -I./include/generated/uapi -include ./include/linux/kconfig.h -D__KERNEL__ -Wall -Wundef -Wstrict-prototypes -Wno-trigraphs -fno-strict-aliasing -fno-common -Werror-implicit-function-declaration -Wno-format-security -std=gnu89 -fno-PIE -mno-sse -mno-mmx -mno-sse2 -mno-3dnow -mno-avx -m64 -falign-jumps=1 -falign-loops=1 -mno-80387 -mno-fp-ret-in-387 -mpreferred-stack-boundary=3 -mskip-rax-setup -mtune=generic -mno-red-zone -mcmodel=kernel -funit-at-a-time -DCONFIG_X86_X32_ABI -DCONFIG_AS_CFI=1 -DCONFIG_AS_CFI_SIGNAL_FRAME=1 -DCONFIG_AS_CFI_SECTIONS=1 -DCONFIG_AS_FXSAVEQ=1 -DCONFIG_AS_SSSE3=1 -DCONFIG_AS_CRC32=1 -DCONFIG_AS_AVX=1 -DCONFIG_AS_AVX2=1 -DCONFIG_AS_AVX512=1 -DCONFIG_AS_SHA1_NI=1 -DCONFIG_AS_SHA256_NI=1 -pipe -Wno-sign-compare -fno-asynchronous-unwind-tables -fno-delete-null-pointer-checks -Wno-frame-address -O2 --param=allow-store-data-races=0 -DCC_HAVE_ASM_GOTO -fplugin=./scripts/gcc-plugins/structleak_plugin.so -DSTRUCTLEAK_PLUGIN -Wframe-larger-than=2048 -fstack-protector-strong -Wno-unused-but-set-variable -Wno-unused-const-variable -fno-omit-frame-pointer -fno-optimize-sibling-calls -fno-var-tracking-assignments -gsplit-dwarf -gdwarf-4 -pg -mfentry -DCC_USING_FENTRY -Wdeclaration-after-statement -Wno-pointer-sign -fno-strict-overflow -fconserve-stack -Werror=implicit-int -Werror=strict-prototypes -Werror=date-time -Werror=incompatible-pointer-types -I/tmp/B.miPlDw/BUILD/NVIDIA-Linux-x86_64-384.59-no-compat32/kernel/common/inc -I/tmp/B.miPlDw/BUILD/NVIDIA-Linux-x86_64-384.59-no-compat32/kernel -Wall -MD -Wsign-compare -Wno-cast-qual -Wno-error -D__KERNEL__ -DMODULE -DNVRM -DNV_VERSION_STRING=\"384.59\" -Wno-unused-function -Wuninitialized -fno-strict-aliasing -mno-red-zone -mcmodel=kernel -DNV_UVM_ENABLE -Wno-sign-compare -Wno-format-extra-args -Werror=undef -I/tmp/B.miPlDw/BUILD/NVIDIA-Linux-x86_64-384.59-no-compat32/kernel/nvidia -DNV_BUILD_MODULE_INSTANCES=0 -UDEBUG -U_DEBUG -DNDEBUG -DMODULE -DKBUILD_BASENAME='"nv_frontend"' -DKBUILD_MODNAME='"nvidia"' -c -o /tmp/B.miPlDw/BUILD/NVIDIA-Linux-x86_64-384.59-no-compat32/kernel/nvidia/nv-frontend.o /tmp/B.miPlDw/BUILD/NVIDIA-Linux-x86_64-384.59-no-compat32/kernel/nvidia/nv-frontend.c cc1: error: incompatible gcc/plugin versions cc1: error: fail to initialize plugin ./scripts/gcc-plugins/structleak_plugin.so make[2]: *** [scripts/Makefile.build:294: /tmp/B.miPlDw/BUILD/NVIDIA-Linux-x86_64-384.59-no-compat32/kernel/nvidia/nv-frontend.o] Error 1 x86_64-pld-linux-gcc -Wp,-MD,/tmp/B.miPlDw/BUILD/NVIDIA-Linux-x86_64-384.59-no-compat32/kernel/nvidia/.nv-chrdev.o.d -nostdinc -isystem /usr/lib64/gcc/x86_64-pld-linux/6.4.0/include -I./arch/x86/include -I./arch/x86/include/generated/uapi -I./arch/x86/include/generated -I./include -I./arch/x86/include/uapi -I./include/uapi -I./include/generated/uapi -include ./include/linux/kconfig.h -D__KERNEL__ -Wall -Wundef -Wstrict-prototypes -Wno-trigraphs -fno-strict-aliasing -fno-common -Werror-implicit-function-declaration -Wno-format-security -std=gnu89 -fno-PIE -mno-sse -mno-mmx -mno-sse2 -mno-3dnow -mno-avx -m64 -falign-jumps=1 -falign-loops=1 -mno-80387 -mno-fp-ret-in-387 -mpreferred-stack-boundary=3 -mskip-rax-setup -mtune=generic -mno-red-zone -mcmodel=kernel -funit-at-a-time -DCONFIG_X86_X32_ABI -DCONFIG_AS_CFI=1 -DCONFIG_AS_CFI_SIGNAL_FRAME=1 -DCONFIG_AS_CFI_SECTIONS=1 -DCONFIG_AS_FXSAVEQ=1 -DCONFIG_AS_SSSE3=1 -DCONFIG_AS_CRC32=1 -DCONFIG_AS_AVX=1 -DCONFIG_AS_AVX2=1 -DCONFIG_AS_AVX512=1 -DCONFIG_AS_SHA1_NI=1 -DCONFIG_AS_SHA256_NI=1 -pipe -Wno-sign-compare -fno-asynchronous-unwind-tables -fno-delete-null-pointer-checks -Wno-frame-address -O2 --param=allow-store-data-races=0 -DCC_HAVE_ASM_GOTO -fplugin=./scripts/gcc-plugins/structleak_plugin.so -DSTRUCTLEAK_PLUGIN -Wframe-larger-than=2048 -fstack-protector-strong -Wno-unused-but-set-variable -Wno-unused-const-variable -fno-omit-frame-pointer -fno-optimize-sibling-calls -fno-var-tracking-assignments -gsplit-dwarf -gdwarf-4 -pg -mfentry -DCC_USING_FENTRY -Wdeclaration-after-statement -Wno-pointer-sign -fno-strict-overflow -fconserve-stack -Werror=implicit-int -Werror=strict-prototypes -Werror=date-time -Werror=incompatible-pointer-types -I/tmp/B.miPlDw/BUILD/NVIDIA-Linux-x86_64-384.59-no-compat32/kernel/common/inc -I/tmp/B.miPlDw/BUILD/NVIDIA-Linux-x86_64-384.59-no-compat32/kernel -Wall -MD -Wsign-compare -Wno-cast-qual -Wno-error -D__KERNEL__ -DMODULE -DNVRM -DNV_VERSION_STRING=\"384.59\" -Wno-unused-function -Wuninitialized -fno-strict-aliasing -mno-red-zone -mcmodel=kernel -DNV_UVM_ENABLE -Wno-sign-compare -Wno-format-extra-args -Werror=undef -I/tmp/B.miPlDw/BUILD/NVIDIA-Linux-x86_64-384.59-no-compat32/kernel/nvidia -DNV_BUILD_MODULE_INSTANCES=0 -UDEBUG -U_DEBUG -DNDEBUG -DMODULE -DKBUILD_BASENAME='"nv_chrdev"' -DKBUILD_MODNAME='"nvidia"' -c -o /tmp/B.miPlDw/BUILD/NVIDIA-Linux-x86_64-384.59-no-compat32/kernel/nvidia/nv-chrdev.o /tmp/B.miPlDw/BUILD/NVIDIA-Linux-x86_64-384.59-no-compat32/kernel/nvidia/nv-chrdev.c cc1: error: incompatible gcc/plugin versions cc1: error: fail to initialize plugin ./scripts/gcc-plugins/structleak_plugin.so make[2]: *** [scripts/Makefile.build:294: /tmp/B.miPlDw/BUILD/NVIDIA-Linux-x86_64-384.59-no-compat32/kernel/nvidia/nv-chrdev.o] Error 1 make[1]: *** [Makefile:1492: _module_/tmp/B.miPlDw/BUILD/NVIDIA-Linux-x86_64-384.59-no-compat32/kernel] Error 2 make: *** [Makefile:81: modules] Error 2 error: Bad exit status from /tmp/B.miPlDw/BUILD/tmp/rpm-tmp.29203 (%build) RPM build errors: Bad exit status from /tmp/B.miPlDw/BUILD/tmp/rpm-tmp.29203 (%build) ended at: Wed Jul 26 15:57:43 2017, done in 0:00:17.313573 error: No files produced. mesg: ttyname failed: Inappropriate ioctl for device + chmod -R u+rwX /tmp/B.miPlDw/BUILD + rm -rf /tmp/B.miPlDw/tmp /tmp/B.miPlDw/BUILD mesg: ttyname failed: Inappropriate ioctl for device + rm -rf /tmp/B.miPlDw Begin-PLD-Builder-Info Build-Time: user:29.71s sys:5.20s real:27.26s (faults io:2 non-io:1783796) End-PLD-Builder-Info
[Back to list of logs] [View rpm -qa of builder]