FailedOk

th/SRPMS[OK]
th/x32[OK]
th/i686[OK]
th/x86_64[OK]

ac/SRPMS[OK]
ac/i386[OK]
ac/i586[OK]
ac/i686[OK]
ac/alpha[OK]
ac/amd64[OK]
ac/athlon[OK]
ac/ppc[OK]
ac/sparc[OK]
ac/sparc64[OK]

Advanced Search
main()
Powered by PLD Linux
(c) 2002-2020 PLD Team
$Revision: 1.37 $
Powered by BOFH.
Your IP: 3.234.241.200

xorg-driver-video-nvidia-legacy-390xx 503323ce-a077-472e-b1be-8c6f50572c98

Status:Failed
Source URL:https://buildlogs.pld-linux.org/pld/th/x86_64/FAIL/xorg-driver-video-nvidia-legacy-390xx,503323ce-a077-472e-b1be-8c6f50572c98.bz2
text/plain URL:View!
full text:View!
rpm -qa of builder:View!
Date:2020/06/06 10:25:18
Runtime:0:00:17.434959

Toc:

  • error 1
  • echo >&2 " ERROR: Kernel configuration is invalid."; \
  • error 2
  • /tmp/B.JfsCO7/BUILD/NVIDIA-Linux-x86_64-390.132-no-compat32/kernel/nvidia/nv-vm.c:86:13: error: implicit declaration of function 'set_memory_array_uc'; did you mean 'set_pages_array_uc'? [-Werror=implicit-function-declaration]
  • error 3
  • /tmp/B.JfsCO7/BUILD/NVIDIA-Linux-x86_64-390.132-no-compat32/kernel/nvidia/nv-vm.c:89:13: error: implicit declaration of function 'set_memory_array_wb'; did you mean 'set_pages_array_wb'? [-Werror=implicit-function-declaration]
  • error 4
  • make[2]: *** [scripts/Makefile.build:267: /tmp/B.JfsCO7/BUILD/NVIDIA-Linux-x86_64-390.132-no-compat32/kernel/nvidia/nv-vm.o] Error 1
  • error 5
  • make[1]: *** [Makefile:1729: /tmp/B.JfsCO7/BUILD/NVIDIA-Linux-x86_64-390.132-no-compat32/kernel] Error 2
  • error 6
  • error: Bad exit status from /tmp/B.JfsCO7/BUILD/tmp/rpm-tmp.69078 (%build)
  • error 7
  • RPM build errors:
  • error 8
  • error: No files produced.

Content:

* Sat Jan 18 2020 Jan Palus <atler@pld-linux.org> 41fed34
- release 2 (by relup.sh) * Sat Jan 18 2020 Jan Palus <atler@pld-linux.org> bf4bf75
- appears to work fine with abi 24.1 * Sat Nov 23 2019 Jan Palus <atler@pld-linux.org> 5a7adc0
- up to 390.132 * Thu Aug 22 2019 Jan Palus <atler@pld-linux.org> a109907
- up to 390.129 * Fri Jul 12 2019 Jan Rękorajski <baggins@pld-linux.org> 0231027
- rel 5 * Fri Jul 12 2019 Jan Rękorajski <baggins@pld-linux.org> 6b80d9d
- uvm is only built on x8664 * Fri Jul 12 2019 Jan Rękorajski <baggins@pld-linux.org> 3f47427
- fix building with kernel 5.2 - rel 4 + rpm -Uhv --nodeps --define '_topdir /tmp/B.JfsCO7' --define '_specdir %{_topdir}' --define '_sourcedir %{_specdir}' --define '_rpmdir %{_topdir}/RPMS' --define '_builddir %{_topdir}/BUILD' --without userspace --define 'build_kernels head,5.4,4.19,4.14,4.9' xorg-driver-video-nvidia-legacy-390xx-kernel-390.132-6@5.7.0_1.src.rpm Preparing... ################################################## xorg-driver-video-nvidia-leg################################################## + rm -f xorg-driver-video-nvidia-legacy-390xx-kernel-390.132-6@5.7.0_1.src.rpm + install -m 700 -d /tmp/B.JfsCO7/BUILD/tmp + TMPDIR=/tmp/B.JfsCO7/BUILD/tmp + exec nice -n 0 rpmbuild -bp --short-circuit --nodeps --define '_topdir /tmp/B.JfsCO7' --define '_specdir %{_topdir}' --define '_sourcedir %{_specdir}' --define '_rpmdir %{_topdir}/RPMS' --define '_builddir %{_topdir}/BUILD' --without userspace --target x86_64-pld-linux --define 'build_kernels head,5.4,4.19,4.14,4.9' --define 'prep exit 0' /tmp/B.JfsCO7/xorg-driver-video-nvidia-legacy-390xx.spec Building target platforms: x86_64-pld-linux checking BuildConflict-ing packages no BuildConflicts found checking BR rpm: Building target platforms: x86_64-pld-linux no BR needed building RPM using: set -ex; : build-id: 503323ce-a077-472e-b1be-8c6f50572c98; TMPDIR=/tmp/B.JfsCO7/BUILD/tmp exec nice -n 0 rpmbuild -bb --define '_smp_mflags -j9' --define '_make_opts -Otarget' --define '_pld_builder 1' --define '_topdir /tmp/B.JfsCO7' --define '_specdir %{_topdir}' --define '_sourcedir %{_specdir}' --define '_rpmdir %{_topdir}/RPMS' --define '_builddir %{_topdir}/BUILD' --without userspace --target x86_64-pld-linux --define 'build_kernels head,5.4,4.19,4.14,4.9' /tmp/B.JfsCO7/xorg-driver-video-nvidia-legacy-390xx.spec + : build-id: 503323ce-a077-472e-b1be-8c6f50572c98 + TMPDIR=/tmp/B.JfsCO7/BUILD/tmp + exec nice -n 0 rpmbuild -bb --define '_smp_mflags -j9' --define '_make_opts -Otarget' --define '_pld_builder 1' --define '_topdir /tmp/B.JfsCO7' --define '_specdir %{_topdir}' --define '_sourcedir %{_specdir}' --define '_rpmdir %{_topdir}/RPMS' --define '_builddir %{_topdir}/BUILD' --without userspace --target x86_64-pld-linux --define 'build_kernels head,5.4,4.19,4.14,4.9' /tmp/B.JfsCO7/xorg-driver-video-nvidia-legacy-390xx.spec Building target platforms: x86_64-pld-linux Executing(%prep): /bin/sh -e /tmp/B.JfsCO7/BUILD/tmp/rpm-tmp.24901 + umask 022 + cd /tmp/B.JfsCO7/BUILD + cd /tmp/B.JfsCO7/BUILD + rm -rf 'NVIDIA-Linux-x86*-390.132*' + /bin/sh /tmp/B.JfsCO7/NVIDIA-Linux-x86_64-390.132-no-compat32.run --extract-only Creating directory NVIDIA-Linux-x86_64-390.132-no-compat32 Verifying archive integrity... OK Uncompressing NVIDIA Accelerated Graphics Driver for Linux-x86_64 390.132................................................................................................................................................................................................................................................................................................................................................................................................................................................................................... + cd /tmp/B.JfsCO7/BUILD + cd NVIDIA-Linux-x86_64-390.132-no-compat32 + /bin/id -u + '[' 1000 '=' 0 ']' + /bin/id -u + '[' 1000 '=' 0 ']' + /bin/chmod -Rf a+rX,u+w,g-w,o-w . + echo 'Patch #0 (X11-driver-nvidia-GL.patch):' Patch #0 (X11-driver-nvidia-GL.patch): + '[' -f /tmp/B.JfsCO7/X11-driver-nvidia-GL.patch ']' + /bin/cat /tmp/B.JfsCO7/X11-driver-nvidia-GL.patch + /usr/bin/patch -s -p1 + echo 'Patch #1 (X11-driver-nvidia-desktop.patch):' Patch #1 (X11-driver-nvidia-desktop.patch): + '[' -f /tmp/B.JfsCO7/X11-driver-nvidia-desktop.patch ']' + /bin/cat /tmp/B.JfsCO7/X11-driver-nvidia-desktop.patch + /usr/bin/patch -s -p1 + echo 'Patch #2 (kernel-5.5.patch):' Patch #2 (kernel-5.5.patch): + '[' -f /tmp/B.JfsCO7/kernel-5.5.patch ']' + /bin/cat /tmp/B.JfsCO7/kernel-5.5.patch + /usr/bin/patch -s -p1 + echo 'Patch #3 (kernel-5.6.patch):' Patch #3 (kernel-5.6.patch): + '[' -f /tmp/B.JfsCO7/kernel-5.6.patch ']' + /bin/cat /tmp/B.JfsCO7/kernel-5.6.patch + /usr/bin/patch -s -p1 + echo 'Patch #4 (kernel-5.6-x8664.patch):' Patch #4 (kernel-5.6-x8664.patch): + '[' -f /tmp/B.JfsCO7/kernel-5.6-x8664.patch ']' + /bin/cat /tmp/B.JfsCO7/kernel-5.6-x8664.patch + /usr/bin/patch -s -p1 + >>kernel/Makefile.kbuild + echo 'EXTRA_CFLAGS += -Wno-pointer-arith -Wno-sign-compare -Wno-unused' + exit 0 Executing(%build): /bin/sh -e /tmp/B.JfsCO7/BUILD/tmp/rpm-tmp.69078 TMP=/home/users/builder/tmp HOME=/home/users/builder PATH=/home/users/builder/GNUstep/Tools:/bin:/usr/bin:/usr/local/bin:/home/users/builder/bin TMPDIR=/tmp/B.JfsCO7/BUILD/tmp + umask 022 + cd /tmp/B.JfsCO7/BUILD + cd NVIDIA-Linux-x86_64-390.132-no-compat32 + cd kernel + /usr/bin/make -Otarget -j9 'SYSSRC=/usr/src/linux' clean rm -f -r conftest + /usr/bin/make -Otarget -j9 'SYSSRC=/usr/src/linux' 'IGNORE_CC_MISMATCH=1' 'NV_VERBOSE=1' 'CC=x86_64-pld-linux-gcc' module make[1]: Entering directory '/usr/src/linux-5.7.0' test -e include/generated/autoconf.h -a -e include/config/auto.conf || ( \ echo >&2; \ echo >&2 " ERROR: Kernel configuration is invalid."; \ echo >&2 " include/generated/autoconf.h or include/config/auto.conf are missing.";\ echo >&2 " Run 'make oldconfig && make prepare' on kernel src to fix it."; \ echo >&2 ; \ /bin/false) make[1]: Leaving directory '/usr/src/linux-5.7.0' /usr/bin/make -f ./scripts/Makefile.build obj=/tmp/B.JfsCO7/BUILD/NVIDIA-Linux-x86_64-390.132-no-compat32/kernel \ single-build= \ need-builtin=1 need-modorder=1 ln -sf /tmp/B.JfsCO7/BUILD/NVIDIA-Linux-x86_64-390.132-no-compat32/kernel/nvidia/nv-kernel.o_binary /tmp/B.JfsCO7/BUILD/NVIDIA-Linux-x86_64-390.132-no-compat32/kernel/nvidia/nv-kernel.o ln -sf /tmp/B.JfsCO7/BUILD/NVIDIA-Linux-x86_64-390.132-no-compat32/kernel/nvidia-modeset/nv-modeset-kernel.o_binary /tmp/B.JfsCO7/BUILD/NVIDIA-Linux-x86_64-390.132-no-compat32/kernel/nvidia-modeset/nv-modeset-kernel.o { echo /tmp/B.JfsCO7/BUILD/NVIDIA-Linux-x86_64-390.132-no-compat32/kernel/nvidia.ko; echo /tmp/B.JfsCO7/BUILD/NVIDIA-Linux-x86_64-390.132-no-compat32/kernel/nvidia-uvm.ko; echo /tmp/B.JfsCO7/BUILD/NVIDIA-Linux-x86_64-390.132-no-compat32/kernel/nvidia-modeset.ko; echo /tmp/B.JfsCO7/BUILD/NVIDIA-Linux-x86_64-390.132-no-compat32/kernel/nvidia-drm.ko; :; } \ | awk '!x[$0]++' - > /tmp/B.JfsCO7/BUILD/NVIDIA-Linux-x86_64-390.132-no-compat32/kernel/modules.order CONFTEST: vmap CONFTEST: list_is_first CONFTEST: set_memory_uc CONFTEST: set_pages_uc CONFTEST: hash__remap_4k_pfn CONFTEST: set_memory_array_uc CONFTEST: acquire_console_sem CONFTEST: remap_pfn_range CONFTEST: follow_pfn CONFTEST: console_lock CONFTEST: change_page_attr CONFTEST: acpi_device_id CONFTEST: vm_insert_page CONFTEST: pci_choose_state CONFTEST: pci_get_class CONFTEST: INIT_WORK CONFTEST: ioremap_cache CONFTEST: ioremap_wc CONFTEST: ioremap_nocache CONFTEST: sg_init_table CONFTEST: acpi_evaluate_integer CONFTEST: on_each_cpu CONFTEST: pci_domain_nr CONFTEST: smp_call_function CONFTEST: kmem_cache_create CONFTEST: pci_dma_mapping_error CONFTEST: pci_get_domain_bus_and_slot CONFTEST: acpi_walk_namespace CONFTEST: xen_ioemu_inject_msi CONFTEST: proc_create_data CONFTEST: get_num_physpages CONFTEST: pm_vt_switch_required CONFTEST: pde_data CONFTEST: proc_remove CONFTEST: write_cr4 CONFTEST: of_get_property CONFTEST: of_find_node_by_phandle CONFTEST: phys_to_dma CONFTEST: efi_enabled CONFTEST: get_dma_ops CONFTEST: of_node_to_nid CONFTEST: sg_alloc_table CONFTEST: request_threaded_irq CONFTEST: pnv_pci_get_npu_dev CONFTEST: for_each_online_node CONFTEST: node_end_pfn CONFTEST: pci_bus_address CONFTEST: pci_stop_and_remove_bus_device CONFTEST: register_cpu_notifier CONFTEST: pci_remove_bus_device CONFTEST: cpuhp_setup_state CONFTEST: remap_page_range CONFTEST: timer_setup CONFTEST: do_gettimeofday CONFTEST: kmem_cache_create_usercopy CONFTEST: kbasename CONFTEST: backlight_device_register CONFTEST: dma_map_resource CONFTEST: list_cut_position CONFTEST: address_space_init_once CONFTEST: dma_direct_map_resource CONFTEST: usleep_range CONFTEST: vmf_insert_pfn CONFTEST: vzalloc CONFTEST: bitmap_clear CONFTEST: fatal_signal_pending CONFTEST: wait_on_bit_lock_argument_count CONFTEST: register_acpi_notifier CONFTEST: drm_dev_unref CONFTEST: drm_driver_has_gem_prime_res_obj CONFTEST: radix_tree_empty CONFTEST: drm_reinit_primary_mode_group CONFTEST: drm_atomic_state_ref_counting CONFTEST: radix_tree_replace_slot CONFTEST: drm_connector_funcs_have_mode_in_name CONFTEST: drm_atomic_helper_connector_dpms CONFTEST: is_export_symbol_gpl_of_node_to_nid CONFTEST: is_export_symbol_present_swiotlb_dma_ops CONFTEST: drm_framebuffer_get CONFTEST: is_export_symbol_present_swiotlb_map_sg_attrs CONFTEST: drm_dev_put CONFTEST: get_user_pages CONFTEST: drm_gem_object_get CONFTEST: drm_gem_object_lookup CONFTEST: outer_flush_all CONFTEST: i2c_adapter CONFTEST: irq_handler_t CONFTEST: acpi_device_ops CONFTEST: pm_message_t CONFTEST: acpi_op_remove CONFTEST: get_user_pages_remote CONFTEST: ktime_get_raw_ts64 CONFTEST: proc_dir_entry CONFTEST: atomic_long_type CONFTEST: proc_ops CONFTEST: scatterlist CONFTEST: sg_table CONFTEST: task_struct CONFTEST: kuid_t CONFTEST: file_inode CONFTEST: pci_save_state CONFTEST: dma_map_ops CONFTEST: dma_ops CONFTEST: swiotlb_dma_ops CONFTEST: strnstr CONFTEST: vm_operations_struct CONFTEST: kstrtoull CONFTEST: vm_fault_present CONFTEST: vm_fault_has_address CONFTEST: noncoherent_swiotlb_dma_ops CONFTEST: kernel_write CONFTEST: atomic64_type CONFTEST: iterate_dir CONFTEST: file_operations CONFTEST: sysfs_slab_unlink CONFTEST: kmem_cache_has_kobj_remove_work CONFTEST: backlight_properties_type CONFTEST: pnv_npu2_init_context CONFTEST: drm_bus_present CONFTEST: address_space CONFTEST: drm_bus_has_bus_type CONFTEST: drm_bus_has_get_irq CONFTEST: fault_flags CONFTEST: drm_driver_has_set_busid CONFTEST: drm_bus_has_get_name CONFTEST: backing_dev_info CONFTEST: drm_mode_connector_list_update_has_merge_type_bits_arg CONFTEST: drm_master_drop_has_from_release_arg CONFTEST: drm_driver_unload_has_int_return_type CONFTEST: mm_context_t CONFTEST: vm_ops_fault_removed_vma_arg CONFTEST: drm_driver_has_legacy_dev_list CONFTEST: kref_has_refcount_of_type_refcount_t CONFTEST: drm_mode_object_find_has_file_priv_arg CONFTEST: drm_driver_prime_flag_present CONFTEST: dom0_kernel_present CONFTEST: drm_gem_prime_export_has_dev_arg CONFTEST: nvidia_vgpu_kvm_build CONFTEST: drm_crtc_state_has_connectors_changed CONFTEST: nvidia_grid_build CONFTEST: drm_helper_mode_fill_fb_struct CONFTEST: is_export_symbol_gpl_refcount_inc CONFTEST: drm_atomic_helper_crtc_destroy_state_has_crtc_arg CONFTEST: is_export_symbol_gpl_refcount_dec_and_test CONFTEST: drm_crtc_helper_funcs_has_atomic_enable CONFTEST: drm_connector_list_iter CONFTEST: drm_available CONFTEST: drm_init_function_args CONFTEST: drm_atomic_helper_swap_state_has_stall_arg CONFTEST: drm_atomic_available x86_64-pld-linux-gcc -Wp,-MD,/tmp/B.JfsCO7/BUILD/NVIDIA-Linux-x86_64-390.132-no-compat32/kernel/nvidia/.nv-cray.o.d -nostdinc -isystem /usr/lib64/gcc/x86_64-pld-linux/10.1.0/include -I./arch/x86/include -I./arch/x86/include/generated -I./include -I./arch/x86/include/uapi -I./arch/x86/include/generated/uapi -I./include/uapi -I./include/generated/uapi -include ./include/linux/kconfig.h -include ./include/linux/compiler_types.h -D__KERNEL__ -Wall -Wundef -Werror=strict-prototypes -Wno-trigraphs -fno-strict-aliasing -fno-common -fshort-wchar -fno-PIE -Werror=implicit-function-declaration -Werror=implicit-int -Wno-format-security -std=gnu89 -mno-sse -mno-mmx -mno-sse2 -mno-3dnow -mno-avx -m64 -falign-jumps=1 -falign-loops=1 -mno-80387 -mno-fp-ret-in-387 -mpreferred-stack-boundary=3 -mskip-rax-setup -mtune=generic -mno-red-zone -mcmodel=kernel -DCONFIG_X86_X32_ABI -Wno-sign-compare -fno-asynchronous-unwind-tables -mindirect-branch=thunk-extern -mindirect-branch-register -fno-jump-tables -fno-delete-null-pointer-checks -Wno-frame-address -Wno-format-truncation -Wno-format-overflow -Wno-address-of-packed-member -O2 -fno-allow-store-data-races -fplugin=./scripts/gcc-plugins/structleak_plugin.so -fplugin=./scripts/gcc-plugins/randomize_layout_plugin.so -fplugin=./scripts/gcc-plugins/stackleak_plugin.so -fplugin-arg-structleak_plugin-byref-all -DSTRUCTLEAK_PLUGIN -DRANDSTRUCT_PLUGIN -fplugin-arg-randomize_layout_plugin-performance-mode -DSTACKLEAK_PLUGIN -fplugin-arg-stackleak_plugin-track-min-size=100 -Wframe-larger-than=2048 -fstack-protector-strong -Wno-unused-but-set-variable -Wimplicit-fallthrough -Wno-unused-const-variable -fno-var-tracking-assignments -gsplit-dwarf -gdwarf-4 -pg -mrecord-mcount -mfentry -DCC_USING_FENTRY -flive-patching=inline-clone -Wdeclaration-after-statement -Wvla -Wno-pointer-sign -Wno-stringop-truncation -Wno-zero-length-bounds -Wno-array-bounds -Wno-stringop-overflow -Wno-restrict -Wno-maybe-uninitialized -fno-strict-overflow -fno-merge-all-constants -fmerge-constants -fno-stack-check -fconserve-stack -Werror=date-time -Werror=incompatible-pointer-types -Werror=designated-init -fmacro-prefix-map=./= -fcf-protection=none -Wno-packed-not-aligned -I/tmp/B.JfsCO7/BUILD/NVIDIA-Linux-x86_64-390.132-no-compat32/kernel/common/inc -I/tmp/B.JfsCO7/BUILD/NVIDIA-Linux-x86_64-390.132-no-compat32/kernel -Wall -MD -Wsign-compare -Wno-cast-qual -Wno-error -D__KERNEL__ -DMODULE -DNVRM -DNV_VERSION_STRING=\"390.132\" -Wno-unused-function -Wuninitialized -fno-strict-aliasing -mno-red-zone -mcmodel=kernel -DNV_UVM_ENABLE -Wno-sign-compare -Wno-format-extra-args -Werror=undef -DNV_SPECTRE_V2=0 -I/tmp/B.JfsCO7/BUILD/NVIDIA-Linux-x86_64-390.132-no-compat32/kernel/nvidia -DNV_BUILD_MODULE_INSTANCES=0 -DNVIDIA_UNDEF_LEGACY_BIT_MACROS -UDEBUG -U_DEBUG -DNDEBUG -DMODULE -DKBUILD_BASENAME='"nv_cray"' -DKBUILD_MODNAME='"nvidia"' -c -o /tmp/B.JfsCO7/BUILD/NVIDIA-Linux-x86_64-390.132-no-compat32/kernel/nvidia/nv-cray.o /tmp/B.JfsCO7/BUILD/NVIDIA-Linux-x86_64-390.132-no-compat32/kernel/nvidia/nv-cray.c ./tools/objtool/objtool orc generate --module --no-fp --retpoline --uaccess /tmp/B.JfsCO7/BUILD/NVIDIA-Linux-x86_64-390.132-no-compat32/kernel/nvidia/nv-cray.o if objdump -h /tmp/B.JfsCO7/BUILD/NVIDIA-Linux-x86_64-390.132-no-compat32/kernel/nvidia/nv-cray.o | grep -q __ksymtab; then x86_64-pld-linux-gcc -E -D__GENKSYMS__ -Wp,-MD,/tmp/B.JfsCO7/BUILD/NVIDIA-Linux-x86_64-390.132-no-compat32/kernel/nvidia/.nv-cray.o.d -nostdinc -isystem /usr/lib64/gcc/x86_64-pld-linux/10.1.0/include -I./arch/x86/include -I./arch/x86/include/generated -I./include -I./arch/x86/include/uapi -I./arch/x86/include/generated/uapi -I./include/uapi -I./include/generated/uapi -include ./include/linux/kconfig.h -include ./include/linux/compiler_types.h -D__KERNEL__ -Wall -Wundef -Werror=strict-prototypes -Wno-trigraphs -fno-strict-aliasing -fno-common -fshort-wchar -fno-PIE -Werror=implicit-function-declaration -Werror=implicit-int -Wno-format-security -std=gnu89 -mno-sse -mno-mmx -mno-sse2 -mno-3dnow -mno-avx -m64 -falign-jumps=1 -falign-loops=1 -mno-80387 -mno-fp-ret-in-387 -mpreferred-stack-boundary=3 -mskip-rax-setup -mtune=generic -mno-red-zone -mcmodel=kernel -DCONFIG_X86_X32_ABI -Wno-sign-compare -fno-asynchronous-unwind-tables -mindirect-branch=thunk-extern -mindirect-branch-register -fno-jump-tables -fno-delete-null-pointer-checks -Wno-frame-address -Wno-format-truncation -Wno-format-overflow -Wno-address-of-packed-member -O2 -fno-allow-store-data-races -fplugin=./scripts/gcc-plugins/structleak_plugin.so -fplugin=./scripts/gcc-plugins/randomize_layout_plugin.so -fplugin=./scripts/gcc-plugins/stackleak_plugin.so -fplugin-arg-structleak_plugin-byref-all -DSTRUCTLEAK_PLUGIN -DRANDSTRUCT_PLUGIN -fplugin-arg-randomize_layout_plugin-performance-mode -DSTACKLEAK_PLUGIN -fplugin-arg-stackleak_plugin-track-min-size=100 -Wframe-larger-than=2048 -fstack-protector-strong -Wno-unused-but-set-variable -Wimplicit-fallthrough -Wno-unused-const-variable -fno-var-tracking-assignments -gsplit-dwarf -gdwarf-4 -pg -mrecord-mcount -mfentry -DCC_USING_FENTRY -flive-patching=inline-clone -Wdeclaration-after-statement -Wvla -Wno-pointer-sign -Wno-stringop-truncation -Wno-zero-length-bounds -Wno-array-bounds -Wno-stringop-overflow -Wno-restrict -Wno-maybe-uninitialized -fno-strict-overflow -fno-merge-all-constants -fmerge-constants -fno-stack-check -fconserve-stack -Werror=date-time -Werror=incompatible-pointer-types -Werror=designated-init -fmacro-prefix-map=./= -fcf-protection=none -Wno-packed-not-aligned -I/tmp/B.JfsCO7/BUILD/NVIDIA-Linux-x86_64-390.132-no-compat32/kernel/common/inc -I/tmp/B.JfsCO7/BUILD/NVIDIA-Linux-x86_64-390.132-no-compat32/kernel -Wall -MD -Wsign-compare -Wno-cast-qual -Wno-error -D__KERNEL__ -DMODULE -DNVRM -DNV_VERSION_STRING=\"390.132\" -Wno-unused-function -Wuninitialized -fno-strict-aliasing -mno-red-zone -mcmodel=kernel -DNV_UVM_ENABLE -Wno-sign-compare -Wno-format-extra-args -Werror=undef -DNV_SPECTRE_V2=0 -I/tmp/B.JfsCO7/BUILD/NVIDIA-Linux-x86_64-390.132-no-compat32/kernel/nvidia -DNV_BUILD_MODULE_INSTANCES=0 -DNVIDIA_UNDEF_LEGACY_BIT_MACROS -UDEBUG -U_DEBUG -DNDEBUG -DMODULE -DKBUILD_BASENAME='"nv_cray"' -DKBUILD_MODNAME='"nvidia"' /tmp/B.JfsCO7/BUILD/NVIDIA-Linux-x86_64-390.132-no-compat32/kernel/nvidia/nv-cray.c | scripts/genksyms/genksyms -r /dev/null > /tmp/B.JfsCO7/BUILD/NVIDIA-Linux-x86_64-390.132-no-compat32/kernel/nvidia/.tmp_nv-cray.ver; ld -m elf_x86_64 -z max-page-size=0x200000 -r -o /tmp/B.JfsCO7/BUILD/NVIDIA-Linux-x86_64-390.132-no-compat32/kernel/nvidia/.tmp_nv-cray.o /tmp/B.JfsCO7/BUILD/NVIDIA-Linux-x86_64-390.132-no-compat32/kernel/nvidia/nv-cray.o -T /tmp/B.JfsCO7/BUILD/NVIDIA-Linux-x86_64-390.132-no-compat32/kernel/nvidia/.tmp_nv-cray.ver; mv -f /tmp/B.JfsCO7/BUILD/NVIDIA-Linux-x86_64-390.132-no-compat32/kernel/nvidia/.tmp_nv-cray.o /tmp/B.JfsCO7/BUILD/NVIDIA-Linux-x86_64-390.132-no-compat32/kernel/nvidia/nv-cray.o; rm -f /tmp/B.JfsCO7/BUILD/NVIDIA-Linux-x86_64-390.132-no-compat32/kernel/nvidia/.tmp_nv-cray.ver; fi x86_64-pld-linux-gcc -Wp,-MD,/tmp/B.JfsCO7/BUILD/NVIDIA-Linux-x86_64-390.132-no-compat32/kernel/nvidia/.nv-chrdev.o.d -nostdinc -isystem /usr/lib64/gcc/x86_64-pld-linux/10.1.0/include -I./arch/x86/include -I./arch/x86/include/generated -I./include -I./arch/x86/include/uapi -I./arch/x86/include/generated/uapi -I./include/uapi -I./include/generated/uapi -include ./include/linux/kconfig.h -include ./include/linux/compiler_types.h -D__KERNEL__ -Wall -Wundef -Werror=strict-prototypes -Wno-trigraphs -fno-strict-aliasing -fno-common -fshort-wchar -fno-PIE -Werror=implicit-function-declaration -Werror=implicit-int -Wno-format-security -std=gnu89 -mno-sse -mno-mmx -mno-sse2 -mno-3dnow -mno-avx -m64 -falign-jumps=1 -falign-loops=1 -mno-80387 -mno-fp-ret-in-387 -mpreferred-stack-boundary=3 -mskip-rax-setup -mtune=generic -mno-red-zone -mcmodel=kernel -DCONFIG_X86_X32_ABI -Wno-sign-compare -fno-asynchronous-unwind-tables -mindirect-branch=thunk-extern -mindirect-branch-register -fno-jump-tables -fno-delete-null-pointer-checks -Wno-frame-address -Wno-format-truncation -Wno-format-overflow -Wno-address-of-packed-member -O2 -fno-allow-store-data-races -fplugin=./scripts/gcc-plugins/structleak_plugin.so -fplugin=./scripts/gcc-plugins/randomize_layout_plugin.so -fplugin=./scripts/gcc-plugins/stackleak_plugin.so -fplugin-arg-structleak_plugin-byref-all -DSTRUCTLEAK_PLUGIN -DRANDSTRUCT_PLUGIN -fplugin-arg-randomize_layout_plugin-performance-mode -DSTACKLEAK_PLUGIN -fplugin-arg-stackleak_plugin-track-min-size=100 -Wframe-larger-than=2048 -fstack-protector-strong -Wno-unused-but-set-variable -Wimplicit-fallthrough -Wno-unused-const-variable -fno-var-tracking-assignments -gsplit-dwarf -gdwarf-4 -pg -mrecord-mcount -mfentry -DCC_USING_FENTRY -flive-patching=inline-clone -Wdeclaration-after-statement -Wvla -Wno-pointer-sign -Wno-stringop-truncation -Wno-zero-length-bounds -Wno-array-bounds -Wno-stringop-overflow -Wno-restrict -Wno-maybe-uninitialized -fno-strict-overflow -fno-merge-all-constants -fmerge-constants -fno-stack-check -fconserve-stack -Werror=date-time -Werror=incompatible-pointer-types -Werror=designated-init -fmacro-prefix-map=./= -fcf-protection=none -Wno-packed-not-aligned -I/tmp/B.JfsCO7/BUILD/NVIDIA-Linux-x86_64-390.132-no-compat32/kernel/common/inc -I/tmp/B.JfsCO7/BUILD/NVIDIA-Linux-x86_64-390.132-no-compat32/kernel -Wall -MD -Wsign-compare -Wno-cast-qual -Wno-error -D__KERNEL__ -DMODULE -DNVRM -DNV_VERSION_STRING=\"390.132\" -Wno-unused-function -Wuninitialized -fno-strict-aliasing -mno-red-zone -mcmodel=kernel -DNV_UVM_ENABLE -Wno-sign-compare -Wno-format-extra-args -Werror=undef -DNV_SPECTRE_V2=0 -I/tmp/B.JfsCO7/BUILD/NVIDIA-Linux-x86_64-390.132-no-compat32/kernel/nvidia -DNV_BUILD_MODULE_INSTANCES=0 -DNVIDIA_UNDEF_LEGACY_BIT_MACROS -UDEBUG -U_DEBUG -DNDEBUG -DMODULE -DKBUILD_BASENAME='"nv_chrdev"' -DKBUILD_MODNAME='"nvidia"' -c -o /tmp/B.JfsCO7/BUILD/NVIDIA-Linux-x86_64-390.132-no-compat32/kernel/nvidia/nv-chrdev.o /tmp/B.JfsCO7/BUILD/NVIDIA-Linux-x86_64-390.132-no-compat32/kernel/nvidia/nv-chrdev.c ./tools/objtool/objtool orc generate --module --no-fp --retpoline --uaccess /tmp/B.JfsCO7/BUILD/NVIDIA-Linux-x86_64-390.132-no-compat32/kernel/nvidia/nv-chrdev.o if objdump -h /tmp/B.JfsCO7/BUILD/NVIDIA-Linux-x86_64-390.132-no-compat32/kernel/nvidia/nv-chrdev.o | grep -q __ksymtab; then x86_64-pld-linux-gcc -E -D__GENKSYMS__ -Wp,-MD,/tmp/B.JfsCO7/BUILD/NVIDIA-Linux-x86_64-390.132-no-compat32/kernel/nvidia/.nv-chrdev.o.d -nostdinc -isystem /usr/lib64/gcc/x86_64-pld-linux/10.1.0/include -I./arch/x86/include -I./arch/x86/include/generated -I./include -I./arch/x86/include/uapi -I./arch/x86/include/generated/uapi -I./include/uapi -I./include/generated/uapi -include ./include/linux/kconfig.h -include ./include/linux/compiler_types.h -D__KERNEL__ -Wall -Wundef -Werror=strict-prototypes -Wno-trigraphs -fno-strict-aliasing -fno-common -fshort-wchar -fno-PIE -Werror=implicit-function-declaration -Werror=implicit-int -Wno-format-security -std=gnu89 -mno-sse -mno-mmx -mno-sse2 -mno-3dnow -mno-avx -m64 -falign-jumps=1 -falign-loops=1 -mno-80387 -mno-fp-ret-in-387 -mpreferred-stack-boundary=3 -mskip-rax-setup -mtune=generic -mno-red-zone -mcmodel=kernel -DCONFIG_X86_X32_ABI -Wno-sign-compare -fno-asynchronous-unwind-tables -mindirect-branch=thunk-extern -mindirect-branch-register -fno-jump-tables -fno-delete-null-pointer-checks -Wno-frame-address -Wno-format-truncation -Wno-format-overflow -Wno-address-of-packed-member -O2 -fno-allow-store-data-races -fplugin=./scripts/gcc-plugins/structleak_plugin.so -fplugin=./scripts/gcc-plugins/randomize_layout_plugin.so -fplugin=./scripts/gcc-plugins/stackleak_plugin.so -fplugin-arg-structleak_plugin-byref-all -DSTRUCTLEAK_PLUGIN -DRANDSTRUCT_PLUGIN -fplugin-arg-randomize_layout_plugin-performance-mode -DSTACKLEAK_PLUGIN -fplugin-arg-stackleak_plugin-track-min-size=100 -Wframe-larger-than=2048 -fstack-protector-strong -Wno-unused-but-set-variable -Wimplicit-fallthrough -Wno-unused-const-variable -fno-var-tracking-assignments -gsplit-dwarf -gdwarf-4 -pg -mrecord-mcount -mfentry -DCC_USING_FENTRY -flive-patching=inline-clone -Wdeclaration-after-statement -Wvla -Wno-pointer-sign -Wno-stringop-truncation -Wno-zero-length-bounds -Wno-array-bounds -Wno-stringop-overflow -Wno-restrict -Wno-maybe-uninitialized -fno-strict-overflow -fno-merge-all-constants -fmerge-constants -fno-stack-check -fconserve-stack -Werror=date-time -Werror=incompatible-pointer-types -Werror=designated-init -fmacro-prefix-map=./= -fcf-protection=none -Wno-packed-not-aligned -I/tmp/B.JfsCO7/BUILD/NVIDIA-Linux-x86_64-390.132-no-compat32/kernel/common/inc -I/tmp/B.JfsCO7/BUILD/NVIDIA-Linux-x86_64-390.132-no-compat32/kernel -Wall -MD -Wsign-compare -Wno-cast-qual -Wno-error -D__KERNEL__ -DMODULE -DNVRM -DNV_VERSION_STRING=\"390.132\" -Wno-unused-function -Wuninitialized -fno-strict-aliasing -mno-red-zone -mcmodel=kernel -DNV_UVM_ENABLE -Wno-sign-compare -Wno-format-extra-args -Werror=undef -DNV_SPECTRE_V2=0 -I/tmp/B.JfsCO7/BUILD/NVIDIA-Linux-x86_64-390.132-no-compat32/kernel/nvidia -DNV_BUILD_MODULE_INSTANCES=0 -DNVIDIA_UNDEF_LEGACY_BIT_MACROS -UDEBUG -U_DEBUG -DNDEBUG -DMODULE -DKBUILD_BASENAME='"nv_chrdev"' -DKBUILD_MODNAME='"nvidia"' /tmp/B.JfsCO7/BUILD/NVIDIA-Linux-x86_64-390.132-no-compat32/kernel/nvidia/nv-chrdev.c | scripts/genksyms/genksyms -r /dev/null > /tmp/B.JfsCO7/BUILD/NVIDIA-Linux-x86_64-390.132-no-compat32/kernel/nvidia/.tmp_nv-chrdev.ver; ld -m elf_x86_64 -z max-page-size=0x200000 -r -o /tmp/B.JfsCO7/BUILD/NVIDIA-Linux-x86_64-390.132-no-compat32/kernel/nvidia/.tmp_nv-chrdev.o /tmp/B.JfsCO7/BUILD/NVIDIA-Linux-x86_64-390.132-no-compat32/kernel/nvidia/nv-chrdev.o -T /tmp/B.JfsCO7/BUILD/NVIDIA-Linux-x86_64-390.132-no-compat32/kernel/nvidia/.tmp_nv-chrdev.ver; mv -f /tmp/B.JfsCO7/BUILD/NVIDIA-Linux-x86_64-390.132-no-compat32/kernel/nvidia/.tmp_nv-chrdev.o /tmp/B.JfsCO7/BUILD/NVIDIA-Linux-x86_64-390.132-no-compat32/kernel/nvidia/nv-chrdev.o; rm -f /tmp/B.JfsCO7/BUILD/NVIDIA-Linux-x86_64-390.132-no-compat32/kernel/nvidia/.tmp_nv-chrdev.ver; fi x86_64-pld-linux-gcc -Wp,-MD,/tmp/B.JfsCO7/BUILD/NVIDIA-Linux-x86_64-390.132-no-compat32/kernel/nvidia/.nv-instance.o.d -nostdinc -isystem /usr/lib64/gcc/x86_64-pld-linux/10.1.0/include -I./arch/x86/include -I./arch/x86/include/generated -I./include -I./arch/x86/include/uapi -I./arch/x86/include/generated/uapi -I./include/uapi -I./include/generated/uapi -include ./include/linux/kconfig.h -include ./include/linux/compiler_types.h -D__KERNEL__ -Wall -Wundef -Werror=strict-prototypes -Wno-trigraphs -fno-strict-aliasing -fno-common -fshort-wchar -fno-PIE -Werror=implicit-function-declaration -Werror=implicit-int -Wno-format-security -std=gnu89 -mno-sse -mno-mmx -mno-sse2 -mno-3dnow -mno-avx -m64 -falign-jumps=1 -falign-loops=1 -mno-80387 -mno-fp-ret-in-387 -mpreferred-stack-boundary=3 -mskip-rax-setup -mtune=generic -mno-red-zone -mcmodel=kernel -DCONFIG_X86_X32_ABI -Wno-sign-compare -fno-asynchronous-unwind-tables -mindirect-branch=thunk-extern -mindirect-branch-register -fno-jump-tables -fno-delete-null-pointer-checks -Wno-frame-address -Wno-format-truncation -Wno-format-overflow -Wno-address-of-packed-member -O2 -fno-allow-store-data-races -fplugin=./scripts/gcc-plugins/structleak_plugin.so -fplugin=./scripts/gcc-plugins/randomize_layout_plugin.so -fplugin=./scripts/gcc-plugins/stackleak_plugin.so -fplugin-arg-structleak_plugin-byref-all -DSTRUCTLEAK_PLUGIN -DRANDSTRUCT_PLUGIN -fplugin-arg-randomize_layout_plugin-performance-mode -DSTACKLEAK_PLUGIN -fplugin-arg-stackleak_plugin-track-min-size=100 -Wframe-larger-than=2048 -fstack-protector-strong -Wno-unused-but-set-variable -Wimplicit-fallthrough -Wno-unused-const-variable -fno-var-tracking-assignments -gsplit-dwarf -gdwarf-4 -pg -mrecord-mcount -mfentry -DCC_USING_FENTRY -flive-patching=inline-clone -Wdeclaration-after-statement -Wvla -Wno-pointer-sign -Wno-stringop-truncation -Wno-zero-length-bounds -Wno-array-bounds -Wno-stringop-overflow -Wno-restrict -Wno-maybe-uninitialized -fno-strict-overflow -fno-merge-all-constants -fmerge-constants -fno-stack-check -fconserve-stack -Werror=date-time -Werror=incompatible-pointer-types -Werror=designated-init -fmacro-prefix-map=./= -fcf-protection=none -Wno-packed-not-aligned -I/tmp/B.JfsCO7/BUILD/NVIDIA-Linux-x86_64-390.132-no-compat32/kernel/common/inc -I/tmp/B.JfsCO7/BUILD/NVIDIA-Linux-x86_64-390.132-no-compat32/kernel -Wall -MD -Wsign-compare -Wno-cast-qual -Wno-error -D__KERNEL__ -DMODULE -DNVRM -DNV_VERSION_STRING=\"390.132\" -Wno-unused-function -Wuninitialized -fno-strict-aliasing -mno-red-zone -mcmodel=kernel -DNV_UVM_ENABLE -Wno-sign-compare -Wno-format-extra-args -Werror=undef -DNV_SPECTRE_V2=0 -I/tmp/B.JfsCO7/BUILD/NVIDIA-Linux-x86_64-390.132-no-compat32/kernel/nvidia -DNV_BUILD_MODULE_INSTANCES=0 -DNVIDIA_UNDEF_LEGACY_BIT_MACROS -UDEBUG -U_DEBUG -DNDEBUG -DMODULE -DKBUILD_BASENAME='"nv_instance"' -DKBUILD_MODNAME='"nvidia"' -c -o /tmp/B.JfsCO7/BUILD/NVIDIA-Linux-x86_64-390.132-no-compat32/kernel/nvidia/nv-instance.o /tmp/B.JfsCO7/BUILD/NVIDIA-Linux-x86_64-390.132-no-compat32/kernel/nvidia/nv-instance.c ./tools/objtool/objtool orc generate --module --no-fp --retpoline --uaccess /tmp/B.JfsCO7/BUILD/NVIDIA-Linux-x86_64-390.132-no-compat32/kernel/nvidia/nv-instance.o if objdump -h /tmp/B.JfsCO7/BUILD/NVIDIA-Linux-x86_64-390.132-no-compat32/kernel/nvidia/nv-instance.o | grep -q __ksymtab; then x86_64-pld-linux-gcc -E -D__GENKSYMS__ -Wp,-MD,/tmp/B.JfsCO7/BUILD/NVIDIA-Linux-x86_64-390.132-no-compat32/kernel/nvidia/.nv-instance.o.d -nostdinc -isystem /usr/lib64/gcc/x86_64-pld-linux/10.1.0/include -I./arch/x86/include -I./arch/x86/include/generated -I./include -I./arch/x86/include/uapi -I./arch/x86/include/generated/uapi -I./include/uapi -I./include/generated/uapi -include ./include/linux/kconfig.h -include ./include/linux/compiler_types.h -D__KERNEL__ -Wall -Wundef -Werror=strict-prototypes -Wno-trigraphs -fno-strict-aliasing -fno-common -fshort-wchar -fno-PIE -Werror=implicit-function-declaration -Werror=implicit-int -Wno-format-security -std=gnu89 -mno-sse -mno-mmx -mno-sse2 -mno-3dnow -mno-avx -m64 -falign-jumps=1 -falign-loops=1 -mno-80387 -mno-fp-ret-in-387 -mpreferred-stack-boundary=3 -mskip-rax-setup -mtune=generic -mno-red-zone -mcmodel=kernel -DCONFIG_X86_X32_ABI -Wno-sign-compare -fno-asynchronous-unwind-tables -mindirect-branch=thunk-extern -mindirect-branch-register -fno-jump-tables -fno-delete-null-pointer-checks -Wno-frame-address -Wno-format-truncation -Wno-format-overflow -Wno-address-of-packed-member -O2 -fno-allow-store-data-races -fplugin=./scripts/gcc-plugins/structleak_plugin.so -fplugin=./scripts/gcc-plugins/randomize_layout_plugin.so -fplugin=./scripts/gcc-plugins/stackleak_plugin.so -fplugin-arg-structleak_plugin-byref-all -DSTRUCTLEAK_PLUGIN -DRANDSTRUCT_PLUGIN -fplugin-arg-randomize_layout_plugin-performance-mode -DSTACKLEAK_PLUGIN -fplugin-arg-stackleak_plugin-track-min-size=100 -Wframe-larger-than=2048 -fstack-protector-strong -Wno-unused-but-set-variable -Wimplicit-fallthrough -Wno-unused-const-variable -fno-var-tracking-assignments -gsplit-dwarf -gdwarf-4 -pg -mrecord-mcount -mfentry -DCC_USING_FENTRY -flive-patching=inline-clone -Wdeclaration-after-statement -Wvla -Wno-pointer-sign -Wno-stringop-truncation -Wno-zero-length-bounds -Wno-array-bounds -Wno-stringop-overflow -Wno-restrict -Wno-maybe-uninitialized -fno-strict-overflow -fno-merge-all-constants -fmerge-constants -fno-stack-check -fconserve-stack -Werror=date-time -Werror=incompatible-pointer-types -Werror=designated-init -fmacro-prefix-map=./= -fcf-protection=none -Wno-packed-not-aligned -I/tmp/B.JfsCO7/BUILD/NVIDIA-Linux-x86_64-390.132-no-compat32/kernel/common/inc -I/tmp/B.JfsCO7/BUILD/NVIDIA-Linux-x86_64-390.132-no-compat32/kernel -Wall -MD -Wsign-compare -Wno-cast-qual -Wno-error -D__KERNEL__ -DMODULE -DNVRM -DNV_VERSION_STRING=\"390.132\" -Wno-unused-function -Wuninitialized -fno-strict-aliasing -mno-red-zone -mcmodel=kernel -DNV_UVM_ENABLE -Wno-sign-compare -Wno-format-extra-args -Werror=undef -DNV_SPECTRE_V2=0 -I/tmp/B.JfsCO7/BUILD/NVIDIA-Linux-x86_64-390.132-no-compat32/kernel/nvidia -DNV_BUILD_MODULE_INSTANCES=0 -DNVIDIA_UNDEF_LEGACY_BIT_MACROS -UDEBUG -U_DEBUG -DNDEBUG -DMODULE -DKBUILD_BASENAME='"nv_instance"' -DKBUILD_MODNAME='"nvidia"' /tmp/B.JfsCO7/BUILD/NVIDIA-Linux-x86_64-390.132-no-compat32/kernel/nvidia/nv-instance.c | scripts/genksyms/genksyms -r /dev/null > /tmp/B.JfsCO7/BUILD/NVIDIA-Linux-x86_64-390.132-no-compat32/kernel/nvidia/.tmp_nv-instance.ver; ld -m elf_x86_64 -z max-page-size=0x200000 -r -o /tmp/B.JfsCO7/BUILD/NVIDIA-Linux-x86_64-390.132-no-compat32/kernel/nvidia/.tmp_nv-instance.o /tmp/B.JfsCO7/BUILD/NVIDIA-Linux-x86_64-390.132-no-compat32/kernel/nvidia/nv-instance.o -T /tmp/B.JfsCO7/BUILD/NVIDIA-Linux-x86_64-390.132-no-compat32/kernel/nvidia/.tmp_nv-instance.ver; mv -f /tmp/B.JfsCO7/BUILD/NVIDIA-Linux-x86_64-390.132-no-compat32/kernel/nvidia/.tmp_nv-instance.o /tmp/B.JfsCO7/BUILD/NVIDIA-Linux-x86_64-390.132-no-compat32/kernel/nvidia/nv-instance.o; rm -f /tmp/B.JfsCO7/BUILD/NVIDIA-Linux-x86_64-390.132-no-compat32/kernel/nvidia/.tmp_nv-instance.ver; fi x86_64-pld-linux-gcc -Wp,-MD,/tmp/B.JfsCO7/BUILD/NVIDIA-Linux-x86_64-390.132-no-compat32/kernel/nvidia/.nv-gvi.o.d -nostdinc -isystem /usr/lib64/gcc/x86_64-pld-linux/10.1.0/include -I./arch/x86/include -I./arch/x86/include/generated -I./include -I./arch/x86/include/uapi -I./arch/x86/include/generated/uapi -I./include/uapi -I./include/generated/uapi -include ./include/linux/kconfig.h -include ./include/linux/compiler_types.h -D__KERNEL__ -Wall -Wundef -Werror=strict-prototypes -Wno-trigraphs -fno-strict-aliasing -fno-common -fshort-wchar -fno-PIE -Werror=implicit-function-declaration -Werror=implicit-int -Wno-format-security -std=gnu89 -mno-sse -mno-mmx -mno-sse2 -mno-3dnow -mno-avx -m64 -falign-jumps=1 -falign-loops=1 -mno-80387 -mno-fp-ret-in-387 -mpreferred-stack-boundary=3 -mskip-rax-setup -mtune=generic -mno-red-zone -mcmodel=kernel -DCONFIG_X86_X32_ABI -Wno-sign-compare -fno-asynchronous-unwind-tables -mindirect-branch=thunk-extern -mindirect-branch-register -fno-jump-tables -fno-delete-null-pointer-checks -Wno-frame-address -Wno-format-truncation -Wno-format-overflow -Wno-address-of-packed-member -O2 -fno-allow-store-data-races -fplugin=./scripts/gcc-plugins/structleak_plugin.so -fplugin=./scripts/gcc-plugins/randomize_layout_plugin.so -fplugin=./scripts/gcc-plugins/stackleak_plugin.so -fplugin-arg-structleak_plugin-byref-all -DSTRUCTLEAK_PLUGIN -DRANDSTRUCT_PLUGIN -fplugin-arg-randomize_layout_plugin-performance-mode -DSTACKLEAK_PLUGIN -fplugin-arg-stackleak_plugin-track-min-size=100 -Wframe-larger-than=2048 -fstack-protector-strong -Wno-unused-but-set-variable -Wimplicit-fallthrough -Wno-unused-const-variable -fno-var-tracking-assignments -gsplit-dwarf -gdwarf-4 -pg -mrecord-mcount -mfentry -DCC_USING_FENTRY -flive-patching=inline-clone -Wdeclaration-after-statement -Wvla -Wno-pointer-sign -Wno-stringop-truncation -Wno-zero-length-bounds -Wno-array-bounds -Wno-stringop-overflow -Wno-restrict -Wno-maybe-uninitialized -fno-strict-overflow -fno-merge-all-constants -fmerge-constants -fno-stack-check -fconserve-stack -Werror=date-time -Werror=incompatible-pointer-types -Werror=designated-init -fmacro-prefix-map=./= -fcf-protection=none -Wno-packed-not-aligned -I/tmp/B.JfsCO7/BUILD/NVIDIA-Linux-x86_64-390.132-no-compat32/kernel/common/inc -I/tmp/B.JfsCO7/BUILD/NVIDIA-Linux-x86_64-390.132-no-compat32/kernel -Wall -MD -Wsign-compare -Wno-cast-qual -Wno-error -D__KERNEL__ -DMODULE -DNVRM -DNV_VERSION_STRING=\"390.132\" -Wno-unused-function -Wuninitialized -fno-strict-aliasing -mno-red-zone -mcmodel=kernel -DNV_UVM_ENABLE -Wno-sign-compare -Wno-format-extra-args -Werror=undef -DNV_SPECTRE_V2=0 -I/tmp/B.JfsCO7/BUILD/NVIDIA-Linux-x86_64-390.132-no-compat32/kernel/nvidia -DNV_BUILD_MODULE_INSTANCES=0 -DNVIDIA_UNDEF_LEGACY_BIT_MACROS -UDEBUG -U_DEBUG -DNDEBUG -DMODULE -DKBUILD_BASENAME='"nv_gvi"' -DKBUILD_MODNAME='"nvidia"' -c -o /tmp/B.JfsCO7/BUILD/NVIDIA-Linux-x86_64-390.132-no-compat32/kernel/nvidia/nv-gvi.o /tmp/B.JfsCO7/BUILD/NVIDIA-Linux-x86_64-390.132-no-compat32/kernel/nvidia/nv-gvi.c ./tools/objtool/objtool orc generate --module --no-fp --retpoline --uaccess /tmp/B.JfsCO7/BUILD/NVIDIA-Linux-x86_64-390.132-no-compat32/kernel/nvidia/nv-gvi.o if objdump -h /tmp/B.JfsCO7/BUILD/NVIDIA-Linux-x86_64-390.132-no-compat32/kernel/nvidia/nv-gvi.o | grep -q __ksymtab; then x86_64-pld-linux-gcc -E -D__GENKSYMS__ -Wp,-MD,/tmp/B.JfsCO7/BUILD/NVIDIA-Linux-x86_64-390.132-no-compat32/kernel/nvidia/.nv-gvi.o.d -nostdinc -isystem /usr/lib64/gcc/x86_64-pld-linux/10.1.0/include -I./arch/x86/include -I./arch/x86/include/generated -I./include -I./arch/x86/include/uapi -I./arch/x86/include/generated/uapi -I./include/uapi -I./include/generated/uapi -include ./include/linux/kconfig.h -include ./include/linux/compiler_types.h -D__KERNEL__ -Wall -Wundef -Werror=strict-prototypes -Wno-trigraphs -fno-strict-aliasing -fno-common -fshort-wchar -fno-PIE -Werror=implicit-function-declaration -Werror=implicit-int -Wno-format-security -std=gnu89 -mno-sse -mno-mmx -mno-sse2 -mno-3dnow -mno-avx -m64 -falign-jumps=1 -falign-loops=1 -mno-80387 -mno-fp-ret-in-387 -mpreferred-stack-boundary=3 -mskip-rax-setup -mtune=generic -mno-red-zone -mcmodel=kernel -DCONFIG_X86_X32_ABI -Wno-sign-compare -fno-asynchronous-unwind-tables -mindirect-branch=thunk-extern -mindirect-branch-register -fno-jump-tables -fno-delete-null-pointer-checks -Wno-frame-address -Wno-format-truncation -Wno-format-overflow -Wno-address-of-packed-member -O2 -fno-allow-store-data-races -fplugin=./scripts/gcc-plugins/structleak_plugin.so -fplugin=./scripts/gcc-plugins/randomize_layout_plugin.so -fplugin=./scripts/gcc-plugins/stackleak_plugin.so -fplugin-arg-structleak_plugin-byref-all -DSTRUCTLEAK_PLUGIN -DRANDSTRUCT_PLUGIN -fplugin-arg-randomize_layout_plugin-performance-mode -DSTACKLEAK_PLUGIN -fplugin-arg-stackleak_plugin-track-min-size=100 -Wframe-larger-than=2048 -fstack-protector-strong -Wno-unused-but-set-variable -Wimplicit-fallthrough -Wno-unused-const-variable -fno-var-tracking-assignments -gsplit-dwarf -gdwarf-4 -pg -mrecord-mcount -mfentry -DCC_USING_FENTRY -flive-patching=inline-clone -Wdeclaration-after-statement -Wvla -Wno-pointer-sign -Wno-stringop-truncation -Wno-zero-length-bounds -Wno-array-bounds -Wno-stringop-overflow -Wno-restrict -Wno-maybe-uninitialized -fno-strict-overflow -fno-merge-all-constants -fmerge-constants -fno-stack-check -fconserve-stack -Werror=date-time -Werror=incompatible-pointer-types -Werror=designated-init -fmacro-prefix-map=./= -fcf-protection=none -Wno-packed-not-aligned -I/tmp/B.JfsCO7/BUILD/NVIDIA-Linux-x86_64-390.132-no-compat32/kernel/common/inc -I/tmp/B.JfsCO7/BUILD/NVIDIA-Linux-x86_64-390.132-no-compat32/kernel -Wall -MD -Wsign-compare -Wno-cast-qual -Wno-error -D__KERNEL__ -DMODULE -DNVRM -DNV_VERSION_STRING=\"390.132\" -Wno-unused-function -Wuninitialized -fno-strict-aliasing -mno-red-zone -mcmodel=kernel -DNV_UVM_ENABLE -Wno-sign-compare -Wno-format-extra-args -Werror=undef -DNV_SPECTRE_V2=0 -I/tmp/B.JfsCO7/BUILD/NVIDIA-Linux-x86_64-390.132-no-compat32/kernel/nvidia -DNV_BUILD_MODULE_INSTANCES=0 -DNVIDIA_UNDEF_LEGACY_BIT_MACROS -UDEBUG -U_DEBUG -DNDEBUG -DMODULE -DKBUILD_BASENAME='"nv_gvi"' -DKBUILD_MODNAME='"nvidia"' /tmp/B.JfsCO7/BUILD/NVIDIA-Linux-x86_64-390.132-no-compat32/kernel/nvidia/nv-gvi.c | scripts/genksyms/genksyms -r /dev/null > /tmp/B.JfsCO7/BUILD/NVIDIA-Linux-x86_64-390.132-no-compat32/kernel/nvidia/.tmp_nv-gvi.ver; ld -m elf_x86_64 -z max-page-size=0x200000 -r -o /tmp/B.JfsCO7/BUILD/NVIDIA-Linux-x86_64-390.132-no-compat32/kernel/nvidia/.tmp_nv-gvi.o /tmp/B.JfsCO7/BUILD/NVIDIA-Linux-x86_64-390.132-no-compat32/kernel/nvidia/nv-gvi.o -T /tmp/B.JfsCO7/BUILD/NVIDIA-Linux-x86_64-390.132-no-compat32/kernel/nvidia/.tmp_nv-gvi.ver; mv -f /tmp/B.JfsCO7/BUILD/NVIDIA-Linux-x86_64-390.132-no-compat32/kernel/nvidia/.tmp_nv-gvi.o /tmp/B.JfsCO7/BUILD/NVIDIA-Linux-x86_64-390.132-no-compat32/kernel/nvidia/nv-gvi.o; rm -f /tmp/B.JfsCO7/BUILD/NVIDIA-Linux-x86_64-390.132-no-compat32/kernel/nvidia/.tmp_nv-gvi.ver; fi x86_64-pld-linux-gcc -Wp,-MD,/tmp/B.JfsCO7/BUILD/NVIDIA-Linux-x86_64-390.132-no-compat32/kernel/nvidia/.nv-dma.o.d -nostdinc -isystem /usr/lib64/gcc/x86_64-pld-linux/10.1.0/include -I./arch/x86/include -I./arch/x86/include/generated -I./include -I./arch/x86/include/uapi -I./arch/x86/include/generated/uapi -I./include/uapi -I./include/generated/uapi -include ./include/linux/kconfig.h -include ./include/linux/compiler_types.h -D__KERNEL__ -Wall -Wundef -Werror=strict-prototypes -Wno-trigraphs -fno-strict-aliasing -fno-common -fshort-wchar -fno-PIE -Werror=implicit-function-declaration -Werror=implicit-int -Wno-format-security -std=gnu89 -mno-sse -mno-mmx -mno-sse2 -mno-3dnow -mno-avx -m64 -falign-jumps=1 -falign-loops=1 -mno-80387 -mno-fp-ret-in-387 -mpreferred-stack-boundary=3 -mskip-rax-setup -mtune=generic -mno-red-zone -mcmodel=kernel -DCONFIG_X86_X32_ABI -Wno-sign-compare -fno-asynchronous-unwind-tables -mindirect-branch=thunk-extern -mindirect-branch-register -fno-jump-tables -fno-delete-null-pointer-checks -Wno-frame-address -Wno-format-truncation -Wno-format-overflow -Wno-address-of-packed-member -O2 -fno-allow-store-data-races -fplugin=./scripts/gcc-plugins/structleak_plugin.so -fplugin=./scripts/gcc-plugins/randomize_layout_plugin.so -fplugin=./scripts/gcc-plugins/stackleak_plugin.so -fplugin-arg-structleak_plugin-byref-all -DSTRUCTLEAK_PLUGIN -DRANDSTRUCT_PLUGIN -fplugin-arg-randomize_layout_plugin-performance-mode -DSTACKLEAK_PLUGIN -fplugin-arg-stackleak_plugin-track-min-size=100 -Wframe-larger-than=2048 -fstack-protector-strong -Wno-unused-but-set-variable -Wimplicit-fallthrough -Wno-unused-const-variable -fno-var-tracking-assignments -gsplit-dwarf -gdwarf-4 -pg -mrecord-mcount -mfentry -DCC_USING_FENTRY -flive-patching=inline-clone -Wdeclaration-after-statement -Wvla -Wno-pointer-sign -Wno-stringop-truncation -Wno-zero-length-bounds -Wno-array-bounds -Wno-stringop-overflow -Wno-restrict -Wno-maybe-uninitialized -fno-strict-overflow -fno-merge-all-constants -fmerge-constants -fno-stack-check -fconserve-stack -Werror=date-time -Werror=incompatible-pointer-types -Werror=designated-init -fmacro-prefix-map=./= -fcf-protection=none -Wno-packed-not-aligned -I/tmp/B.JfsCO7/BUILD/NVIDIA-Linux-x86_64-390.132-no-compat32/kernel/common/inc -I/tmp/B.JfsCO7/BUILD/NVIDIA-Linux-x86_64-390.132-no-compat32/kernel -Wall -MD -Wsign-compare -Wno-cast-qual -Wno-error -D__KERNEL__ -DMODULE -DNVRM -DNV_VERSION_STRING=\"390.132\" -Wno-unused-function -Wuninitialized -fno-strict-aliasing -mno-red-zone -mcmodel=kernel -DNV_UVM_ENABLE -Wno-sign-compare -Wno-format-extra-args -Werror=undef -DNV_SPECTRE_V2=0 -I/tmp/B.JfsCO7/BUILD/NVIDIA-Linux-x86_64-390.132-no-compat32/kernel/nvidia -DNV_BUILD_MODULE_INSTANCES=0 -DNVIDIA_UNDEF_LEGACY_BIT_MACROS -UDEBUG -U_DEBUG -DNDEBUG -DMODULE -DKBUILD_BASENAME='"nv_dma"' -DKBUILD_MODNAME='"nvidia"' -c -o /tmp/B.JfsCO7/BUILD/NVIDIA-Linux-x86_64-390.132-no-compat32/kernel/nvidia/nv-dma.o /tmp/B.JfsCO7/BUILD/NVIDIA-Linux-x86_64-390.132-no-compat32/kernel/nvidia/nv-dma.c ./tools/objtool/objtool orc generate --module --no-fp --retpoline --uaccess /tmp/B.JfsCO7/BUILD/NVIDIA-Linux-x86_64-390.132-no-compat32/kernel/nvidia/nv-dma.o if objdump -h /tmp/B.JfsCO7/BUILD/NVIDIA-Linux-x86_64-390.132-no-compat32/kernel/nvidia/nv-dma.o | grep -q __ksymtab; then x86_64-pld-linux-gcc -E -D__GENKSYMS__ -Wp,-MD,/tmp/B.JfsCO7/BUILD/NVIDIA-Linux-x86_64-390.132-no-compat32/kernel/nvidia/.nv-dma.o.d -nostdinc -isystem /usr/lib64/gcc/x86_64-pld-linux/10.1.0/include -I./arch/x86/include -I./arch/x86/include/generated -I./include -I./arch/x86/include/uapi -I./arch/x86/include/generated/uapi -I./include/uapi -I./include/generated/uapi -include ./include/linux/kconfig.h -include ./include/linux/compiler_types.h -D__KERNEL__ -Wall -Wundef -Werror=strict-prototypes -Wno-trigraphs -fno-strict-aliasing -fno-common -fshort-wchar -fno-PIE -Werror=implicit-function-declaration -Werror=implicit-int -Wno-format-security -std=gnu89 -mno-sse -mno-mmx -mno-sse2 -mno-3dnow -mno-avx -m64 -falign-jumps=1 -falign-loops=1 -mno-80387 -mno-fp-ret-in-387 -mpreferred-stack-boundary=3 -mskip-rax-setup -mtune=generic -mno-red-zone -mcmodel=kernel -DCONFIG_X86_X32_ABI -Wno-sign-compare -fno-asynchronous-unwind-tables -mindirect-branch=thunk-extern -mindirect-branch-register -fno-jump-tables -fno-delete-null-pointer-checks -Wno-frame-address -Wno-format-truncation -Wno-format-overflow -Wno-address-of-packed-member -O2 -fno-allow-store-data-races -fplugin=./scripts/gcc-plugins/structleak_plugin.so -fplugin=./scripts/gcc-plugins/randomize_layout_plugin.so -fplugin=./scripts/gcc-plugins/stackleak_plugin.so -fplugin-arg-structleak_plugin-byref-all -DSTRUCTLEAK_PLUGIN -DRANDSTRUCT_PLUGIN -fplugin-arg-randomize_layout_plugin-performance-mode -DSTACKLEAK_PLUGIN -fplugin-arg-stackleak_plugin-track-min-size=100 -Wframe-larger-than=2048 -fstack-protector-strong -Wno-unused-but-set-variable -Wimplicit-fallthrough -Wno-unused-const-variable -fno-var-tracking-assignments -gsplit-dwarf -gdwarf-4 -pg -mrecord-mcount -mfentry -DCC_USING_FENTRY -flive-patching=inline-clone -Wdeclaration-after-statement -Wvla -Wno-pointer-sign -Wno-stringop-truncation -Wno-zero-length-bounds -Wno-array-bounds -Wno-stringop-overflow -Wno-restrict -Wno-maybe-uninitialized -fno-strict-overflow -fno-merge-all-constants -fmerge-constants -fno-stack-check -fconserve-stack -Werror=date-time -Werror=incompatible-pointer-types -Werror=designated-init -fmacro-prefix-map=./= -fcf-protection=none -Wno-packed-not-aligned -I/tmp/B.JfsCO7/BUILD/NVIDIA-Linux-x86_64-390.132-no-compat32/kernel/common/inc -I/tmp/B.JfsCO7/BUILD/NVIDIA-Linux-x86_64-390.132-no-compat32/kernel -Wall -MD -Wsign-compare -Wno-cast-qual -Wno-error -D__KERNEL__ -DMODULE -DNVRM -DNV_VERSION_STRING=\"390.132\" -Wno-unused-function -Wuninitialized -fno-strict-aliasing -mno-red-zone -mcmodel=kernel -DNV_UVM_ENABLE -Wno-sign-compare -Wno-format-extra-args -Werror=undef -DNV_SPECTRE_V2=0 -I/tmp/B.JfsCO7/BUILD/NVIDIA-Linux-x86_64-390.132-no-compat32/kernel/nvidia -DNV_BUILD_MODULE_INSTANCES=0 -DNVIDIA_UNDEF_LEGACY_BIT_MACROS -UDEBUG -U_DEBUG -DNDEBUG -DMODULE -DKBUILD_BASENAME='"nv_dma"' -DKBUILD_MODNAME='"nvidia"' /tmp/B.JfsCO7/BUILD/NVIDIA-Linux-x86_64-390.132-no-compat32/kernel/nvidia/nv-dma.c | scripts/genksyms/genksyms -r /dev/null > /tmp/B.JfsCO7/BUILD/NVIDIA-Linux-x86_64-390.132-no-compat32/kernel/nvidia/.tmp_nv-dma.ver; ld -m elf_x86_64 -z max-page-size=0x200000 -r -o /tmp/B.JfsCO7/BUILD/NVIDIA-Linux-x86_64-390.132-no-compat32/kernel/nvidia/.tmp_nv-dma.o /tmp/B.JfsCO7/BUILD/NVIDIA-Linux-x86_64-390.132-no-compat32/kernel/nvidia/nv-dma.o -T /tmp/B.JfsCO7/BUILD/NVIDIA-Linux-x86_64-390.132-no-compat32/kernel/nvidia/.tmp_nv-dma.ver; mv -f /tmp/B.JfsCO7/BUILD/NVIDIA-Linux-x86_64-390.132-no-compat32/kernel/nvidia/.tmp_nv-dma.o /tmp/B.JfsCO7/BUILD/NVIDIA-Linux-x86_64-390.132-no-compat32/kernel/nvidia/nv-dma.o; rm -f /tmp/B.JfsCO7/BUILD/NVIDIA-Linux-x86_64-390.132-no-compat32/kernel/nvidia/.tmp_nv-dma.ver; fi x86_64-pld-linux-gcc -Wp,-MD,/tmp/B.JfsCO7/BUILD/NVIDIA-Linux-x86_64-390.132-no-compat32/kernel/nvidia/.nv-gpu-numa.o.d -nostdinc -isystem /usr/lib64/gcc/x86_64-pld-linux/10.1.0/include -I./arch/x86/include -I./arch/x86/include/generated -I./include -I./arch/x86/include/uapi -I./arch/x86/include/generated/uapi -I./include/uapi -I./include/generated/uapi -include ./include/linux/kconfig.h -include ./include/linux/compiler_types.h -D__KERNEL__ -Wall -Wundef -Werror=strict-prototypes -Wno-trigraphs -fno-strict-aliasing -fno-common -fshort-wchar -fno-PIE -Werror=implicit-function-declaration -Werror=implicit-int -Wno-format-security -std=gnu89 -mno-sse -mno-mmx -mno-sse2 -mno-3dnow -mno-avx -m64 -falign-jumps=1 -falign-loops=1 -mno-80387 -mno-fp-ret-in-387 -mpreferred-stack-boundary=3 -mskip-rax-setup -mtune=generic -mno-red-zone -mcmodel=kernel -DCONFIG_X86_X32_ABI -Wno-sign-compare -fno-asynchronous-unwind-tables -mindirect-branch=thunk-extern -mindirect-branch-register -fno-jump-tables -fno-delete-null-pointer-checks -Wno-frame-address -Wno-format-truncation -Wno-format-overflow -Wno-address-of-packed-member -O2 -fno-allow-store-data-races -fplugin=./scripts/gcc-plugins/structleak_plugin.so -fplugin=./scripts/gcc-plugins/randomize_layout_plugin.so -fplugin=./scripts/gcc-plugins/stackleak_plugin.so -fplugin-arg-structleak_plugin-byref-all -DSTRUCTLEAK_PLUGIN -DRANDSTRUCT_PLUGIN -fplugin-arg-randomize_layout_plugin-performance-mode -DSTACKLEAK_PLUGIN -fplugin-arg-stackleak_plugin-track-min-size=100 -Wframe-larger-than=2048 -fstack-protector-strong -Wno-unused-but-set-variable -Wimplicit-fallthrough -Wno-unused-const-variable -fno-var-tracking-assignments -gsplit-dwarf -gdwarf-4 -pg -mrecord-mcount -mfentry -DCC_USING_FENTRY -flive-patching=inline-clone -Wdeclaration-after-statement -Wvla -Wno-pointer-sign -Wno-stringop-truncation -Wno-zero-length-bounds -Wno-array-bounds -Wno-stringop-overflow -Wno-restrict -Wno-maybe-uninitialized -fno-strict-overflow -fno-merge-all-constants -fmerge-constants -fno-stack-check -fconserve-stack -Werror=date-time -Werror=incompatible-pointer-types -Werror=designated-init -fmacro-prefix-map=./= -fcf-protection=none -Wno-packed-not-aligned -I/tmp/B.JfsCO7/BUILD/NVIDIA-Linux-x86_64-390.132-no-compat32/kernel/common/inc -I/tmp/B.JfsCO7/BUILD/NVIDIA-Linux-x86_64-390.132-no-compat32/kernel -Wall -MD -Wsign-compare -Wno-cast-qual -Wno-error -D__KERNEL__ -DMODULE -DNVRM -DNV_VERSION_STRING=\"390.132\" -Wno-unused-function -Wuninitialized -fno-strict-aliasing -mno-red-zone -mcmodel=kernel -DNV_UVM_ENABLE -Wno-sign-compare -Wno-format-extra-args -Werror=undef -DNV_SPECTRE_V2=0 -I/tmp/B.JfsCO7/BUILD/NVIDIA-Linux-x86_64-390.132-no-compat32/kernel/nvidia -DNV_BUILD_MODULE_INSTANCES=0 -DNVIDIA_UNDEF_LEGACY_BIT_MACROS -UDEBUG -U_DEBUG -DNDEBUG -DMODULE -DKBUILD_BASENAME='"nv_gpu_numa"' -DKBUILD_MODNAME='"nvidia"' -c -o /tmp/B.JfsCO7/BUILD/NVIDIA-Linux-x86_64-390.132-no-compat32/kernel/nvidia/nv-gpu-numa.o /tmp/B.JfsCO7/BUILD/NVIDIA-Linux-x86_64-390.132-no-compat32/kernel/nvidia/nv-gpu-numa.c ./tools/objtool/objtool orc generate --module --no-fp --retpoline --uaccess /tmp/B.JfsCO7/BUILD/NVIDIA-Linux-x86_64-390.132-no-compat32/kernel/nvidia/nv-gpu-numa.o if objdump -h /tmp/B.JfsCO7/BUILD/NVIDIA-Linux-x86_64-390.132-no-compat32/kernel/nvidia/nv-gpu-numa.o | grep -q __ksymtab; then x86_64-pld-linux-gcc -E -D__GENKSYMS__ -Wp,-MD,/tmp/B.JfsCO7/BUILD/NVIDIA-Linux-x86_64-390.132-no-compat32/kernel/nvidia/.nv-gpu-numa.o.d -nostdinc -isystem /usr/lib64/gcc/x86_64-pld-linux/10.1.0/include -I./arch/x86/include -I./arch/x86/include/generated -I./include -I./arch/x86/include/uapi -I./arch/x86/include/generated/uapi -I./include/uapi -I./include/generated/uapi -include ./include/linux/kconfig.h -include ./include/linux/compiler_types.h -D__KERNEL__ -Wall -Wundef -Werror=strict-prototypes -Wno-trigraphs -fno-strict-aliasing -fno-common -fshort-wchar -fno-PIE -Werror=implicit-function-declaration -Werror=implicit-int -Wno-format-security -std=gnu89 -mno-sse -mno-mmx -mno-sse2 -mno-3dnow -mno-avx -m64 -falign-jumps=1 -falign-loops=1 -mno-80387 -mno-fp-ret-in-387 -mpreferred-stack-boundary=3 -mskip-rax-setup -mtune=generic -mno-red-zone -mcmodel=kernel -DCONFIG_X86_X32_ABI -Wno-sign-compare -fno-asynchronous-unwind-tables -mindirect-branch=thunk-extern -mindirect-branch-register -fno-jump-tables -fno-delete-null-pointer-checks -Wno-frame-address -Wno-format-truncation -Wno-format-overflow -Wno-address-of-packed-member -O2 -fno-allow-store-data-races -fplugin=./scripts/gcc-plugins/structleak_plugin.so -fplugin=./scripts/gcc-plugins/randomize_layout_plugin.so -fplugin=./scripts/gcc-plugins/stackleak_plugin.so -fplugin-arg-structleak_plugin-byref-all -DSTRUCTLEAK_PLUGIN -DRANDSTRUCT_PLUGIN -fplugin-arg-randomize_layout_plugin-performance-mode -DSTACKLEAK_PLUGIN -fplugin-arg-stackleak_plugin-track-min-size=100 -Wframe-larger-than=2048 -fstack-protector-strong -Wno-unused-but-set-variable -Wimplicit-fallthrough -Wno-unused-const-variable -fno-var-tracking-assignments -gsplit-dwarf -gdwarf-4 -pg -mrecord-mcount -mfentry -DCC_USING_FENTRY -flive-patching=inline-clone -Wdeclaration-after-statement -Wvla -Wno-pointer-sign -Wno-stringop-truncation -Wno-zero-length-bounds -Wno-array-bounds -Wno-stringop-overflow -Wno-restrict -Wno-maybe-uninitialized -fno-strict-overflow -fno-merge-all-constants -fmerge-constants -fno-stack-check -fconserve-stack -Werror=date-time -Werror=incompatible-pointer-types -Werror=designated-init -fmacro-prefix-map=./= -fcf-protection=none -Wno-packed-not-aligned -I/tmp/B.JfsCO7/BUILD/NVIDIA-Linux-x86_64-390.132-no-compat32/kernel/common/inc -I/tmp/B.JfsCO7/BUILD/NVIDIA-Linux-x86_64-390.132-no-compat32/kernel -Wall -MD -Wsign-compare -Wno-cast-qual -Wno-error -D__KERNEL__ -DMODULE -DNVRM -DNV_VERSION_STRING=\"390.132\" -Wno-unused-function -Wuninitialized -fno-strict-aliasing -mno-red-zone -mcmodel=kernel -DNV_UVM_ENABLE -Wno-sign-compare -Wno-format-extra-args -Werror=undef -DNV_SPECTRE_V2=0 -I/tmp/B.JfsCO7/BUILD/NVIDIA-Linux-x86_64-390.132-no-compat32/kernel/nvidia -DNV_BUILD_MODULE_INSTANCES=0 -DNVIDIA_UNDEF_LEGACY_BIT_MACROS -UDEBUG -U_DEBUG -DNDEBUG -DMODULE -DKBUILD_BASENAME='"nv_gpu_numa"' -DKBUILD_MODNAME='"nvidia"' /tmp/B.JfsCO7/BUILD/NVIDIA-Linux-x86_64-390.132-no-compat32/kernel/nvidia/nv-gpu-numa.c | scripts/genksyms/genksyms -r /dev/null > /tmp/B.JfsCO7/BUILD/NVIDIA-Linux-x86_64-390.132-no-compat32/kernel/nvidia/.tmp_nv-gpu-numa.ver; ld -m elf_x86_64 -z max-page-size=0x200000 -r -o /tmp/B.JfsCO7/BUILD/NVIDIA-Linux-x86_64-390.132-no-compat32/kernel/nvidia/.tmp_nv-gpu-numa.o /tmp/B.JfsCO7/BUILD/NVIDIA-Linux-x86_64-390.132-no-compat32/kernel/nvidia/nv-gpu-numa.o -T /tmp/B.JfsCO7/BUILD/NVIDIA-Linux-x86_64-390.132-no-compat32/kernel/nvidia/.tmp_nv-gpu-numa.ver; mv -f /tmp/B.JfsCO7/BUILD/NVIDIA-Linux-x86_64-390.132-no-compat32/kernel/nvidia/.tmp_nv-gpu-numa.o /tmp/B.JfsCO7/BUILD/NVIDIA-Linux-x86_64-390.132-no-compat32/kernel/nvidia/nv-gpu-numa.o; rm -f /tmp/B.JfsCO7/BUILD/NVIDIA-Linux-x86_64-390.132-no-compat32/kernel/nvidia/.tmp_nv-gpu-numa.ver; fi x86_64-pld-linux-gcc -Wp,-MD,/tmp/B.JfsCO7/BUILD/NVIDIA-Linux-x86_64-390.132-no-compat32/kernel/nvidia/.nv-acpi.o.d -nostdinc -isystem /usr/lib64/gcc/x86_64-pld-linux/10.1.0/include -I./arch/x86/include -I./arch/x86/include/generated -I./include -I./arch/x86/include/uapi -I./arch/x86/include/generated/uapi -I./include/uapi -I./include/generated/uapi -include ./include/linux/kconfig.h -include ./include/linux/compiler_types.h -D__KERNEL__ -Wall -Wundef -Werror=strict-prototypes -Wno-trigraphs -fno-strict-aliasing -fno-common -fshort-wchar -fno-PIE -Werror=implicit-function-declaration -Werror=implicit-int -Wno-format-security -std=gnu89 -mno-sse -mno-mmx -mno-sse2 -mno-3dnow -mno-avx -m64 -falign-jumps=1 -falign-loops=1 -mno-80387 -mno-fp-ret-in-387 -mpreferred-stack-boundary=3 -mskip-rax-setup -mtune=generic -mno-red-zone -mcmodel=kernel -DCONFIG_X86_X32_ABI -Wno-sign-compare -fno-asynchronous-unwind-tables -mindirect-branch=thunk-extern -mindirect-branch-register -fno-jump-tables -fno-delete-null-pointer-checks -Wno-frame-address -Wno-format-truncation -Wno-format-overflow -Wno-address-of-packed-member -O2 -fno-allow-store-data-races -fplugin=./scripts/gcc-plugins/structleak_plugin.so -fplugin=./scripts/gcc-plugins/randomize_layout_plugin.so -fplugin=./scripts/gcc-plugins/stackleak_plugin.so -fplugin-arg-structleak_plugin-byref-all -DSTRUCTLEAK_PLUGIN -DRANDSTRUCT_PLUGIN -fplugin-arg-randomize_layout_plugin-performance-mode -DSTACKLEAK_PLUGIN -fplugin-arg-stackleak_plugin-track-min-size=100 -Wframe-larger-than=2048 -fstack-protector-strong -Wno-unused-but-set-variable -Wimplicit-fallthrough -Wno-unused-const-variable -fno-var-tracking-assignments -gsplit-dwarf -gdwarf-4 -pg -mrecord-mcount -mfentry -DCC_USING_FENTRY -flive-patching=inline-clone -Wdeclaration-after-statement -Wvla -Wno-pointer-sign -Wno-stringop-truncation -Wno-zero-length-bounds -Wno-array-bounds -Wno-stringop-overflow -Wno-restrict -Wno-maybe-uninitialized -fno-strict-overflow -fno-merge-all-constants -fmerge-constants -fno-stack-check -fconserve-stack -Werror=date-time -Werror=incompatible-pointer-types -Werror=designated-init -fmacro-prefix-map=./= -fcf-protection=none -Wno-packed-not-aligned -I/tmp/B.JfsCO7/BUILD/NVIDIA-Linux-x86_64-390.132-no-compat32/kernel/common/inc -I/tmp/B.JfsCO7/BUILD/NVIDIA-Linux-x86_64-390.132-no-compat32/kernel -Wall -MD -Wsign-compare -Wno-cast-qual -Wno-error -D__KERNEL__ -DMODULE -DNVRM -DNV_VERSION_STRING=\"390.132\" -Wno-unused-function -Wuninitialized -fno-strict-aliasing -mno-red-zone -mcmodel=kernel -DNV_UVM_ENABLE -Wno-sign-compare -Wno-format-extra-args -Werror=undef -DNV_SPECTRE_V2=0 -I/tmp/B.JfsCO7/BUILD/NVIDIA-Linux-x86_64-390.132-no-compat32/kernel/nvidia -DNV_BUILD_MODULE_INSTANCES=0 -DNVIDIA_UNDEF_LEGACY_BIT_MACROS -UDEBUG -U_DEBUG -DNDEBUG -DMODULE -DKBUILD_BASENAME='"nv_acpi"' -DKBUILD_MODNAME='"nvidia"' -c -o /tmp/B.JfsCO7/BUILD/NVIDIA-Linux-x86_64-390.132-no-compat32/kernel/nvidia/nv-acpi.o /tmp/B.JfsCO7/BUILD/NVIDIA-Linux-x86_64-390.132-no-compat32/kernel/nvidia/nv-acpi.c ./tools/objtool/objtool orc generate --module --no-fp --retpoline --uaccess /tmp/B.JfsCO7/BUILD/NVIDIA-Linux-x86_64-390.132-no-compat32/kernel/nvidia/nv-acpi.o if objdump -h /tmp/B.JfsCO7/BUILD/NVIDIA-Linux-x86_64-390.132-no-compat32/kernel/nvidia/nv-acpi.o | grep -q __ksymtab; then x86_64-pld-linux-gcc -E -D__GENKSYMS__ -Wp,-MD,/tmp/B.JfsCO7/BUILD/NVIDIA-Linux-x86_64-390.132-no-compat32/kernel/nvidia/.nv-acpi.o.d -nostdinc -isystem /usr/lib64/gcc/x86_64-pld-linux/10.1.0/include -I./arch/x86/include -I./arch/x86/include/generated -I./include -I./arch/x86/include/uapi -I./arch/x86/include/generated/uapi -I./include/uapi -I./include/generated/uapi -include ./include/linux/kconfig.h -include ./include/linux/compiler_types.h -D__KERNEL__ -Wall -Wundef -Werror=strict-prototypes -Wno-trigraphs -fno-strict-aliasing -fno-common -fshort-wchar -fno-PIE -Werror=implicit-function-declaration -Werror=implicit-int -Wno-format-security -std=gnu89 -mno-sse -mno-mmx -mno-sse2 -mno-3dnow -mno-avx -m64 -falign-jumps=1 -falign-loops=1 -mno-80387 -mno-fp-ret-in-387 -mpreferred-stack-boundary=3 -mskip-rax-setup -mtune=generic -mno-red-zone -mcmodel=kernel -DCONFIG_X86_X32_ABI -Wno-sign-compare -fno-asynchronous-unwind-tables -mindirect-branch=thunk-extern -mindirect-branch-register -fno-jump-tables -fno-delete-null-pointer-checks -Wno-frame-address -Wno-format-truncation -Wno-format-overflow -Wno-address-of-packed-member -O2 -fno-allow-store-data-races -fplugin=./scripts/gcc-plugins/structleak_plugin.so -fplugin=./scripts/gcc-plugins/randomize_layout_plugin.so -fplugin=./scripts/gcc-plugins/stackleak_plugin.so -fplugin-arg-structleak_plugin-byref-all -DSTRUCTLEAK_PLUGIN -DRANDSTRUCT_PLUGIN -fplugin-arg-randomize_layout_plugin-performance-mode -DSTACKLEAK_PLUGIN -fplugin-arg-stackleak_plugin-track-min-size=100 -Wframe-larger-than=2048 -fstack-protector-strong -Wno-unused-but-set-variable -Wimplicit-fallthrough -Wno-unused-const-variable -fno-var-tracking-assignments -gsplit-dwarf -gdwarf-4 -pg -mrecord-mcount -mfentry -DCC_USING_FENTRY -flive-patching=inline-clone -Wdeclaration-after-statement -Wvla -Wno-pointer-sign -Wno-stringop-truncation -Wno-zero-length-bounds -Wno-array-bounds -Wno-stringop-overflow -Wno-restrict -Wno-maybe-uninitialized -fno-strict-overflow -fno-merge-all-constants -fmerge-constants -fno-stack-check -fconserve-stack -Werror=date-time -Werror=incompatible-pointer-types -Werror=designated-init -fmacro-prefix-map=./= -fcf-protection=none -Wno-packed-not-aligned -I/tmp/B.JfsCO7/BUILD/NVIDIA-Linux-x86_64-390.132-no-compat32/kernel/common/inc -I/tmp/B.JfsCO7/BUILD/NVIDIA-Linux-x86_64-390.132-no-compat32/kernel -Wall -MD -Wsign-compare -Wno-cast-qual -Wno-error -D__KERNEL__ -DMODULE -DNVRM -DNV_VERSION_STRING=\"390.132\" -Wno-unused-function -Wuninitialized -fno-strict-aliasing -mno-red-zone -mcmodel=kernel -DNV_UVM_ENABLE -Wno-sign-compare -Wno-format-extra-args -Werror=undef -DNV_SPECTRE_V2=0 -I/tmp/B.JfsCO7/BUILD/NVIDIA-Linux-x86_64-390.132-no-compat32/kernel/nvidia -DNV_BUILD_MODULE_INSTANCES=0 -DNVIDIA_UNDEF_LEGACY_BIT_MACROS -UDEBUG -U_DEBUG -DNDEBUG -DMODULE -DKBUILD_BASENAME='"nv_acpi"' -DKBUILD_MODNAME='"nvidia"' /tmp/B.JfsCO7/BUILD/NVIDIA-Linux-x86_64-390.132-no-compat32/kernel/nvidia/nv-acpi.c | scripts/genksyms/genksyms -r /dev/null > /tmp/B.JfsCO7/BUILD/NVIDIA-Linux-x86_64-390.132-no-compat32/kernel/nvidia/.tmp_nv-acpi.ver; ld -m elf_x86_64 -z max-page-size=0x200000 -r -o /tmp/B.JfsCO7/BUILD/NVIDIA-Linux-x86_64-390.132-no-compat32/kernel/nvidia/.tmp_nv-acpi.o /tmp/B.JfsCO7/BUILD/NVIDIA-Linux-x86_64-390.132-no-compat32/kernel/nvidia/nv-acpi.o -T /tmp/B.JfsCO7/BUILD/NVIDIA-Linux-x86_64-390.132-no-compat32/kernel/nvidia/.tmp_nv-acpi.ver; mv -f /tmp/B.JfsCO7/BUILD/NVIDIA-Linux-x86_64-390.132-no-compat32/kernel/nvidia/.tmp_nv-acpi.o /tmp/B.JfsCO7/BUILD/NVIDIA-Linux-x86_64-390.132-no-compat32/kernel/nvidia/nv-acpi.o; rm -f /tmp/B.JfsCO7/BUILD/NVIDIA-Linux-x86_64-390.132-no-compat32/kernel/nvidia/.tmp_nv-acpi.ver; fi x86_64-pld-linux-gcc -Wp,-MD,/tmp/B.JfsCO7/BUILD/NVIDIA-Linux-x86_64-390.132-no-compat32/kernel/nvidia/.nv-frontend.o.d -nostdinc -isystem /usr/lib64/gcc/x86_64-pld-linux/10.1.0/include -I./arch/x86/include -I./arch/x86/include/generated -I./include -I./arch/x86/include/uapi -I./arch/x86/include/generated/uapi -I./include/uapi -I./include/generated/uapi -include ./include/linux/kconfig.h -include ./include/linux/compiler_types.h -D__KERNEL__ -Wall -Wundef -Werror=strict-prototypes -Wno-trigraphs -fno-strict-aliasing -fno-common -fshort-wchar -fno-PIE -Werror=implicit-function-declaration -Werror=implicit-int -Wno-format-security -std=gnu89 -mno-sse -mno-mmx -mno-sse2 -mno-3dnow -mno-avx -m64 -falign-jumps=1 -falign-loops=1 -mno-80387 -mno-fp-ret-in-387 -mpreferred-stack-boundary=3 -mskip-rax-setup -mtune=generic -mno-red-zone -mcmodel=kernel -DCONFIG_X86_X32_ABI -Wno-sign-compare -fno-asynchronous-unwind-tables -mindirect-branch=thunk-extern -mindirect-branch-register -fno-jump-tables -fno-delete-null-pointer-checks -Wno-frame-address -Wno-format-truncation -Wno-format-overflow -Wno-address-of-packed-member -O2 -fno-allow-store-data-races -fplugin=./scripts/gcc-plugins/structleak_plugin.so -fplugin=./scripts/gcc-plugins/randomize_layout_plugin.so -fplugin=./scripts/gcc-plugins/stackleak_plugin.so -fplugin-arg-structleak_plugin-byref-all -DSTRUCTLEAK_PLUGIN -DRANDSTRUCT_PLUGIN -fplugin-arg-randomize_layout_plugin-performance-mode -DSTACKLEAK_PLUGIN -fplugin-arg-stackleak_plugin-track-min-size=100 -Wframe-larger-than=2048 -fstack-protector-strong -Wno-unused-but-set-variable -Wimplicit-fallthrough -Wno-unused-const-variable -fno-var-tracking-assignments -gsplit-dwarf -gdwarf-4 -pg -mrecord-mcount -mfentry -DCC_USING_FENTRY -flive-patching=inline-clone -Wdeclaration-after-statement -Wvla -Wno-pointer-sign -Wno-stringop-truncation -Wno-zero-length-bounds -Wno-array-bounds -Wno-stringop-overflow -Wno-restrict -Wno-maybe-uninitialized -fno-strict-overflow -fno-merge-all-constants -fmerge-constants -fno-stack-check -fconserve-stack -Werror=date-time -Werror=incompatible-pointer-types -Werror=designated-init -fmacro-prefix-map=./= -fcf-protection=none -Wno-packed-not-aligned -I/tmp/B.JfsCO7/BUILD/NVIDIA-Linux-x86_64-390.132-no-compat32/kernel/common/inc -I/tmp/B.JfsCO7/BUILD/NVIDIA-Linux-x86_64-390.132-no-compat32/kernel -Wall -MD -Wsign-compare -Wno-cast-qual -Wno-error -D__KERNEL__ -DMODULE -DNVRM -DNV_VERSION_STRING=\"390.132\" -Wno-unused-function -Wuninitialized -fno-strict-aliasing -mno-red-zone -mcmodel=kernel -DNV_UVM_ENABLE -Wno-sign-compare -Wno-format-extra-args -Werror=undef -DNV_SPECTRE_V2=0 -I/tmp/B.JfsCO7/BUILD/NVIDIA-Linux-x86_64-390.132-no-compat32/kernel/nvidia -DNV_BUILD_MODULE_INSTANCES=0 -DNVIDIA_UNDEF_LEGACY_BIT_MACROS -UDEBUG -U_DEBUG -DNDEBUG -DMODULE -DKBUILD_BASENAME='"nv_frontend"' -DKBUILD_MODNAME='"nvidia"' -c -o /tmp/B.JfsCO7/BUILD/NVIDIA-Linux-x86_64-390.132-no-compat32/kernel/nvidia/nv-frontend.o /tmp/B.JfsCO7/BUILD/NVIDIA-Linux-x86_64-390.132-no-compat32/kernel/nvidia/nv-frontend.c ./tools/objtool/objtool orc generate --module --no-fp --retpoline --uaccess /tmp/B.JfsCO7/BUILD/NVIDIA-Linux-x86_64-390.132-no-compat32/kernel/nvidia/nv-frontend.o if objdump -h /tmp/B.JfsCO7/BUILD/NVIDIA-Linux-x86_64-390.132-no-compat32/kernel/nvidia/nv-frontend.o | grep -q __ksymtab; then x86_64-pld-linux-gcc -E -D__GENKSYMS__ -Wp,-MD,/tmp/B.JfsCO7/BUILD/NVIDIA-Linux-x86_64-390.132-no-compat32/kernel/nvidia/.nv-frontend.o.d -nostdinc -isystem /usr/lib64/gcc/x86_64-pld-linux/10.1.0/include -I./arch/x86/include -I./arch/x86/include/generated -I./include -I./arch/x86/include/uapi -I./arch/x86/include/generated/uapi -I./include/uapi -I./include/generated/uapi -include ./include/linux/kconfig.h -include ./include/linux/compiler_types.h -D__KERNEL__ -Wall -Wundef -Werror=strict-prototypes -Wno-trigraphs -fno-strict-aliasing -fno-common -fshort-wchar -fno-PIE -Werror=implicit-function-declaration -Werror=implicit-int -Wno-format-security -std=gnu89 -mno-sse -mno-mmx -mno-sse2 -mno-3dnow -mno-avx -m64 -falign-jumps=1 -falign-loops=1 -mno-80387 -mno-fp-ret-in-387 -mpreferred-stack-boundary=3 -mskip-rax-setup -mtune=generic -mno-red-zone -mcmodel=kernel -DCONFIG_X86_X32_ABI -Wno-sign-compare -fno-asynchronous-unwind-tables -mindirect-branch=thunk-extern -mindirect-branch-register -fno-jump-tables -fno-delete-null-pointer-checks -Wno-frame-address -Wno-format-truncation -Wno-format-overflow -Wno-address-of-packed-member -O2 -fno-allow-store-data-races -fplugin=./scripts/gcc-plugins/structleak_plugin.so -fplugin=./scripts/gcc-plugins/randomize_layout_plugin.so -fplugin=./scripts/gcc-plugins/stackleak_plugin.so -fplugin-arg-structleak_plugin-byref-all -DSTRUCTLEAK_PLUGIN -DRANDSTRUCT_PLUGIN -fplugin-arg-randomize_layout_plugin-performance-mode -DSTACKLEAK_PLUGIN -fplugin-arg-stackleak_plugin-track-min-size=100 -Wframe-larger-than=2048 -fstack-protector-strong -Wno-unused-but-set-variable -Wimplicit-fallthrough -Wno-unused-const-variable -fno-var-tracking-assignments -gsplit-dwarf -gdwarf-4 -pg -mrecord-mcount -mfentry -DCC_USING_FENTRY -flive-patching=inline-clone -Wdeclaration-after-statement -Wvla -Wno-pointer-sign -Wno-stringop-truncation -Wno-zero-length-bounds -Wno-array-bounds -Wno-stringop-overflow -Wno-restrict -Wno-maybe-uninitialized -fno-strict-overflow -fno-merge-all-constants -fmerge-constants -fno-stack-check -fconserve-stack -Werror=date-time -Werror=incompatible-pointer-types -Werror=designated-init -fmacro-prefix-map=./= -fcf-protection=none -Wno-packed-not-aligned -I/tmp/B.JfsCO7/BUILD/NVIDIA-Linux-x86_64-390.132-no-compat32/kernel/common/inc -I/tmp/B.JfsCO7/BUILD/NVIDIA-Linux-x86_64-390.132-no-compat32/kernel -Wall -MD -Wsign-compare -Wno-cast-qual -Wno-error -D__KERNEL__ -DMODULE -DNVRM -DNV_VERSION_STRING=\"390.132\" -Wno-unused-function -Wuninitialized -fno-strict-aliasing -mno-red-zone -mcmodel=kernel -DNV_UVM_ENABLE -Wno-sign-compare -Wno-format-extra-args -Werror=undef -DNV_SPECTRE_V2=0 -I/tmp/B.JfsCO7/BUILD/NVIDIA-Linux-x86_64-390.132-no-compat32/kernel/nvidia -DNV_BUILD_MODULE_INSTANCES=0 -DNVIDIA_UNDEF_LEGACY_BIT_MACROS -UDEBUG -U_DEBUG -DNDEBUG -DMODULE -DKBUILD_BASENAME='"nv_frontend"' -DKBUILD_MODNAME='"nvidia"' /tmp/B.JfsCO7/BUILD/NVIDIA-Linux-x86_64-390.132-no-compat32/kernel/nvidia/nv-frontend.c | scripts/genksyms/genksyms -r /dev/null > /tmp/B.JfsCO7/BUILD/NVIDIA-Linux-x86_64-390.132-no-compat32/kernel/nvidia/.tmp_nv-frontend.ver; ld -m elf_x86_64 -z max-page-size=0x200000 -r -o /tmp/B.JfsCO7/BUILD/NVIDIA-Linux-x86_64-390.132-no-compat32/kernel/nvidia/.tmp_nv-frontend.o /tmp/B.JfsCO7/BUILD/NVIDIA-Linux-x86_64-390.132-no-compat32/kernel/nvidia/nv-frontend.o -T /tmp/B.JfsCO7/BUILD/NVIDIA-Linux-x86_64-390.132-no-compat32/kernel/nvidia/.tmp_nv-frontend.ver; mv -f /tmp/B.JfsCO7/BUILD/NVIDIA-Linux-x86_64-390.132-no-compat32/kernel/nvidia/.tmp_nv-frontend.o /tmp/B.JfsCO7/BUILD/NVIDIA-Linux-x86_64-390.132-no-compat32/kernel/nvidia/nv-frontend.o; rm -f /tmp/B.JfsCO7/BUILD/NVIDIA-Linux-x86_64-390.132-no-compat32/kernel/nvidia/.tmp_nv-frontend.ver; fi x86_64-pld-linux-gcc -Wp,-MD,/tmp/B.JfsCO7/BUILD/NVIDIA-Linux-x86_64-390.132-no-compat32/kernel/nvidia/.nv-mempool.o.d -nostdinc -isystem /usr/lib64/gcc/x86_64-pld-linux/10.1.0/include -I./arch/x86/include -I./arch/x86/include/generated -I./include -I./arch/x86/include/uapi -I./arch/x86/include/generated/uapi -I./include/uapi -I./include/generated/uapi -include ./include/linux/kconfig.h -include ./include/linux/compiler_types.h -D__KERNEL__ -Wall -Wundef -Werror=strict-prototypes -Wno-trigraphs -fno-strict-aliasing -fno-common -fshort-wchar -fno-PIE -Werror=implicit-function-declaration -Werror=implicit-int -Wno-format-security -std=gnu89 -mno-sse -mno-mmx -mno-sse2 -mno-3dnow -mno-avx -m64 -falign-jumps=1 -falign-loops=1 -mno-80387 -mno-fp-ret-in-387 -mpreferred-stack-boundary=3 -mskip-rax-setup -mtune=generic -mno-red-zone -mcmodel=kernel -DCONFIG_X86_X32_ABI -Wno-sign-compare -fno-asynchronous-unwind-tables -mindirect-branch=thunk-extern -mindirect-branch-register -fno-jump-tables -fno-delete-null-pointer-checks -Wno-frame-address -Wno-format-truncation -Wno-format-overflow -Wno-address-of-packed-member -O2 -fno-allow-store-data-races -fplugin=./scripts/gcc-plugins/structleak_plugin.so -fplugin=./scripts/gcc-plugins/randomize_layout_plugin.so -fplugin=./scripts/gcc-plugins/stackleak_plugin.so -fplugin-arg-structleak_plugin-byref-all -DSTRUCTLEAK_PLUGIN -DRANDSTRUCT_PLUGIN -fplugin-arg-randomize_layout_plugin-performance-mode -DSTACKLEAK_PLUGIN -fplugin-arg-stackleak_plugin-track-min-size=100 -Wframe-larger-than=2048 -fstack-protector-strong -Wno-unused-but-set-variable -Wimplicit-fallthrough -Wno-unused-const-variable -fno-var-tracking-assignments -gsplit-dwarf -gdwarf-4 -pg -mrecord-mcount -mfentry -DCC_USING_FENTRY -flive-patching=inline-clone -Wdeclaration-after-statement -Wvla -Wno-pointer-sign -Wno-stringop-truncation -Wno-zero-length-bounds -Wno-array-bounds -Wno-stringop-overflow -Wno-restrict -Wno-maybe-uninitialized -fno-strict-overflow -fno-merge-all-constants -fmerge-constants -fno-stack-check -fconserve-stack -Werror=date-time -Werror=incompatible-pointer-types -Werror=designated-init -fmacro-prefix-map=./= -fcf-protection=none -Wno-packed-not-aligned -I/tmp/B.JfsCO7/BUILD/NVIDIA-Linux-x86_64-390.132-no-compat32/kernel/common/inc -I/tmp/B.JfsCO7/BUILD/NVIDIA-Linux-x86_64-390.132-no-compat32/kernel -Wall -MD -Wsign-compare -Wno-cast-qual -Wno-error -D__KERNEL__ -DMODULE -DNVRM -DNV_VERSION_STRING=\"390.132\" -Wno-unused-function -Wuninitialized -fno-strict-aliasing -mno-red-zone -mcmodel=kernel -DNV_UVM_ENABLE -Wno-sign-compare -Wno-format-extra-args -Werror=undef -DNV_SPECTRE_V2=0 -I/tmp/B.JfsCO7/BUILD/NVIDIA-Linux-x86_64-390.132-no-compat32/kernel/nvidia -DNV_BUILD_MODULE_INSTANCES=0 -DNVIDIA_UNDEF_LEGACY_BIT_MACROS -UDEBUG -U_DEBUG -DNDEBUG -DMODULE -DKBUILD_BASENAME='"nv_mempool"' -DKBUILD_MODNAME='"nvidia"' -c -o /tmp/B.JfsCO7/BUILD/NVIDIA-Linux-x86_64-390.132-no-compat32/kernel/nvidia/nv-mempool.o /tmp/B.JfsCO7/BUILD/NVIDIA-Linux-x86_64-390.132-no-compat32/kernel/nvidia/nv-mempool.c ./tools/objtool/objtool orc generate --module --no-fp --retpoline --uaccess /tmp/B.JfsCO7/BUILD/NVIDIA-Linux-x86_64-390.132-no-compat32/kernel/nvidia/nv-mempool.o if objdump -h /tmp/B.JfsCO7/BUILD/NVIDIA-Linux-x86_64-390.132-no-compat32/kernel/nvidia/nv-mempool.o | grep -q __ksymtab; then x86_64-pld-linux-gcc -E -D__GENKSYMS__ -Wp,-MD,/tmp/B.JfsCO7/BUILD/NVIDIA-Linux-x86_64-390.132-no-compat32/kernel/nvidia/.nv-mempool.o.d -nostdinc -isystem /usr/lib64/gcc/x86_64-pld-linux/10.1.0/include -I./arch/x86/include -I./arch/x86/include/generated -I./include -I./arch/x86/include/uapi -I./arch/x86/include/generated/uapi -I./include/uapi -I./include/generated/uapi -include ./include/linux/kconfig.h -include ./include/linux/compiler_types.h -D__KERNEL__ -Wall -Wundef -Werror=strict-prototypes -Wno-trigraphs -fno-strict-aliasing -fno-common -fshort-wchar -fno-PIE -Werror=implicit-function-declaration -Werror=implicit-int -Wno-format-security -std=gnu89 -mno-sse -mno-mmx -mno-sse2 -mno-3dnow -mno-avx -m64 -falign-jumps=1 -falign-loops=1 -mno-80387 -mno-fp-ret-in-387 -mpreferred-stack-boundary=3 -mskip-rax-setup -mtune=generic -mno-red-zone -mcmodel=kernel -DCONFIG_X86_X32_ABI -Wno-sign-compare -fno-asynchronous-unwind-tables -mindirect-branch=thunk-extern -mindirect-branch-register -fno-jump-tables -fno-delete-null-pointer-checks -Wno-frame-address -Wno-format-truncation -Wno-format-overflow -Wno-address-of-packed-member -O2 -fno-allow-store-data-races -fplugin=./scripts/gcc-plugins/structleak_plugin.so -fplugin=./scripts/gcc-plugins/randomize_layout_plugin.so -fplugin=./scripts/gcc-plugins/stackleak_plugin.so -fplugin-arg-structleak_plugin-byref-all -DSTRUCTLEAK_PLUGIN -DRANDSTRUCT_PLUGIN -fplugin-arg-randomize_layout_plugin-performance-mode -DSTACKLEAK_PLUGIN -fplugin-arg-stackleak_plugin-track-min-size=100 -Wframe-larger-than=2048 -fstack-protector-strong -Wno-unused-but-set-variable -Wimplicit-fallthrough -Wno-unused-const-variable -fno-var-tracking-assignments -gsplit-dwarf -gdwarf-4 -pg -mrecord-mcount -mfentry -DCC_USING_FENTRY -flive-patching=inline-clone -Wdeclaration-after-statement -Wvla -Wno-pointer-sign -Wno-stringop-truncation -Wno-zero-length-bounds -Wno-array-bounds -Wno-stringop-overflow -Wno-restrict -Wno-maybe-uninitialized -fno-strict-overflow -fno-merge-all-constants -fmerge-constants -fno-stack-check -fconserve-stack -Werror=date-time -Werror=incompatible-pointer-types -Werror=designated-init -fmacro-prefix-map=./= -fcf-protection=none -Wno-packed-not-aligned -I/tmp/B.JfsCO7/BUILD/NVIDIA-Linux-x86_64-390.132-no-compat32/kernel/common/inc -I/tmp/B.JfsCO7/BUILD/NVIDIA-Linux-x86_64-390.132-no-compat32/kernel -Wall -MD -Wsign-compare -Wno-cast-qual -Wno-error -D__KERNEL__ -DMODULE -DNVRM -DNV_VERSION_STRING=\"390.132\" -Wno-unused-function -Wuninitialized -fno-strict-aliasing -mno-red-zone -mcmodel=kernel -DNV_UVM_ENABLE -Wno-sign-compare -Wno-format-extra-args -Werror=undef -DNV_SPECTRE_V2=0 -I/tmp/B.JfsCO7/BUILD/NVIDIA-Linux-x86_64-390.132-no-compat32/kernel/nvidia -DNV_BUILD_MODULE_INSTANCES=0 -DNVIDIA_UNDEF_LEGACY_BIT_MACROS -UDEBUG -U_DEBUG -DNDEBUG -DMODULE -DKBUILD_BASENAME='"nv_mempool"' -DKBUILD_MODNAME='"nvidia"' /tmp/B.JfsCO7/BUILD/NVIDIA-Linux-x86_64-390.132-no-compat32/kernel/nvidia/nv-mempool.c | scripts/genksyms/genksyms -r /dev/null > /tmp/B.JfsCO7/BUILD/NVIDIA-Linux-x86_64-390.132-no-compat32/kernel/nvidia/.tmp_nv-mempool.ver; ld -m elf_x86_64 -z max-page-size=0x200000 -r -o /tmp/B.JfsCO7/BUILD/NVIDIA-Linux-x86_64-390.132-no-compat32/kernel/nvidia/.tmp_nv-mempool.o /tmp/B.JfsCO7/BUILD/NVIDIA-Linux-x86_64-390.132-no-compat32/kernel/nvidia/nv-mempool.o -T /tmp/B.JfsCO7/BUILD/NVIDIA-Linux-x86_64-390.132-no-compat32/kernel/nvidia/.tmp_nv-mempool.ver; mv -f /tmp/B.JfsCO7/BUILD/NVIDIA-Linux-x86_64-390.132-no-compat32/kernel/nvidia/.tmp_nv-mempool.o /tmp/B.JfsCO7/BUILD/NVIDIA-Linux-x86_64-390.132-no-compat32/kernel/nvidia/nv-mempool.o; rm -f /tmp/B.JfsCO7/BUILD/NVIDIA-Linux-x86_64-390.132-no-compat32/kernel/nvidia/.tmp_nv-mempool.ver; fi x86_64-pld-linux-gcc -Wp,-MD,/tmp/B.JfsCO7/BUILD/NVIDIA-Linux-x86_64-390.132-no-compat32/kernel/nvidia/.nv-i2c.o.d -nostdinc -isystem /usr/lib64/gcc/x86_64-pld-linux/10.1.0/include -I./arch/x86/include -I./arch/x86/include/generated -I./include -I./arch/x86/include/uapi -I./arch/x86/include/generated/uapi -I./include/uapi -I./include/generated/uapi -include ./include/linux/kconfig.h -include ./include/linux/compiler_types.h -D__KERNEL__ -Wall -Wundef -Werror=strict-prototypes -Wno-trigraphs -fno-strict-aliasing -fno-common -fshort-wchar -fno-PIE -Werror=implicit-function-declaration -Werror=implicit-int -Wno-format-security -std=gnu89 -mno-sse -mno-mmx -mno-sse2 -mno-3dnow -mno-avx -m64 -falign-jumps=1 -falign-loops=1 -mno-80387 -mno-fp-ret-in-387 -mpreferred-stack-boundary=3 -mskip-rax-setup -mtune=generic -mno-red-zone -mcmodel=kernel -DCONFIG_X86_X32_ABI -Wno-sign-compare -fno-asynchronous-unwind-tables -mindirect-branch=thunk-extern -mindirect-branch-register -fno-jump-tables -fno-delete-null-pointer-checks -Wno-frame-address -Wno-format-truncation -Wno-format-overflow -Wno-address-of-packed-member -O2 -fno-allow-store-data-races -fplugin=./scripts/gcc-plugins/structleak_plugin.so -fplugin=./scripts/gcc-plugins/randomize_layout_plugin.so -fplugin=./scripts/gcc-plugins/stackleak_plugin.so -fplugin-arg-structleak_plugin-byref-all -DSTRUCTLEAK_PLUGIN -DRANDSTRUCT_PLUGIN -fplugin-arg-randomize_layout_plugin-performance-mode -DSTACKLEAK_PLUGIN -fplugin-arg-stackleak_plugin-track-min-size=100 -Wframe-larger-than=2048 -fstack-protector-strong -Wno-unused-but-set-variable -Wimplicit-fallthrough -Wno-unused-const-variable -fno-var-tracking-assignments -gsplit-dwarf -gdwarf-4 -pg -mrecord-mcount -mfentry -DCC_USING_FENTRY -flive-patching=inline-clone -Wdeclaration-after-statement -Wvla -Wno-pointer-sign -Wno-stringop-truncation -Wno-zero-length-bounds -Wno-array-bounds -Wno-stringop-overflow -Wno-restrict -Wno-maybe-uninitialized -fno-strict-overflow -fno-merge-all-constants -fmerge-constants -fno-stack-check -fconserve-stack -Werror=date-time -Werror=incompatible-pointer-types -Werror=designated-init -fmacro-prefix-map=./= -fcf-protection=none -Wno-packed-not-aligned -I/tmp/B.JfsCO7/BUILD/NVIDIA-Linux-x86_64-390.132-no-compat32/kernel/common/inc -I/tmp/B.JfsCO7/BUILD/NVIDIA-Linux-x86_64-390.132-no-compat32/kernel -Wall -MD -Wsign-compare -Wno-cast-qual -Wno-error -D__KERNEL__ -DMODULE -DNVRM -DNV_VERSION_STRING=\"390.132\" -Wno-unused-function -Wuninitialized -fno-strict-aliasing -mno-red-zone -mcmodel=kernel -DNV_UVM_ENABLE -Wno-sign-compare -Wno-format-extra-args -Werror=undef -DNV_SPECTRE_V2=0 -I/tmp/B.JfsCO7/BUILD/NVIDIA-Linux-x86_64-390.132-no-compat32/kernel/nvidia -DNV_BUILD_MODULE_INSTANCES=0 -DNVIDIA_UNDEF_LEGACY_BIT_MACROS -UDEBUG -U_DEBUG -DNDEBUG -DMODULE -DKBUILD_BASENAME='"nv_i2c"' -DKBUILD_MODNAME='"nvidia"' -c -o /tmp/B.JfsCO7/BUILD/NVIDIA-Linux-x86_64-390.132-no-compat32/kernel/nvidia/nv-i2c.o /tmp/B.JfsCO7/BUILD/NVIDIA-Linux-x86_64-390.132-no-compat32/kernel/nvidia/nv-i2c.c ./tools/objtool/objtool orc generate --module --no-fp --retpoline --uaccess /tmp/B.JfsCO7/BUILD/NVIDIA-Linux-x86_64-390.132-no-compat32/kernel/nvidia/nv-i2c.o if objdump -h /tmp/B.JfsCO7/BUILD/NVIDIA-Linux-x86_64-390.132-no-compat32/kernel/nvidia/nv-i2c.o | grep -q __ksymtab; then x86_64-pld-linux-gcc -E -D__GENKSYMS__ -Wp,-MD,/tmp/B.JfsCO7/BUILD/NVIDIA-Linux-x86_64-390.132-no-compat32/kernel/nvidia/.nv-i2c.o.d -nostdinc -isystem /usr/lib64/gcc/x86_64-pld-linux/10.1.0/include -I./arch/x86/include -I./arch/x86/include/generated -I./include -I./arch/x86/include/uapi -I./arch/x86/include/generated/uapi -I./include/uapi -I./include/generated/uapi -include ./include/linux/kconfig.h -include ./include/linux/compiler_types.h -D__KERNEL__ -Wall -Wundef -Werror=strict-prototypes -Wno-trigraphs -fno-strict-aliasing -fno-common -fshort-wchar -fno-PIE -Werror=implicit-function-declaration -Werror=implicit-int -Wno-format-security -std=gnu89 -mno-sse -mno-mmx -mno-sse2 -mno-3dnow -mno-avx -m64 -falign-jumps=1 -falign-loops=1 -mno-80387 -mno-fp-ret-in-387 -mpreferred-stack-boundary=3 -mskip-rax-setup -mtune=generic -mno-red-zone -mcmodel=kernel -DCONFIG_X86_X32_ABI -Wno-sign-compare -fno-asynchronous-unwind-tables -mindirect-branch=thunk-extern -mindirect-branch-register -fno-jump-tables -fno-delete-null-pointer-checks -Wno-frame-address -Wno-format-truncation -Wno-format-overflow -Wno-address-of-packed-member -O2 -fno-allow-store-data-races -fplugin=./scripts/gcc-plugins/structleak_plugin.so -fplugin=./scripts/gcc-plugins/randomize_layout_plugin.so -fplugin=./scripts/gcc-plugins/stackleak_plugin.so -fplugin-arg-structleak_plugin-byref-all -DSTRUCTLEAK_PLUGIN -DRANDSTRUCT_PLUGIN -fplugin-arg-randomize_layout_plugin-performance-mode -DSTACKLEAK_PLUGIN -fplugin-arg-stackleak_plugin-track-min-size=100 -Wframe-larger-than=2048 -fstack-protector-strong -Wno-unused-but-set-variable -Wimplicit-fallthrough -Wno-unused-const-variable -fno-var-tracking-assignments -gsplit-dwarf -gdwarf-4 -pg -mrecord-mcount -mfentry -DCC_USING_FENTRY -flive-patching=inline-clone -Wdeclaration-after-statement -Wvla -Wno-pointer-sign -Wno-stringop-truncation -Wno-zero-length-bounds -Wno-array-bounds -Wno-stringop-overflow -Wno-restrict -Wno-maybe-uninitialized -fno-strict-overflow -fno-merge-all-constants -fmerge-constants -fno-stack-check -fconserve-stack -Werror=date-time -Werror=incompatible-pointer-types -Werror=designated-init -fmacro-prefix-map=./= -fcf-protection=none -Wno-packed-not-aligned -I/tmp/B.JfsCO7/BUILD/NVIDIA-Linux-x86_64-390.132-no-compat32/kernel/common/inc -I/tmp/B.JfsCO7/BUILD/NVIDIA-Linux-x86_64-390.132-no-compat32/kernel -Wall -MD -Wsign-compare -Wno-cast-qual -Wno-error -D__KERNEL__ -DMODULE -DNVRM -DNV_VERSION_STRING=\"390.132\" -Wno-unused-function -Wuninitialized -fno-strict-aliasing -mno-red-zone -mcmodel=kernel -DNV_UVM_ENABLE -Wno-sign-compare -Wno-format-extra-args -Werror=undef -DNV_SPECTRE_V2=0 -I/tmp/B.JfsCO7/BUILD/NVIDIA-Linux-x86_64-390.132-no-compat32/kernel/nvidia -DNV_BUILD_MODULE_INSTANCES=0 -DNVIDIA_UNDEF_LEGACY_BIT_MACROS -UDEBUG -U_DEBUG -DNDEBUG -DMODULE -DKBUILD_BASENAME='"nv_i2c"' -DKBUILD_MODNAME='"nvidia"' /tmp/B.JfsCO7/BUILD/NVIDIA-Linux-x86_64-390.132-no-compat32/kernel/nvidia/nv-i2c.c | scripts/genksyms/genksyms -r /dev/null > /tmp/B.JfsCO7/BUILD/NVIDIA-Linux-x86_64-390.132-no-compat32/kernel/nvidia/.tmp_nv-i2c.ver; ld -m elf_x86_64 -z max-page-size=0x200000 -r -o /tmp/B.JfsCO7/BUILD/NVIDIA-Linux-x86_64-390.132-no-compat32/kernel/nvidia/.tmp_nv-i2c.o /tmp/B.JfsCO7/BUILD/NVIDIA-Linux-x86_64-390.132-no-compat32/kernel/nvidia/nv-i2c.o -T /tmp/B.JfsCO7/BUILD/NVIDIA-Linux-x86_64-390.132-no-compat32/kernel/nvidia/.tmp_nv-i2c.ver; mv -f /tmp/B.JfsCO7/BUILD/NVIDIA-Linux-x86_64-390.132-no-compat32/kernel/nvidia/.tmp_nv-i2c.o /tmp/B.JfsCO7/BUILD/NVIDIA-Linux-x86_64-390.132-no-compat32/kernel/nvidia/nv-i2c.o; rm -f /tmp/B.JfsCO7/BUILD/NVIDIA-Linux-x86_64-390.132-no-compat32/kernel/nvidia/.tmp_nv-i2c.ver; fi x86_64-pld-linux-gcc -Wp,-MD,/tmp/B.JfsCO7/BUILD/NVIDIA-Linux-x86_64-390.132-no-compat32/kernel/nvidia/.nv-mmap.o.d -nostdinc -isystem /usr/lib64/gcc/x86_64-pld-linux/10.1.0/include -I./arch/x86/include -I./arch/x86/include/generated -I./include -I./arch/x86/include/uapi -I./arch/x86/include/generated/uapi -I./include/uapi -I./include/generated/uapi -include ./include/linux/kconfig.h -include ./include/linux/compiler_types.h -D__KERNEL__ -Wall -Wundef -Werror=strict-prototypes -Wno-trigraphs -fno-strict-aliasing -fno-common -fshort-wchar -fno-PIE -Werror=implicit-function-declaration -Werror=implicit-int -Wno-format-security -std=gnu89 -mno-sse -mno-mmx -mno-sse2 -mno-3dnow -mno-avx -m64 -falign-jumps=1 -falign-loops=1 -mno-80387 -mno-fp-ret-in-387 -mpreferred-stack-boundary=3 -mskip-rax-setup -mtune=generic -mno-red-zone -mcmodel=kernel -DCONFIG_X86_X32_ABI -Wno-sign-compare -fno-asynchronous-unwind-tables -mindirect-branch=thunk-extern -mindirect-branch-register -fno-jump-tables -fno-delete-null-pointer-checks -Wno-frame-address -Wno-format-truncation -Wno-format-overflow -Wno-address-of-packed-member -O2 -fno-allow-store-data-races -fplugin=./scripts/gcc-plugins/structleak_plugin.so -fplugin=./scripts/gcc-plugins/randomize_layout_plugin.so -fplugin=./scripts/gcc-plugins/stackleak_plugin.so -fplugin-arg-structleak_plugin-byref-all -DSTRUCTLEAK_PLUGIN -DRANDSTRUCT_PLUGIN -fplugin-arg-randomize_layout_plugin-performance-mode -DSTACKLEAK_PLUGIN -fplugin-arg-stackleak_plugin-track-min-size=100 -Wframe-larger-than=2048 -fstack-protector-strong -Wno-unused-but-set-variable -Wimplicit-fallthrough -Wno-unused-const-variable -fno-var-tracking-assignments -gsplit-dwarf -gdwarf-4 -pg -mrecord-mcount -mfentry -DCC_USING_FENTRY -flive-patching=inline-clone -Wdeclaration-after-statement -Wvla -Wno-pointer-sign -Wno-stringop-truncation -Wno-zero-length-bounds -Wno-array-bounds -Wno-stringop-overflow -Wno-restrict -Wno-maybe-uninitialized -fno-strict-overflow -fno-merge-all-constants -fmerge-constants -fno-stack-check -fconserve-stack -Werror=date-time -Werror=incompatible-pointer-types -Werror=designated-init -fmacro-prefix-map=./= -fcf-protection=none -Wno-packed-not-aligned -I/tmp/B.JfsCO7/BUILD/NVIDIA-Linux-x86_64-390.132-no-compat32/kernel/common/inc -I/tmp/B.JfsCO7/BUILD/NVIDIA-Linux-x86_64-390.132-no-compat32/kernel -Wall -MD -Wsign-compare -Wno-cast-qual -Wno-error -D__KERNEL__ -DMODULE -DNVRM -DNV_VERSION_STRING=\"390.132\" -Wno-unused-function -Wuninitialized -fno-strict-aliasing -mno-red-zone -mcmodel=kernel -DNV_UVM_ENABLE -Wno-sign-compare -Wno-format-extra-args -Werror=undef -DNV_SPECTRE_V2=0 -I/tmp/B.JfsCO7/BUILD/NVIDIA-Linux-x86_64-390.132-no-compat32/kernel/nvidia -DNV_BUILD_MODULE_INSTANCES=0 -DNVIDIA_UNDEF_LEGACY_BIT_MACROS -UDEBUG -U_DEBUG -DNDEBUG -DMODULE -DKBUILD_BASENAME='"nv_mmap"' -DKBUILD_MODNAME='"nvidia"' -c -o /tmp/B.JfsCO7/BUILD/NVIDIA-Linux-x86_64-390.132-no-compat32/kernel/nvidia/nv-mmap.o /tmp/B.JfsCO7/BUILD/NVIDIA-Linux-x86_64-390.132-no-compat32/kernel/nvidia/nv-mmap.c /tmp/B.JfsCO7/BUILD/NVIDIA-Linux-x86_64-390.132-no-compat32/kernel/nvidia/nv-mmap.c: In function 'nv_encode_caching': /tmp/B.JfsCO7/BUILD/NVIDIA-Linux-x86_64-390.132-no-compat32/kernel/nvidia/nv-mmap.c:255:16: warning: this statement may fall through [-Wimplicit-fallthrough=] 255 | if (NV_ALLOW_CACHING(memory_type)) | ^ /tmp/B.JfsCO7/BUILD/NVIDIA-Linux-x86_64-390.132-no-compat32/kernel/nvidia/nv-mmap.c:257:9: note: here 257 | default: | ^~~~~~~ ./tools/objtool/objtool orc generate --module --no-fp --retpoline --uaccess /tmp/B.JfsCO7/BUILD/NVIDIA-Linux-x86_64-390.132-no-compat32/kernel/nvidia/nv-mmap.o if objdump -h /tmp/B.JfsCO7/BUILD/NVIDIA-Linux-x86_64-390.132-no-compat32/kernel/nvidia/nv-mmap.o | grep -q __ksymtab; then x86_64-pld-linux-gcc -E -D__GENKSYMS__ -Wp,-MD,/tmp/B.JfsCO7/BUILD/NVIDIA-Linux-x86_64-390.132-no-compat32/kernel/nvidia/.nv-mmap.o.d -nostdinc -isystem /usr/lib64/gcc/x86_64-pld-linux/10.1.0/include -I./arch/x86/include -I./arch/x86/include/generated -I./include -I./arch/x86/include/uapi -I./arch/x86/include/generated/uapi -I./include/uapi -I./include/generated/uapi -include ./include/linux/kconfig.h -include ./include/linux/compiler_types.h -D__KERNEL__ -Wall -Wundef -Werror=strict-prototypes -Wno-trigraphs -fno-strict-aliasing -fno-common -fshort-wchar -fno-PIE -Werror=implicit-function-declaration -Werror=implicit-int -Wno-format-security -std=gnu89 -mno-sse -mno-mmx -mno-sse2 -mno-3dnow -mno-avx -m64 -falign-jumps=1 -falign-loops=1 -mno-80387 -mno-fp-ret-in-387 -mpreferred-stack-boundary=3 -mskip-rax-setup -mtune=generic -mno-red-zone -mcmodel=kernel -DCONFIG_X86_X32_ABI -Wno-sign-compare -fno-asynchronous-unwind-tables -mindirect-branch=thunk-extern -mindirect-branch-register -fno-jump-tables -fno-delete-null-pointer-checks -Wno-frame-address -Wno-format-truncation -Wno-format-overflow -Wno-address-of-packed-member -O2 -fno-allow-store-data-races -fplugin=./scripts/gcc-plugins/structleak_plugin.so -fplugin=./scripts/gcc-plugins/randomize_layout_plugin.so -fplugin=./scripts/gcc-plugins/stackleak_plugin.so -fplugin-arg-structleak_plugin-byref-all -DSTRUCTLEAK_PLUGIN -DRANDSTRUCT_PLUGIN -fplugin-arg-randomize_layout_plugin-performance-mode -DSTACKLEAK_PLUGIN -fplugin-arg-stackleak_plugin-track-min-size=100 -Wframe-larger-than=2048 -fstack-protector-strong -Wno-unused-but-set-variable -Wimplicit-fallthrough -Wno-unused-const-variable -fno-var-tracking-assignments -gsplit-dwarf -gdwarf-4 -pg -mrecord-mcount -mfentry -DCC_USING_FENTRY -flive-patching=inline-clone -Wdeclaration-after-statement -Wvla -Wno-pointer-sign -Wno-stringop-truncation -Wno-zero-length-bounds -Wno-array-bounds -Wno-stringop-overflow -Wno-restrict -Wno-maybe-uninitialized -fno-strict-overflow -fno-merge-all-constants -fmerge-constants -fno-stack-check -fconserve-stack -Werror=date-time -Werror=incompatible-pointer-types -Werror=designated-init -fmacro-prefix-map=./= -fcf-protection=none -Wno-packed-not-aligned -I/tmp/B.JfsCO7/BUILD/NVIDIA-Linux-x86_64-390.132-no-compat32/kernel/common/inc -I/tmp/B.JfsCO7/BUILD/NVIDIA-Linux-x86_64-390.132-no-compat32/kernel -Wall -MD -Wsign-compare -Wno-cast-qual -Wno-error -D__KERNEL__ -DMODULE -DNVRM -DNV_VERSION_STRING=\"390.132\" -Wno-unused-function -Wuninitialized -fno-strict-aliasing -mno-red-zone -mcmodel=kernel -DNV_UVM_ENABLE -Wno-sign-compare -Wno-format-extra-args -Werror=undef -DNV_SPECTRE_V2=0 -I/tmp/B.JfsCO7/BUILD/NVIDIA-Linux-x86_64-390.132-no-compat32/kernel/nvidia -DNV_BUILD_MODULE_INSTANCES=0 -DNVIDIA_UNDEF_LEGACY_BIT_MACROS -UDEBUG -U_DEBUG -DNDEBUG -DMODULE -DKBUILD_BASENAME='"nv_mmap"' -DKBUILD_MODNAME='"nvidia"' /tmp/B.JfsCO7/BUILD/NVIDIA-Linux-x86_64-390.132-no-compat32/kernel/nvidia/nv-mmap.c | scripts/genksyms/genksyms -r /dev/null > /tmp/B.JfsCO7/BUILD/NVIDIA-Linux-x86_64-390.132-no-compat32/kernel/nvidia/.tmp_nv-mmap.ver; ld -m elf_x86_64 -z max-page-size=0x200000 -r -o /tmp/B.JfsCO7/BUILD/NVIDIA-Linux-x86_64-390.132-no-compat32/kernel/nvidia/.tmp_nv-mmap.o /tmp/B.JfsCO7/BUILD/NVIDIA-Linux-x86_64-390.132-no-compat32/kernel/nvidia/nv-mmap.o -T /tmp/B.JfsCO7/BUILD/NVIDIA-Linux-x86_64-390.132-no-compat32/kernel/nvidia/.tmp_nv-mmap.ver; mv -f /tmp/B.JfsCO7/BUILD/NVIDIA-Linux-x86_64-390.132-no-compat32/kernel/nvidia/.tmp_nv-mmap.o /tmp/B.JfsCO7/BUILD/NVIDIA-Linux-x86_64-390.132-no-compat32/kernel/nvidia/nv-mmap.o; rm -f /tmp/B.JfsCO7/BUILD/NVIDIA-Linux-x86_64-390.132-no-compat32/kernel/nvidia/.tmp_nv-mmap.ver; fi x86_64-pld-linux-gcc -Wp,-MD,/tmp/B.JfsCO7/BUILD/NVIDIA-Linux-x86_64-390.132-no-compat32/kernel/nvidia/.nv-pat.o.d -nostdinc -isystem /usr/lib64/gcc/x86_64-pld-linux/10.1.0/include -I./arch/x86/include -I./arch/x86/include/generated -I./include -I./arch/x86/include/uapi -I./arch/x86/include/generated/uapi -I./include/uapi -I./include/generated/uapi -include ./include/linux/kconfig.h -include ./include/linux/compiler_types.h -D__KERNEL__ -Wall -Wundef -Werror=strict-prototypes -Wno-trigraphs -fno-strict-aliasing -fno-common -fshort-wchar -fno-PIE -Werror=implicit-function-declaration -Werror=implicit-int -Wno-format-security -std=gnu89 -mno-sse -mno-mmx -mno-sse2 -mno-3dnow -mno-avx -m64 -falign-jumps=1 -falign-loops=1 -mno-80387 -mno-fp-ret-in-387 -mpreferred-stack-boundary=3 -mskip-rax-setup -mtune=generic -mno-red-zone -mcmodel=kernel -DCONFIG_X86_X32_ABI -Wno-sign-compare -fno-asynchronous-unwind-tables -mindirect-branch=thunk-extern -mindirect-branch-register -fno-jump-tables -fno-delete-null-pointer-checks -Wno-frame-address -Wno-format-truncation -Wno-format-overflow -Wno-address-of-packed-member -O2 -fno-allow-store-data-races -fplugin=./scripts/gcc-plugins/structleak_plugin.so -fplugin=./scripts/gcc-plugins/randomize_layout_plugin.so -fplugin=./scripts/gcc-plugins/stackleak_plugin.so -fplugin-arg-structleak_plugin-byref-all -DSTRUCTLEAK_PLUGIN -DRANDSTRUCT_PLUGIN -fplugin-arg-randomize_layout_plugin-performance-mode -DSTACKLEAK_PLUGIN -fplugin-arg-stackleak_plugin-track-min-size=100 -Wframe-larger-than=2048 -fstack-protector-strong -Wno-unused-but-set-variable -Wimplicit-fallthrough -Wno-unused-const-variable -fno-var-tracking-assignments -gsplit-dwarf -gdwarf-4 -pg -mrecord-mcount -mfentry -DCC_USING_FENTRY -flive-patching=inline-clone -Wdeclaration-after-statement -Wvla -Wno-pointer-sign -Wno-stringop-truncation -Wno-zero-length-bounds -Wno-array-bounds -Wno-stringop-overflow -Wno-restrict -Wno-maybe-uninitialized -fno-strict-overflow -fno-merge-all-constants -fmerge-constants -fno-stack-check -fconserve-stack -Werror=date-time -Werror=incompatible-pointer-types -Werror=designated-init -fmacro-prefix-map=./= -fcf-protection=none -Wno-packed-not-aligned -I/tmp/B.JfsCO7/BUILD/NVIDIA-Linux-x86_64-390.132-no-compat32/kernel/common/inc -I/tmp/B.JfsCO7/BUILD/NVIDIA-Linux-x86_64-390.132-no-compat32/kernel -Wall -MD -Wsign-compare -Wno-cast-qual -Wno-error -D__KERNEL__ -DMODULE -DNVRM -DNV_VERSION_STRING=\"390.132\" -Wno-unused-function -Wuninitialized -fno-strict-aliasing -mno-red-zone -mcmodel=kernel -DNV_UVM_ENABLE -Wno-sign-compare -Wno-format-extra-args -Werror=undef -DNV_SPECTRE_V2=0 -I/tmp/B.JfsCO7/BUILD/NVIDIA-Linux-x86_64-390.132-no-compat32/kernel/nvidia -DNV_BUILD_MODULE_INSTANCES=0 -DNVIDIA_UNDEF_LEGACY_BIT_MACROS -UDEBUG -U_DEBUG -DNDEBUG -DMODULE -DKBUILD_BASENAME='"nv_pat"' -DKBUILD_MODNAME='"nvidia"' -c -o /tmp/B.JfsCO7/BUILD/NVIDIA-Linux-x86_64-390.132-no-compat32/kernel/nvidia/nv-pat.o /tmp/B.JfsCO7/BUILD/NVIDIA-Linux-x86_64-390.132-no-compat32/kernel/nvidia/nv-pat.c ./tools/objtool/objtool orc generate --module --no-fp --retpoline --uaccess /tmp/B.JfsCO7/BUILD/NVIDIA-Linux-x86_64-390.132-no-compat32/kernel/nvidia/nv-pat.o if objdump -h /tmp/B.JfsCO7/BUILD/NVIDIA-Linux-x86_64-390.132-no-compat32/kernel/nvidia/nv-pat.o | grep -q __ksymtab; then x86_64-pld-linux-gcc -E -D__GENKSYMS__ -Wp,-MD,/tmp/B.JfsCO7/BUILD/NVIDIA-Linux-x86_64-390.132-no-compat32/kernel/nvidia/.nv-pat.o.d -nostdinc -isystem /usr/lib64/gcc/x86_64-pld-linux/10.1.0/include -I./arch/x86/include -I./arch/x86/include/generated -I./include -I./arch/x86/include/uapi -I./arch/x86/include/generated/uapi -I./include/uapi -I./include/generated/uapi -include ./include/linux/kconfig.h -include ./include/linux/compiler_types.h -D__KERNEL__ -Wall -Wundef -Werror=strict-prototypes -Wno-trigraphs -fno-strict-aliasing -fno-common -fshort-wchar -fno-PIE -Werror=implicit-function-declaration -Werror=implicit-int -Wno-format-security -std=gnu89 -mno-sse -mno-mmx -mno-sse2 -mno-3dnow -mno-avx -m64 -falign-jumps=1 -falign-loops=1 -mno-80387 -mno-fp-ret-in-387 -mpreferred-stack-boundary=3 -mskip-rax-setup -mtune=generic -mno-red-zone -mcmodel=kernel -DCONFIG_X86_X32_ABI -Wno-sign-compare -fno-asynchronous-unwind-tables -mindirect-branch=thunk-extern -mindirect-branch-register -fno-jump-tables -fno-delete-null-pointer-checks -Wno-frame-address -Wno-format-truncation -Wno-format-overflow -Wno-address-of-packed-member -O2 -fno-allow-store-data-races -fplugin=./scripts/gcc-plugins/structleak_plugin.so -fplugin=./scripts/gcc-plugins/randomize_layout_plugin.so -fplugin=./scripts/gcc-plugins/stackleak_plugin.so -fplugin-arg-structleak_plugin-byref-all -DSTRUCTLEAK_PLUGIN -DRANDSTRUCT_PLUGIN -fplugin-arg-randomize_layout_plugin-performance-mode -DSTACKLEAK_PLUGIN -fplugin-arg-stackleak_plugin-track-min-size=100 -Wframe-larger-than=2048 -fstack-protector-strong -Wno-unused-but-set-variable -Wimplicit-fallthrough -Wno-unused-const-variable -fno-var-tracking-assignments -gsplit-dwarf -gdwarf-4 -pg -mrecord-mcount -mfentry -DCC_USING_FENTRY -flive-patching=inline-clone -Wdeclaration-after-statement -Wvla -Wno-pointer-sign -Wno-stringop-truncation -Wno-zero-length-bounds -Wno-array-bounds -Wno-stringop-overflow -Wno-restrict -Wno-maybe-uninitialized -fno-strict-overflow -fno-merge-all-constants -fmerge-constants -fno-stack-check -fconserve-stack -Werror=date-time -Werror=incompatible-pointer-types -Werror=designated-init -fmacro-prefix-map=./= -fcf-protection=none -Wno-packed-not-aligned -I/tmp/B.JfsCO7/BUILD/NVIDIA-Linux-x86_64-390.132-no-compat32/kernel/common/inc -I/tmp/B.JfsCO7/BUILD/NVIDIA-Linux-x86_64-390.132-no-compat32/kernel -Wall -MD -Wsign-compare -Wno-cast-qual -Wno-error -D__KERNEL__ -DMODULE -DNVRM -DNV_VERSION_STRING=\"390.132\" -Wno-unused-function -Wuninitialized -fno-strict-aliasing -mno-red-zone -mcmodel=kernel -DNV_UVM_ENABLE -Wno-sign-compare -Wno-format-extra-args -Werror=undef -DNV_SPECTRE_V2=0 -I/tmp/B.JfsCO7/BUILD/NVIDIA-Linux-x86_64-390.132-no-compat32/kernel/nvidia -DNV_BUILD_MODULE_INSTANCES=0 -DNVIDIA_UNDEF_LEGACY_BIT_MACROS -UDEBUG -U_DEBUG -DNDEBUG -DMODULE -DKBUILD_BASENAME='"nv_pat"' -DKBUILD_MODNAME='"nvidia"' /tmp/B.JfsCO7/BUILD/NVIDIA-Linux-x86_64-390.132-no-compat32/kernel/nvidia/nv-pat.c | scripts/genksyms/genksyms -r /dev/null > /tmp/B.JfsCO7/BUILD/NVIDIA-Linux-x86_64-390.132-no-compat32/kernel/nvidia/.tmp_nv-pat.ver; ld -m elf_x86_64 -z max-page-size=0x200000 -r -o /tmp/B.JfsCO7/BUILD/NVIDIA-Linux-x86_64-390.132-no-compat32/kernel/nvidia/.tmp_nv-pat.o /tmp/B.JfsCO7/BUILD/NVIDIA-Linux-x86_64-390.132-no-compat32/kernel/nvidia/nv-pat.o -T /tmp/B.JfsCO7/BUILD/NVIDIA-Linux-x86_64-390.132-no-compat32/kernel/nvidia/.tmp_nv-pat.ver; mv -f /tmp/B.JfsCO7/BUILD/NVIDIA-Linux-x86_64-390.132-no-compat32/kernel/nvidia/.tmp_nv-pat.o /tmp/B.JfsCO7/BUILD/NVIDIA-Linux-x86_64-390.132-no-compat32/kernel/nvidia/nv-pat.o; rm -f /tmp/B.JfsCO7/BUILD/NVIDIA-Linux-x86_64-390.132-no-compat32/kernel/nvidia/.tmp_nv-pat.ver; fi x86_64-pld-linux-gcc -Wp,-MD,/tmp/B.JfsCO7/BUILD/NVIDIA-Linux-x86_64-390.132-no-compat32/kernel/nvidia/.nv.o.d -nostdinc -isystem /usr/lib64/gcc/x86_64-pld-linux/10.1.0/include -I./arch/x86/include -I./arch/x86/include/generated -I./include -I./arch/x86/include/uapi -I./arch/x86/include/generated/uapi -I./include/uapi -I./include/generated/uapi -include ./include/linux/kconfig.h -include ./include/linux/compiler_types.h -D__KERNEL__ -Wall -Wundef -Werror=strict-prototypes -Wno-trigraphs -fno-strict-aliasing -fno-common -fshort-wchar -fno-PIE -Werror=implicit-function-declaration -Werror=implicit-int -Wno-format-security -std=gnu89 -mno-sse -mno-mmx -mno-sse2 -mno-3dnow -mno-avx -m64 -falign-jumps=1 -falign-loops=1 -mno-80387 -mno-fp-ret-in-387 -mpreferred-stack-boundary=3 -mskip-rax-setup -mtune=generic -mno-red-zone -mcmodel=kernel -DCONFIG_X86_X32_ABI -Wno-sign-compare -fno-asynchronous-unwind-tables -mindirect-branch=thunk-extern -mindirect-branch-register -fno-jump-tables -fno-delete-null-pointer-checks -Wno-frame-address -Wno-format-truncation -Wno-format-overflow -Wno-address-of-packed-member -O2 -fno-allow-store-data-races -fplugin=./scripts/gcc-plugins/structleak_plugin.so -fplugin=./scripts/gcc-plugins/randomize_layout_plugin.so -fplugin=./scripts/gcc-plugins/stackleak_plugin.so -fplugin-arg-structleak_plugin-byref-all -DSTRUCTLEAK_PLUGIN -DRANDSTRUCT_PLUGIN -fplugin-arg-randomize_layout_plugin-performance-mode -DSTACKLEAK_PLUGIN -fplugin-arg-stackleak_plugin-track-min-size=100 -Wframe-larger-than=2048 -fstack-protector-strong -Wno-unused-but-set-variable -Wimplicit-fallthrough -Wno-unused-const-variable -fno-var-tracking-assignments -gsplit-dwarf -gdwarf-4 -pg -mrecord-mcount -mfentry -DCC_USING_FENTRY -flive-patching=inline-clone -Wdeclaration-after-statement -Wvla -Wno-pointer-sign -Wno-stringop-truncation -Wno-zero-length-bounds -Wno-array-bounds -Wno-stringop-overflow -Wno-restrict -Wno-maybe-uninitialized -fno-strict-overflow -fno-merge-all-constants -fmerge-constants -fno-stack-check -fconserve-stack -Werror=date-time -Werror=incompatible-pointer-types -Werror=designated-init -fmacro-prefix-map=./= -fcf-protection=none -Wno-packed-not-aligned -I/tmp/B.JfsCO7/BUILD/NVIDIA-Linux-x86_64-390.132-no-compat32/kernel/common/inc -I/tmp/B.JfsCO7/BUILD/NVIDIA-Linux-x86_64-390.132-no-compat32/kernel -Wall -MD -Wsign-compare -Wno-cast-qual -Wno-error -D__KERNEL__ -DMODULE -DNVRM -DNV_VERSION_STRING=\"390.132\" -Wno-unused-function -Wuninitialized -fno-strict-aliasing -mno-red-zone -mcmodel=kernel -DNV_UVM_ENABLE -Wno-sign-compare -Wno-format-extra-args -Werror=undef -DNV_SPECTRE_V2=0 -I/tmp/B.JfsCO7/BUILD/NVIDIA-Linux-x86_64-390.132-no-compat32/kernel/nvidia -DNV_BUILD_MODULE_INSTANCES=0 -DNVIDIA_UNDEF_LEGACY_BIT_MACROS -UDEBUG -U_DEBUG -DNDEBUG -DMODULE -DKBUILD_BASENAME='"nv"' -DKBUILD_MODNAME='"nvidia"' -c -o /tmp/B.JfsCO7/BUILD/NVIDIA-Linux-x86_64-390.132-no-compat32/kernel/nvidia/nv.o /tmp/B.JfsCO7/BUILD/NVIDIA-Linux-x86_64-390.132-no-compat32/kernel/nvidia/nv.c ./tools/objtool/objtool orc generate --module --no-fp --retpoline --uaccess /tmp/B.JfsCO7/BUILD/NVIDIA-Linux-x86_64-390.132-no-compat32/kernel/nvidia/nv.o if objdump -h /tmp/B.JfsCO7/BUILD/NVIDIA-Linux-x86_64-390.132-no-compat32/kernel/nvidia/nv.o | grep -q __ksymtab; then x86_64-pld-linux-gcc -E -D__GENKSYMS__ -Wp,-MD,/tmp/B.JfsCO7/BUILD/NVIDIA-Linux-x86_64-390.132-no-compat32/kernel/nvidia/.nv.o.d -nostdinc -isystem /usr/lib64/gcc/x86_64-pld-linux/10.1.0/include -I./arch/x86/include -I./arch/x86/include/generated -I./include -I./arch/x86/include/uapi -I./arch/x86/include/generated/uapi -I./include/uapi -I./include/generated/uapi -include ./include/linux/kconfig.h -include ./include/linux/compiler_types.h -D__KERNEL__ -Wall -Wundef -Werror=strict-prototypes -Wno-trigraphs -fno-strict-aliasing -fno-common -fshort-wchar -fno-PIE -Werror=implicit-function-declaration -Werror=implicit-int -Wno-format-security -std=gnu89 -mno-sse -mno-mmx -mno-sse2 -mno-3dnow -mno-avx -m64 -falign-jumps=1 -falign-loops=1 -mno-80387 -mno-fp-ret-in-387 -mpreferred-stack-boundary=3 -mskip-rax-setup -mtune=generic -mno-red-zone -mcmodel=kernel -DCONFIG_X86_X32_ABI -Wno-sign-compare -fno-asynchronous-unwind-tables -mindirect-branch=thunk-extern -mindirect-branch-register -fno-jump-tables -fno-delete-null-pointer-checks -Wno-frame-address -Wno-format-truncation -Wno-format-overflow -Wno-address-of-packed-member -O2 -fno-allow-store-data-races -fplugin=./scripts/gcc-plugins/structleak_plugin.so -fplugin=./scripts/gcc-plugins/randomize_layout_plugin.so -fplugin=./scripts/gcc-plugins/stackleak_plugin.so -fplugin-arg-structleak_plugin-byref-all -DSTRUCTLEAK_PLUGIN -DRANDSTRUCT_PLUGIN -fplugin-arg-randomize_layout_plugin-performance-mode -DSTACKLEAK_PLUGIN -fplugin-arg-stackleak_plugin-track-min-size=100 -Wframe-larger-than=2048 -fstack-protector-strong -Wno-unused-but-set-variable -Wimplicit-fallthrough -Wno-unused-const-variable -fno-var-tracking-assignments -gsplit-dwarf -gdwarf-4 -pg -mrecord-mcount -mfentry -DCC_USING_FENTRY -flive-patching=inline-clone -Wdeclaration-after-statement -Wvla -Wno-pointer-sign -Wno-stringop-truncation -Wno-zero-length-bounds -Wno-array-bounds -Wno-stringop-overflow -Wno-restrict -Wno-maybe-uninitialized -fno-strict-overflow -fno-merge-all-constants -fmerge-constants -fno-stack-check -fconserve-stack -Werror=date-time -Werror=incompatible-pointer-types -Werror=designated-init -fmacro-prefix-map=./= -fcf-protection=none -Wno-packed-not-aligned -I/tmp/B.JfsCO7/BUILD/NVIDIA-Linux-x86_64-390.132-no-compat32/kernel/common/inc -I/tmp/B.JfsCO7/BUILD/NVIDIA-Linux-x86_64-390.132-no-compat32/kernel -Wall -MD -Wsign-compare -Wno-cast-qual -Wno-error -D__KERNEL__ -DMODULE -DNVRM -DNV_VERSION_STRING=\"390.132\" -Wno-unused-function -Wuninitialized -fno-strict-aliasing -mno-red-zone -mcmodel=kernel -DNV_UVM_ENABLE -Wno-sign-compare -Wno-format-extra-args -Werror=undef -DNV_SPECTRE_V2=0 -I/tmp/B.JfsCO7/BUILD/NVIDIA-Linux-x86_64-390.132-no-compat32/kernel/nvidia -DNV_BUILD_MODULE_INSTANCES=0 -DNVIDIA_UNDEF_LEGACY_BIT_MACROS -UDEBUG -U_DEBUG -DNDEBUG -DMODULE -DKBUILD_BASENAME='"nv"' -DKBUILD_MODNAME='"nvidia"' /tmp/B.JfsCO7/BUILD/NVIDIA-Linux-x86_64-390.132-no-compat32/kernel/nvidia/nv.c | scripts/genksyms/genksyms -r /dev/null > /tmp/B.JfsCO7/BUILD/NVIDIA-Linux-x86_64-390.132-no-compat32/kernel/nvidia/.tmp_nv.ver; ld -m elf_x86_64 -z max-page-size=0x200000 -r -o /tmp/B.JfsCO7/BUILD/NVIDIA-Linux-x86_64-390.132-no-compat32/kernel/nvidia/.tmp_nv.o /tmp/B.JfsCO7/BUILD/NVIDIA-Linux-x86_64-390.132-no-compat32/kernel/nvidia/nv.o -T /tmp/B.JfsCO7/BUILD/NVIDIA-Linux-x86_64-390.132-no-compat32/kernel/nvidia/.tmp_nv.ver; mv -f /tmp/B.JfsCO7/BUILD/NVIDIA-Linux-x86_64-390.132-no-compat32/kernel/nvidia/.tmp_nv.o /tmp/B.JfsCO7/BUILD/NVIDIA-Linux-x86_64-390.132-no-compat32/kernel/nvidia/nv.o; rm -f /tmp/B.JfsCO7/BUILD/NVIDIA-Linux-x86_64-390.132-no-compat32/kernel/nvidia/.tmp_nv.ver; fi x86_64-pld-linux-gcc -Wp,-MD,/tmp/B.JfsCO7/BUILD/NVIDIA-Linux-x86_64-390.132-no-compat32/kernel/nvidia/.nv-procfs.o.d -nostdinc -isystem /usr/lib64/gcc/x86_64-pld-linux/10.1.0/include -I./arch/x86/include -I./arch/x86/include/generated -I./include -I./arch/x86/include/uapi -I./arch/x86/include/generated/uapi -I./include/uapi -I./include/generated/uapi -include ./include/linux/kconfig.h -include ./include/linux/compiler_types.h -D__KERNEL__ -Wall -Wundef -Werror=strict-prototypes -Wno-trigraphs -fno-strict-aliasing -fno-common -fshort-wchar -fno-PIE -Werror=implicit-function-declaration -Werror=implicit-int -Wno-format-security -std=gnu89 -mno-sse -mno-mmx -mno-sse2 -mno-3dnow -mno-avx -m64 -falign-jumps=1 -falign-loops=1 -mno-80387 -mno-fp-ret-in-387 -mpreferred-stack-boundary=3 -mskip-rax-setup -mtune=generic -mno-red-zone -mcmodel=kernel -DCONFIG_X86_X32_ABI -Wno-sign-compare -fno-asynchronous-unwind-tables -mindirect-branch=thunk-extern -mindirect-branch-register -fno-jump-tables -fno-delete-null-pointer-checks -Wno-frame-address -Wno-format-truncation -Wno-format-overflow -Wno-address-of-packed-member -O2 -fno-allow-store-data-races -fplugin=./scripts/gcc-plugins/structleak_plugin.so -fplugin=./scripts/gcc-plugins/randomize_layout_plugin.so -fplugin=./scripts/gcc-plugins/stackleak_plugin.so -fplugin-arg-structleak_plugin-byref-all -DSTRUCTLEAK_PLUGIN -DRANDSTRUCT_PLUGIN -fplugin-arg-randomize_layout_plugin-performance-mode -DSTACKLEAK_PLUGIN -fplugin-arg-stackleak_plugin-track-min-size=100 -Wframe-larger-than=2048 -fstack-protector-strong -Wno-unused-but-set-variable -Wimplicit-fallthrough -Wno-unused-const-variable -fno-var-tracking-assignments -gsplit-dwarf -gdwarf-4 -pg -mrecord-mcount -mfentry -DCC_USING_FENTRY -flive-patching=inline-clone -Wdeclaration-after-statement -Wvla -Wno-pointer-sign -Wno-stringop-truncation -Wno-zero-length-bounds -Wno-array-bounds -Wno-stringop-overflow -Wno-restrict -Wno-maybe-uninitialized -fno-strict-overflow -fno-merge-all-constants -fmerge-constants -fno-stack-check -fconserve-stack -Werror=date-time -Werror=incompatible-pointer-types -Werror=designated-init -fmacro-prefix-map=./= -fcf-protection=none -Wno-packed-not-aligned -I/tmp/B.JfsCO7/BUILD/NVIDIA-Linux-x86_64-390.132-no-compat32/kernel/common/inc -I/tmp/B.JfsCO7/BUILD/NVIDIA-Linux-x86_64-390.132-no-compat32/kernel -Wall -MD -Wsign-compare -Wno-cast-qual -Wno-error -D__KERNEL__ -DMODULE -DNVRM -DNV_VERSION_STRING=\"390.132\" -Wno-unused-function -Wuninitialized -fno-strict-aliasing -mno-red-zone -mcmodel=kernel -DNV_UVM_ENABLE -Wno-sign-compare -Wno-format-extra-args -Werror=undef -DNV_SPECTRE_V2=0 -I/tmp/B.JfsCO7/BUILD/NVIDIA-Linux-x86_64-390.132-no-compat32/kernel/nvidia -DNV_BUILD_MODULE_INSTANCES=0 -DNVIDIA_UNDEF_LEGACY_BIT_MACROS -UDEBUG -U_DEBUG -DNDEBUG -DMODULE -DKBUILD_BASENAME='"nv_procfs"' -DKBUILD_MODNAME='"nvidia"' -c -o /tmp/B.JfsCO7/BUILD/NVIDIA-Linux-x86_64-390.132-no-compat32/kernel/nvidia/nv-procfs.o /tmp/B.JfsCO7/BUILD/NVIDIA-Linux-x86_64-390.132-no-compat32/kernel/nvidia/nv-procfs.c ./tools/objtool/objtool orc generate --module --no-fp --retpoline --uaccess /tmp/B.JfsCO7/BUILD/NVIDIA-Linux-x86_64-390.132-no-compat32/kernel/nvidia/nv-procfs.o /tmp/B.JfsCO7/BUILD/NVIDIA-Linux-x86_64-390.132-no-compat32/kernel/nvidia/nv-procfs.o: warning: objtool: .text.unlikely: unexpected end of section if objdump -h /tmp/B.JfsCO7/BUILD/NVIDIA-Linux-x86_64-390.132-no-compat32/kernel/nvidia/nv-procfs.o | grep -q __ksymtab; then x86_64-pld-linux-gcc -E -D__GENKSYMS__ -Wp,-MD,/tmp/B.JfsCO7/BUILD/NVIDIA-Linux-x86_64-390.132-no-compat32/kernel/nvidia/.nv-procfs.o.d -nostdinc -isystem /usr/lib64/gcc/x86_64-pld-linux/10.1.0/include -I./arch/x86/include -I./arch/x86/include/generated -I./include -I./arch/x86/include/uapi -I./arch/x86/include/generated/uapi -I./include/uapi -I./include/generated/uapi -include ./include/linux/kconfig.h -include ./include/linux/compiler_types.h -D__KERNEL__ -Wall -Wundef -Werror=strict-prototypes -Wno-trigraphs -fno-strict-aliasing -fno-common -fshort-wchar -fno-PIE -Werror=implicit-function-declaration -Werror=implicit-int -Wno-format-security -std=gnu89 -mno-sse -mno-mmx -mno-sse2 -mno-3dnow -mno-avx -m64 -falign-jumps=1 -falign-loops=1 -mno-80387 -mno-fp-ret-in-387 -mpreferred-stack-boundary=3 -mskip-rax-setup -mtune=generic -mno-red-zone -mcmodel=kernel -DCONFIG_X86_X32_ABI -Wno-sign-compare -fno-asynchronous-unwind-tables -mindirect-branch=thunk-extern -mindirect-branch-register -fno-jump-tables -fno-delete-null-pointer-checks -Wno-frame-address -Wno-format-truncation -Wno-format-overflow -Wno-address-of-packed-member -O2 -fno-allow-store-data-races -fplugin=./scripts/gcc-plugins/structleak_plugin.so -fplugin=./scripts/gcc-plugins/randomize_layout_plugin.so -fplugin=./scripts/gcc-plugins/stackleak_plugin.so -fplugin-arg-structleak_plugin-byref-all -DSTRUCTLEAK_PLUGIN -DRANDSTRUCT_PLUGIN -fplugin-arg-randomize_layout_plugin-performance-mode -DSTACKLEAK_PLUGIN -fplugin-arg-stackleak_plugin-track-min-size=100 -Wframe-larger-than=2048 -fstack-protector-strong -Wno-unused-but-set-variable -Wimplicit-fallthrough -Wno-unused-const-variable -fno-var-tracking-assignments -gsplit-dwarf -gdwarf-4 -pg -mrecord-mcount -mfentry -DCC_USING_FENTRY -flive-patching=inline-clone -Wdeclaration-after-statement -Wvla -Wno-pointer-sign -Wno-stringop-truncation -Wno-zero-length-bounds -Wno-array-bounds -Wno-stringop-overflow -Wno-restrict -Wno-maybe-uninitialized -fno-strict-overflow -fno-merge-all-constants -fmerge-constants -fno-stack-check -fconserve-stack -Werror=date-time -Werror=incompatible-pointer-types -Werror=designated-init -fmacro-prefix-map=./= -fcf-protection=none -Wno-packed-not-aligned -I/tmp/B.JfsCO7/BUILD/NVIDIA-Linux-x86_64-390.132-no-compat32/kernel/common/inc -I/tmp/B.JfsCO7/BUILD/NVIDIA-Linux-x86_64-390.132-no-compat32/kernel -Wall -MD -Wsign-compare -Wno-cast-qual -Wno-error -D__KERNEL__ -DMODULE -DNVRM -DNV_VERSION_STRING=\"390.132\" -Wno-unused-function -Wuninitialized -fno-strict-aliasing -mno-red-zone -mcmodel=kernel -DNV_UVM_ENABLE -Wno-sign-compare -Wno-format-extra-args -Werror=undef -DNV_SPECTRE_V2=0 -I/tmp/B.JfsCO7/BUILD/NVIDIA-Linux-x86_64-390.132-no-compat32/kernel/nvidia -DNV_BUILD_MODULE_INSTANCES=0 -DNVIDIA_UNDEF_LEGACY_BIT_MACROS -UDEBUG -U_DEBUG -DNDEBUG -DMODULE -DKBUILD_BASENAME='"nv_procfs"' -DKBUILD_MODNAME='"nvidia"' /tmp/B.JfsCO7/BUILD/NVIDIA-Linux-x86_64-390.132-no-compat32/kernel/nvidia/nv-procfs.c | scripts/genksyms/genksyms -r /dev/null > /tmp/B.JfsCO7/BUILD/NVIDIA-Linux-x86_64-390.132-no-compat32/kernel/nvidia/.tmp_nv-procfs.ver; ld -m elf_x86_64 -z max-page-size=0x200000 -r -o /tmp/B.JfsCO7/BUILD/NVIDIA-Linux-x86_64-390.132-no-compat32/kernel/nvidia/.tmp_nv-procfs.o /tmp/B.JfsCO7/BUILD/NVIDIA-Linux-x86_64-390.132-no-compat32/kernel/nvidia/nv-procfs.o -T /tmp/B.JfsCO7/BUILD/NVIDIA-Linux-x86_64-390.132-no-compat32/kernel/nvidia/.tmp_nv-procfs.ver; mv -f /tmp/B.JfsCO7/BUILD/NVIDIA-Linux-x86_64-390.132-no-compat32/kernel/nvidia/.tmp_nv-procfs.o /tmp/B.JfsCO7/BUILD/NVIDIA-Linux-x86_64-390.132-no-compat32/kernel/nvidia/nv-procfs.o; rm -f /tmp/B.JfsCO7/BUILD/NVIDIA-Linux-x86_64-390.132-no-compat32/kernel/nvidia/.tmp_nv-procfs.ver; fi x86_64-pld-linux-gcc -Wp,-MD,/tmp/B.JfsCO7/BUILD/NVIDIA-Linux-x86_64-390.132-no-compat32/kernel/nvidia/.nv-p2p.o.d -nostdinc -isystem /usr/lib64/gcc/x86_64-pld-linux/10.1.0/include -I./arch/x86/include -I./arch/x86/include/generated -I./include -I./arch/x86/include/uapi -I./arch/x86/include/generated/uapi -I./include/uapi -I./include/generated/uapi -include ./include/linux/kconfig.h -include ./include/linux/compiler_types.h -D__KERNEL__ -Wall -Wundef -Werror=strict-prototypes -Wno-trigraphs -fno-strict-aliasing -fno-common -fshort-wchar -fno-PIE -Werror=implicit-function-declaration -Werror=implicit-int -Wno-format-security -std=gnu89 -mno-sse -mno-mmx -mno-sse2 -mno-3dnow -mno-avx -m64 -falign-jumps=1 -falign-loops=1 -mno-80387 -mno-fp-ret-in-387 -mpreferred-stack-boundary=3 -mskip-rax-setup -mtune=generic -mno-red-zone -mcmodel=kernel -DCONFIG_X86_X32_ABI -Wno-sign-compare -fno-asynchronous-unwind-tables -mindirect-branch=thunk-extern -mindirect-branch-register -fno-jump-tables -fno-delete-null-pointer-checks -Wno-frame-address -Wno-format-truncation -Wno-format-overflow -Wno-address-of-packed-member -O2 -fno-allow-store-data-races -fplugin=./scripts/gcc-plugins/structleak_plugin.so -fplugin=./scripts/gcc-plugins/randomize_layout_plugin.so -fplugin=./scripts/gcc-plugins/stackleak_plugin.so -fplugin-arg-structleak_plugin-byref-all -DSTRUCTLEAK_PLUGIN -DRANDSTRUCT_PLUGIN -fplugin-arg-randomize_layout_plugin-performance-mode -DSTACKLEAK_PLUGIN -fplugin-arg-stackleak_plugin-track-min-size=100 -Wframe-larger-than=2048 -fstack-protector-strong -Wno-unused-but-set-variable -Wimplicit-fallthrough -Wno-unused-const-variable -fno-var-tracking-assignments -gsplit-dwarf -gdwarf-4 -pg -mrecord-mcount -mfentry -DCC_USING_FENTRY -flive-patching=inline-clone -Wdeclaration-after-statement -Wvla -Wno-pointer-sign -Wno-stringop-truncation -Wno-zero-length-bounds -Wno-array-bounds -Wno-stringop-overflow -Wno-restrict -Wno-maybe-uninitialized -fno-strict-overflow -fno-merge-all-constants -fmerge-constants -fno-stack-check -fconserve-stack -Werror=date-time -Werror=incompatible-pointer-types -Werror=designated-init -fmacro-prefix-map=./= -fcf-protection=none -Wno-packed-not-aligned -I/tmp/B.JfsCO7/BUILD/NVIDIA-Linux-x86_64-390.132-no-compat32/kernel/common/inc -I/tmp/B.JfsCO7/BUILD/NVIDIA-Linux-x86_64-390.132-no-compat32/kernel -Wall -MD -Wsign-compare -Wno-cast-qual -Wno-error -D__KERNEL__ -DMODULE -DNVRM -DNV_VERSION_STRING=\"390.132\" -Wno-unused-function -Wuninitialized -fno-strict-aliasing -mno-red-zone -mcmodel=kernel -DNV_UVM_ENABLE -Wno-sign-compare -Wno-format-extra-args -Werror=undef -DNV_SPECTRE_V2=0 -I/tmp/B.JfsCO7/BUILD/NVIDIA-Linux-x86_64-390.132-no-compat32/kernel/nvidia -DNV_BUILD_MODULE_INSTANCES=0 -DNVIDIA_UNDEF_LEGACY_BIT_MACROS -UDEBUG -U_DEBUG -DNDEBUG -DMODULE -DKBUILD_BASENAME='"nv_p2p"' -DKBUILD_MODNAME='"nvidia"' -c -o /tmp/B.JfsCO7/BUILD/NVIDIA-Linux-x86_64-390.132-no-compat32/kernel/nvidia/nv-p2p.o /tmp/B.JfsCO7/BUILD/NVIDIA-Linux-x86_64-390.132-no-compat32/kernel/nvidia/nv-p2p.c ./tools/objtool/objtool orc generate --module --no-fp --retpoline --uaccess /tmp/B.JfsCO7/BUILD/NVIDIA-Linux-x86_64-390.132-no-compat32/kernel/nvidia/nv-p2p.o if objdump -h /tmp/B.JfsCO7/BUILD/NVIDIA-Linux-x86_64-390.132-no-compat32/kernel/nvidia/nv-p2p.o | grep -q __ksymtab; then x86_64-pld-linux-gcc -E -D__GENKSYMS__ -Wp,-MD,/tmp/B.JfsCO7/BUILD/NVIDIA-Linux-x86_64-390.132-no-compat32/kernel/nvidia/.nv-p2p.o.d -nostdinc -isystem /usr/lib64/gcc/x86_64-pld-linux/10.1.0/include -I./arch/x86/include -I./arch/x86/include/generated -I./include -I./arch/x86/include/uapi -I./arch/x86/include/generated/uapi -I./include/uapi -I./include/generated/uapi -include ./include/linux/kconfig.h -include ./include/linux/compiler_types.h -D__KERNEL__ -Wall -Wundef -Werror=strict-prototypes -Wno-trigraphs -fno-strict-aliasing -fno-common -fshort-wchar -fno-PIE -Werror=implicit-function-declaration -Werror=implicit-int -Wno-format-security -std=gnu89 -mno-sse -mno-mmx -mno-sse2 -mno-3dnow -mno-avx -m64 -falign-jumps=1 -falign-loops=1 -mno-80387 -mno-fp-ret-in-387 -mpreferred-stack-boundary=3 -mskip-rax-setup -mtune=generic -mno-red-zone -mcmodel=kernel -DCONFIG_X86_X32_ABI -Wno-sign-compare -fno-asynchronous-unwind-tables -mindirect-branch=thunk-extern -mindirect-branch-register -fno-jump-tables -fno-delete-null-pointer-checks -Wno-frame-address -Wno-format-truncation -Wno-format-overflow -Wno-address-of-packed-member -O2 -fno-allow-store-data-races -fplugin=./scripts/gcc-plugins/structleak_plugin.so -fplugin=./scripts/gcc-plugins/randomize_layout_plugin.so -fplugin=./scripts/gcc-plugins/stackleak_plugin.so -fplugin-arg-structleak_plugin-byref-all -DSTRUCTLEAK_PLUGIN -DRANDSTRUCT_PLUGIN -fplugin-arg-randomize_layout_plugin-performance-mode -DSTACKLEAK_PLUGIN -fplugin-arg-stackleak_plugin-track-min-size=100 -Wframe-larger-than=2048 -fstack-protector-strong -Wno-unused-but-set-variable -Wimplicit-fallthrough -Wno-unused-const-variable -fno-var-tracking-assignments -gsplit-dwarf -gdwarf-4 -pg -mrecord-mcount -mfentry -DCC_USING_FENTRY -flive-patching=inline-clone -Wdeclaration-after-statement -Wvla -Wno-pointer-sign -Wno-stringop-truncation -Wno-zero-length-bounds -Wno-array-bounds -Wno-stringop-overflow -Wno-restrict -Wno-maybe-uninitialized -fno-strict-overflow -fno-merge-all-constants -fmerge-constants -fno-stack-check -fconserve-stack -Werror=date-time -Werror=incompatible-pointer-types -Werror=designated-init -fmacro-prefix-map=./= -fcf-protection=none -Wno-packed-not-aligned -I/tmp/B.JfsCO7/BUILD/NVIDIA-Linux-x86_64-390.132-no-compat32/kernel/common/inc -I/tmp/B.JfsCO7/BUILD/NVIDIA-Linux-x86_64-390.132-no-compat32/kernel -Wall -MD -Wsign-compare -Wno-cast-qual -Wno-error -D__KERNEL__ -DMODULE -DNVRM -DNV_VERSION_STRING=\"390.132\" -Wno-unused-function -Wuninitialized -fno-strict-aliasing -mno-red-zone -mcmodel=kernel -DNV_UVM_ENABLE -Wno-sign-compare -Wno-format-extra-args -Werror=undef -DNV_SPECTRE_V2=0 -I/tmp/B.JfsCO7/BUILD/NVIDIA-Linux-x86_64-390.132-no-compat32/kernel/nvidia -DNV_BUILD_MODULE_INSTANCES=0 -DNVIDIA_UNDEF_LEGACY_BIT_MACROS -UDEBUG -U_DEBUG -DNDEBUG -DMODULE -DKBUILD_BASENAME='"nv_p2p"' -DKBUILD_MODNAME='"nvidia"' /tmp/B.JfsCO7/BUILD/NVIDIA-Linux-x86_64-390.132-no-compat32/kernel/nvidia/nv-p2p.c | scripts/genksyms/genksyms -r /dev/null > /tmp/B.JfsCO7/BUILD/NVIDIA-Linux-x86_64-390.132-no-compat32/kernel/nvidia/.tmp_nv-p2p.ver; ld -m elf_x86_64 -z max-page-size=0x200000 -r -o /tmp/B.JfsCO7/BUILD/NVIDIA-Linux-x86_64-390.132-no-compat32/kernel/nvidia/.tmp_nv-p2p.o /tmp/B.JfsCO7/BUILD/NVIDIA-Linux-x86_64-390.132-no-compat32/kernel/nvidia/nv-p2p.o -T /tmp/B.JfsCO7/BUILD/NVIDIA-Linux-x86_64-390.132-no-compat32/kernel/nvidia/.tmp_nv-p2p.ver; mv -f /tmp/B.JfsCO7/BUILD/NVIDIA-Linux-x86_64-390.132-no-compat32/kernel/nvidia/.tmp_nv-p2p.o /tmp/B.JfsCO7/BUILD/NVIDIA-Linux-x86_64-390.132-no-compat32/kernel/nvidia/nv-p2p.o; rm -f /tmp/B.JfsCO7/BUILD/NVIDIA-Linux-x86_64-390.132-no-compat32/kernel/nvidia/.tmp_nv-p2p.ver; fi x86_64-pld-linux-gcc -Wp,-MD,/tmp/B.JfsCO7/BUILD/NVIDIA-Linux-x86_64-390.132-no-compat32/kernel/nvidia/.nv-usermap.o.d -nostdinc -isystem /usr/lib64/gcc/x86_64-pld-linux/10.1.0/include -I./arch/x86/include -I./arch/x86/include/generated -I./include -I./arch/x86/include/uapi -I./arch/x86/include/generated/uapi -I./include/uapi -I./include/generated/uapi -include ./include/linux/kconfig.h -include ./include/linux/compiler_types.h -D__KERNEL__ -Wall -Wundef -Werror=strict-prototypes -Wno-trigraphs -fno-strict-aliasing -fno-common -fshort-wchar -fno-PIE -Werror=implicit-function-declaration -Werror=implicit-int -Wno-format-security -std=gnu89 -mno-sse -mno-mmx -mno-sse2 -mno-3dnow -mno-avx -m64 -falign-jumps=1 -falign-loops=1 -mno-80387 -mno-fp-ret-in-387 -mpreferred-stack-boundary=3 -mskip-rax-setup -mtune=generic -mno-red-zone -mcmodel=kernel -DCONFIG_X86_X32_ABI -Wno-sign-compare -fno-asynchronous-unwind-tables -mindirect-branch=thunk-extern -mindirect-branch-register -fno-jump-tables -fno-delete-null-pointer-checks -Wno-frame-address -Wno-format-truncation -Wno-format-overflow -Wno-address-of-packed-member -O2 -fno-allow-store-data-races -fplugin=./scripts/gcc-plugins/structleak_plugin.so -fplugin=./scripts/gcc-plugins/randomize_layout_plugin.so -fplugin=./scripts/gcc-plugins/stackleak_plugin.so -fplugin-arg-structleak_plugin-byref-all -DSTRUCTLEAK_PLUGIN -DRANDSTRUCT_PLUGIN -fplugin-arg-randomize_layout_plugin-performance-mode -DSTACKLEAK_PLUGIN -fplugin-arg-stackleak_plugin-track-min-size=100 -Wframe-larger-than=2048 -fstack-protector-strong -Wno-unused-but-set-variable -Wimplicit-fallthrough -Wno-unused-const-variable -fno-var-tracking-assignments -gsplit-dwarf -gdwarf-4 -pg -mrecord-mcount -mfentry -DCC_USING_FENTRY -flive-patching=inline-clone -Wdeclaration-after-statement -Wvla -Wno-pointer-sign -Wno-stringop-truncation -Wno-zero-length-bounds -Wno-array-bounds -Wno-stringop-overflow -Wno-restrict -Wno-maybe-uninitialized -fno-strict-overflow -fno-merge-all-constants -fmerge-constants -fno-stack-check -fconserve-stack -Werror=date-time -Werror=incompatible-pointer-types -Werror=designated-init -fmacro-prefix-map=./= -fcf-protection=none -Wno-packed-not-aligned -I/tmp/B.JfsCO7/BUILD/NVIDIA-Linux-x86_64-390.132-no-compat32/kernel/common/inc -I/tmp/B.JfsCO7/BUILD/NVIDIA-Linux-x86_64-390.132-no-compat32/kernel -Wall -MD -Wsign-compare -Wno-cast-qual -Wno-error -D__KERNEL__ -DMODULE -DNVRM -DNV_VERSION_STRING=\"390.132\" -Wno-unused-function -Wuninitialized -fno-strict-aliasing -mno-red-zone -mcmodel=kernel -DNV_UVM_ENABLE -Wno-sign-compare -Wno-format-extra-args -Werror=undef -DNV_SPECTRE_V2=0 -I/tmp/B.JfsCO7/BUILD/NVIDIA-Linux-x86_64-390.132-no-compat32/kernel/nvidia -DNV_BUILD_MODULE_INSTANCES=0 -DNVIDIA_UNDEF_LEGACY_BIT_MACROS -UDEBUG -U_DEBUG -DNDEBUG -DMODULE -DKBUILD_BASENAME='"nv_usermap"' -DKBUILD_MODNAME='"nvidia"' -c -o /tmp/B.JfsCO7/BUILD/NVIDIA-Linux-x86_64-390.132-no-compat32/kernel/nvidia/nv-usermap.o /tmp/B.JfsCO7/BUILD/NVIDIA-Linux-x86_64-390.132-no-compat32/kernel/nvidia/nv-usermap.c ./tools/objtool/objtool orc generate --module --no-fp --retpoline --uaccess /tmp/B.JfsCO7/BUILD/NVIDIA-Linux-x86_64-390.132-no-compat32/kernel/nvidia/nv-usermap.o if objdump -h /tmp/B.JfsCO7/BUILD/NVIDIA-Linux-x86_64-390.132-no-compat32/kernel/nvidia/nv-usermap.o | grep -q __ksymtab; then x86_64-pld-linux-gcc -E -D__GENKSYMS__ -Wp,-MD,/tmp/B.JfsCO7/BUILD/NVIDIA-Linux-x86_64-390.132-no-compat32/kernel/nvidia/.nv-usermap.o.d -nostdinc -isystem /usr/lib64/gcc/x86_64-pld-linux/10.1.0/include -I./arch/x86/include -I./arch/x86/include/generated -I./include -I./arch/x86/include/uapi -I./arch/x86/include/generated/uapi -I./include/uapi -I./include/generated/uapi -include ./include/linux/kconfig.h -include ./include/linux/compiler_types.h -D__KERNEL__ -Wall -Wundef -Werror=strict-prototypes -Wno-trigraphs -fno-strict-aliasing -fno-common -fshort-wchar -fno-PIE -Werror=implicit-function-declaration -Werror=implicit-int -Wno-format-security -std=gnu89 -mno-sse -mno-mmx -mno-sse2 -mno-3dnow -mno-avx -m64 -falign-jumps=1 -falign-loops=1 -mno-80387 -mno-fp-ret-in-387 -mpreferred-stack-boundary=3 -mskip-rax-setup -mtune=generic -mno-red-zone -mcmodel=kernel -DCONFIG_X86_X32_ABI -Wno-sign-compare -fno-asynchronous-unwind-tables -mindirect-branch=thunk-extern -mindirect-branch-register -fno-jump-tables -fno-delete-null-pointer-checks -Wno-frame-address -Wno-format-truncation -Wno-format-overflow -Wno-address-of-packed-member -O2 -fno-allow-store-data-races -fplugin=./scripts/gcc-plugins/structleak_plugin.so -fplugin=./scripts/gcc-plugins/randomize_layout_plugin.so -fplugin=./scripts/gcc-plugins/stackleak_plugin.so -fplugin-arg-structleak_plugin-byref-all -DSTRUCTLEAK_PLUGIN -DRANDSTRUCT_PLUGIN -fplugin-arg-randomize_layout_plugin-performance-mode -DSTACKLEAK_PLUGIN -fplugin-arg-stackleak_plugin-track-min-size=100 -Wframe-larger-than=2048 -fstack-protector-strong -Wno-unused-but-set-variable -Wimplicit-fallthrough -Wno-unused-const-variable -fno-var-tracking-assignments -gsplit-dwarf -gdwarf-4 -pg -mrecord-mcount -mfentry -DCC_USING_FENTRY -flive-patching=inline-clone -Wdeclaration-after-statement -Wvla -Wno-pointer-sign -Wno-stringop-truncation -Wno-zero-length-bounds -Wno-array-bounds -Wno-stringop-overflow -Wno-restrict -Wno-maybe-uninitialized -fno-strict-overflow -fno-merge-all-constants -fmerge-constants -fno-stack-check -fconserve-stack -Werror=date-time -Werror=incompatible-pointer-types -Werror=designated-init -fmacro-prefix-map=./= -fcf-protection=none -Wno-packed-not-aligned -I/tmp/B.JfsCO7/BUILD/NVIDIA-Linux-x86_64-390.132-no-compat32/kernel/common/inc -I/tmp/B.JfsCO7/BUILD/NVIDIA-Linux-x86_64-390.132-no-compat32/kernel -Wall -MD -Wsign-compare -Wno-cast-qual -Wno-error -D__KERNEL__ -DMODULE -DNVRM -DNV_VERSION_STRING=\"390.132\" -Wno-unused-function -Wuninitialized -fno-strict-aliasing -mno-red-zone -mcmodel=kernel -DNV_UVM_ENABLE -Wno-sign-compare -Wno-format-extra-args -Werror=undef -DNV_SPECTRE_V2=0 -I/tmp/B.JfsCO7/BUILD/NVIDIA-Linux-x86_64-390.132-no-compat32/kernel/nvidia -DNV_BUILD_MODULE_INSTANCES=0 -DNVIDIA_UNDEF_LEGACY_BIT_MACROS -UDEBUG -U_DEBUG -DNDEBUG -DMODULE -DKBUILD_BASENAME='"nv_usermap"' -DKBUILD_MODNAME='"nvidia"' /tmp/B.JfsCO7/BUILD/NVIDIA-Linux-x86_64-390.132-no-compat32/kernel/nvidia/nv-usermap.c | scripts/genksyms/genksyms -r /dev/null > /tmp/B.JfsCO7/BUILD/NVIDIA-Linux-x86_64-390.132-no-compat32/kernel/nvidia/.tmp_nv-usermap.ver; ld -m elf_x86_64 -z max-page-size=0x200000 -r -o /tmp/B.JfsCO7/BUILD/NVIDIA-Linux-x86_64-390.132-no-compat32/kernel/nvidia/.tmp_nv-usermap.o /tmp/B.JfsCO7/BUILD/NVIDIA-Linux-x86_64-390.132-no-compat32/kernel/nvidia/nv-usermap.o -T /tmp/B.JfsCO7/BUILD/NVIDIA-Linux-x86_64-390.132-no-compat32/kernel/nvidia/.tmp_nv-usermap.ver; mv -f /tmp/B.JfsCO7/BUILD/NVIDIA-Linux-x86_64-390.132-no-compat32/kernel/nvidia/.tmp_nv-usermap.o /tmp/B.JfsCO7/BUILD/NVIDIA-Linux-x86_64-390.132-no-compat32/kernel/nvidia/nv-usermap.o; rm -f /tmp/B.JfsCO7/BUILD/NVIDIA-Linux-x86_64-390.132-no-compat32/kernel/nvidia/.tmp_nv-usermap.ver; fi x86_64-pld-linux-gcc -Wp,-MD,/tmp/B.JfsCO7/BUILD/NVIDIA-Linux-x86_64-390.132-no-compat32/kernel/nvidia/.nv-vtophys.o.d -nostdinc -isystem /usr/lib64/gcc/x86_64-pld-linux/10.1.0/include -I./arch/x86/include -I./arch/x86/include/generated -I./include -I./arch/x86/include/uapi -I./arch/x86/include/generated/uapi -I./include/uapi -I./include/generated/uapi -include ./include/linux/kconfig.h -include ./include/linux/compiler_types.h -D__KERNEL__ -Wall -Wundef -Werror=strict-prototypes -Wno-trigraphs -fno-strict-aliasing -fno-common -fshort-wchar -fno-PIE -Werror=implicit-function-declaration -Werror=implicit-int -Wno-format-security -std=gnu89 -mno-sse -mno-mmx -mno-sse2 -mno-3dnow -mno-avx -m64 -falign-jumps=1 -falign-loops=1 -mno-80387 -mno-fp-ret-in-387 -mpreferred-stack-boundary=3 -mskip-rax-setup -mtune=generic -mno-red-zone -mcmodel=kernel -DCONFIG_X86_X32_ABI -Wno-sign-compare -fno-asynchronous-unwind-tables -mindirect-branch=thunk-extern -mindirect-branch-register -fno-jump-tables -fno-delete-null-pointer-checks -Wno-frame-address -Wno-format-truncation -Wno-format-overflow -Wno-address-of-packed-member -O2 -fno-allow-store-data-races -fplugin=./scripts/gcc-plugins/structleak_plugin.so -fplugin=./scripts/gcc-plugins/randomize_layout_plugin.so -fplugin=./scripts/gcc-plugins/stackleak_plugin.so -fplugin-arg-structleak_plugin-byref-all -DSTRUCTLEAK_PLUGIN -DRANDSTRUCT_PLUGIN -fplugin-arg-randomize_layout_plugin-performance-mode -DSTACKLEAK_PLUGIN -fplugin-arg-stackleak_plugin-track-min-size=100 -Wframe-larger-than=2048 -fstack-protector-strong -Wno-unused-but-set-variable -Wimplicit-fallthrough -Wno-unused-const-variable -fno-var-tracking-assignments -gsplit-dwarf -gdwarf-4 -pg -mrecord-mcount -mfentry -DCC_USING_FENTRY -flive-patching=inline-clone -Wdeclaration-after-statement -Wvla -Wno-pointer-sign -Wno-stringop-truncation -Wno-zero-length-bounds -Wno-array-bounds -Wno-stringop-overflow -Wno-restrict -Wno-maybe-uninitialized -fno-strict-overflow -fno-merge-all-constants -fmerge-constants -fno-stack-check -fconserve-stack -Werror=date-time -Werror=incompatible-pointer-types -Werror=designated-init -fmacro-prefix-map=./= -fcf-protection=none -Wno-packed-not-aligned -I/tmp/B.JfsCO7/BUILD/NVIDIA-Linux-x86_64-390.132-no-compat32/kernel/common/inc -I/tmp/B.JfsCO7/BUILD/NVIDIA-Linux-x86_64-390.132-no-compat32/kernel -Wall -MD -Wsign-compare -Wno-cast-qual -Wno-error -D__KERNEL__ -DMODULE -DNVRM -DNV_VERSION_STRING=\"390.132\" -Wno-unused-function -Wuninitialized -fno-strict-aliasing -mno-red-zone -mcmodel=kernel -DNV_UVM_ENABLE -Wno-sign-compare -Wno-format-extra-args -Werror=undef -DNV_SPECTRE_V2=0 -I/tmp/B.JfsCO7/BUILD/NVIDIA-Linux-x86_64-390.132-no-compat32/kernel/nvidia -DNV_BUILD_MODULE_INSTANCES=0 -DNVIDIA_UNDEF_LEGACY_BIT_MACROS -UDEBUG -U_DEBUG -DNDEBUG -DMODULE -DKBUILD_BASENAME='"nv_vtophys"' -DKBUILD_MODNAME='"nvidia"' -c -o /tmp/B.JfsCO7/BUILD/NVIDIA-Linux-x86_64-390.132-no-compat32/kernel/nvidia/nv-vtophys.o /tmp/B.JfsCO7/BUILD/NVIDIA-Linux-x86_64-390.132-no-compat32/kernel/nvidia/nv-vtophys.c ./tools/objtool/objtool orc generate --module --no-fp --retpoline --uaccess /tmp/B.JfsCO7/BUILD/NVIDIA-Linux-x86_64-390.132-no-compat32/kernel/nvidia/nv-vtophys.o if objdump -h /tmp/B.JfsCO7/BUILD/NVIDIA-Linux-x86_64-390.132-no-compat32/kernel/nvidia/nv-vtophys.o | grep -q __ksymtab; then x86_64-pld-linux-gcc -E -D__GENKSYMS__ -Wp,-MD,/tmp/B.JfsCO7/BUILD/NVIDIA-Linux-x86_64-390.132-no-compat32/kernel/nvidia/.nv-vtophys.o.d -nostdinc -isystem /usr/lib64/gcc/x86_64-pld-linux/10.1.0/include -I./arch/x86/include -I./arch/x86/include/generated -I./include -I./arch/x86/include/uapi -I./arch/x86/include/generated/uapi -I./include/uapi -I./include/generated/uapi -include ./include/linux/kconfig.h -include ./include/linux/compiler_types.h -D__KERNEL__ -Wall -Wundef -Werror=strict-prototypes -Wno-trigraphs -fno-strict-aliasing -fno-common -fshort-wchar -fno-PIE -Werror=implicit-function-declaration -Werror=implicit-int -Wno-format-security -std=gnu89 -mno-sse -mno-mmx -mno-sse2 -mno-3dnow -mno-avx -m64 -falign-jumps=1 -falign-loops=1 -mno-80387 -mno-fp-ret-in-387 -mpreferred-stack-boundary=3 -mskip-rax-setup -mtune=generic -mno-red-zone -mcmodel=kernel -DCONFIG_X86_X32_ABI -Wno-sign-compare -fno-asynchronous-unwind-tables -mindirect-branch=thunk-extern -mindirect-branch-register -fno-jump-tables -fno-delete-null-pointer-checks -Wno-frame-address -Wno-format-truncation -Wno-format-overflow -Wno-address-of-packed-member -O2 -fno-allow-store-data-races -fplugin=./scripts/gcc-plugins/structleak_plugin.so -fplugin=./scripts/gcc-plugins/randomize_layout_plugin.so -fplugin=./scripts/gcc-plugins/stackleak_plugin.so -fplugin-arg-structleak_plugin-byref-all -DSTRUCTLEAK_PLUGIN -DRANDSTRUCT_PLUGIN -fplugin-arg-randomize_layout_plugin-performance-mode -DSTACKLEAK_PLUGIN -fplugin-arg-stackleak_plugin-track-min-size=100 -Wframe-larger-than=2048 -fstack-protector-strong -Wno-unused-but-set-variable -Wimplicit-fallthrough -Wno-unused-const-variable -fno-var-tracking-assignments -gsplit-dwarf -gdwarf-4 -pg -mrecord-mcount -mfentry -DCC_USING_FENTRY -flive-patching=inline-clone -Wdeclaration-after-statement -Wvla -Wno-pointer-sign -Wno-stringop-truncation -Wno-zero-length-bounds -Wno-array-bounds -Wno-stringop-overflow -Wno-restrict -Wno-maybe-uninitialized -fno-strict-overflow -fno-merge-all-constants -fmerge-constants -fno-stack-check -fconserve-stack -Werror=date-time -Werror=incompatible-pointer-types -Werror=designated-init -fmacro-prefix-map=./= -fcf-protection=none -Wno-packed-not-aligned -I/tmp/B.JfsCO7/BUILD/NVIDIA-Linux-x86_64-390.132-no-compat32/kernel/common/inc -I/tmp/B.JfsCO7/BUILD/NVIDIA-Linux-x86_64-390.132-no-compat32/kernel -Wall -MD -Wsign-compare -Wno-cast-qual -Wno-error -D__KERNEL__ -DMODULE -DNVRM -DNV_VERSION_STRING=\"390.132\" -Wno-unused-function -Wuninitialized -fno-strict-aliasing -mno-red-zone -mcmodel=kernel -DNV_UVM_ENABLE -Wno-sign-compare -Wno-format-extra-args -Werror=undef -DNV_SPECTRE_V2=0 -I/tmp/B.JfsCO7/BUILD/NVIDIA-Linux-x86_64-390.132-no-compat32/kernel/nvidia -DNV_BUILD_MODULE_INSTANCES=0 -DNVIDIA_UNDEF_LEGACY_BIT_MACROS -UDEBUG -U_DEBUG -DNDEBUG -DMODULE -DKBUILD_BASENAME='"nv_vtophys"' -DKBUILD_MODNAME='"nvidia"' /tmp/B.JfsCO7/BUILD/NVIDIA-Linux-x86_64-390.132-no-compat32/kernel/nvidia/nv-vtophys.c | scripts/genksyms/genksyms -r /dev/null > /tmp/B.JfsCO7/BUILD/NVIDIA-Linux-x86_64-390.132-no-compat32/kernel/nvidia/.tmp_nv-vtophys.ver; ld -m elf_x86_64 -z max-page-size=0x200000 -r -o /tmp/B.JfsCO7/BUILD/NVIDIA-Linux-x86_64-390.132-no-compat32/kernel/nvidia/.tmp_nv-vtophys.o /tmp/B.JfsCO7/BUILD/NVIDIA-Linux-x86_64-390.132-no-compat32/kernel/nvidia/nv-vtophys.o -T /tmp/B.JfsCO7/BUILD/NVIDIA-Linux-x86_64-390.132-no-compat32/kernel/nvidia/.tmp_nv-vtophys.ver; mv -f /tmp/B.JfsCO7/BUILD/NVIDIA-Linux-x86_64-390.132-no-compat32/kernel/nvidia/.tmp_nv-vtophys.o /tmp/B.JfsCO7/BUILD/NVIDIA-Linux-x86_64-390.132-no-compat32/kernel/nvidia/nv-vtophys.o; rm -f /tmp/B.JfsCO7/BUILD/NVIDIA-Linux-x86_64-390.132-no-compat32/kernel/nvidia/.tmp_nv-vtophys.ver; fi x86_64-pld-linux-gcc -Wp,-MD,/tmp/B.JfsCO7/BUILD/NVIDIA-Linux-x86_64-390.132-no-compat32/kernel/nvidia/.nv-vm.o.d -nostdinc -isystem /usr/lib64/gcc/x86_64-pld-linux/10.1.0/include -I./arch/x86/include -I./arch/x86/include/generated -I./include -I./arch/x86/include/uapi -I./arch/x86/include/generated/uapi -I./include/uapi -I./include/generated/uapi -include ./include/linux/kconfig.h -include ./include/linux/compiler_types.h -D__KERNEL__ -Wall -Wundef -Werror=strict-prototypes -Wno-trigraphs -fno-strict-aliasing -fno-common -fshort-wchar -fno-PIE -Werror=implicit-function-declaration -Werror=implicit-int -Wno-format-security -std=gnu89 -mno-sse -mno-mmx -mno-sse2 -mno-3dnow -mno-avx -m64 -falign-jumps=1 -falign-loops=1 -mno-80387 -mno-fp-ret-in-387 -mpreferred-stack-boundary=3 -mskip-rax-setup -mtune=generic -mno-red-zone -mcmodel=kernel -DCONFIG_X86_X32_ABI -Wno-sign-compare -fno-asynchronous-unwind-tables -mindirect-branch=thunk-extern -mindirect-branch-register -fno-jump-tables -fno-delete-null-pointer-checks -Wno-frame-address -Wno-format-truncation -Wno-format-overflow -Wno-address-of-packed-member -O2 -fno-allow-store-data-races -fplugin=./scripts/gcc-plugins/structleak_plugin.so -fplugin=./scripts/gcc-plugins/randomize_layout_plugin.so -fplugin=./scripts/gcc-plugins/stackleak_plugin.so -fplugin-arg-structleak_plugin-byref-all -DSTRUCTLEAK_PLUGIN -DRANDSTRUCT_PLUGIN -fplugin-arg-randomize_layout_plugin-performance-mode -DSTACKLEAK_PLUGIN -fplugin-arg-stackleak_plugin-track-min-size=100 -Wframe-larger-than=2048 -fstack-protector-strong -Wno-unused-but-set-variable -Wimplicit-fallthrough -Wno-unused-const-variable -fno-var-tracking-assignments -gsplit-dwarf -gdwarf-4 -pg -mrecord-mcount -mfentry -DCC_USING_FENTRY -flive-patching=inline-clone -Wdeclaration-after-statement -Wvla -Wno-pointer-sign -Wno-stringop-truncation -Wno-zero-length-bounds -Wno-array-bounds -Wno-stringop-overflow -Wno-restrict -Wno-maybe-uninitialized -fno-strict-overflow -fno-merge-all-constants -fmerge-constants -fno-stack-check -fconserve-stack -Werror=date-time -Werror=incompatible-pointer-types -Werror=designated-init -fmacro-prefix-map=./= -fcf-protection=none -Wno-packed-not-aligned -I/tmp/B.JfsCO7/BUILD/NVIDIA-Linux-x86_64-390.132-no-compat32/kernel/common/inc -I/tmp/B.JfsCO7/BUILD/NVIDIA-Linux-x86_64-390.132-no-compat32/kernel -Wall -MD -Wsign-compare -Wno-cast-qual -Wno-error -D__KERNEL__ -DMODULE -DNVRM -DNV_VERSION_STRING=\"390.132\" -Wno-unused-function -Wuninitialized -fno-strict-aliasing -mno-red-zone -mcmodel=kernel -DNV_UVM_ENABLE -Wno-sign-compare -Wno-format-extra-args -Werror=undef -DNV_SPECTRE_V2=0 -I/tmp/B.JfsCO7/BUILD/NVIDIA-Linux-x86_64-390.132-no-compat32/kernel/nvidia -DNV_BUILD_MODULE_INSTANCES=0 -DNVIDIA_UNDEF_LEGACY_BIT_MACROS -UDEBUG -U_DEBUG -DNDEBUG -DMODULE -DKBUILD_BASENAME='"nv_vm"' -DKBUILD_MODNAME='"nvidia"' -c -o /tmp/B.JfsCO7/BUILD/NVIDIA-Linux-x86_64-390.132-no-compat32/kernel/nvidia/nv-vm.o /tmp/B.JfsCO7/BUILD/NVIDIA-Linux-x86_64-390.132-no-compat32/kernel/nvidia/nv-vm.c /tmp/B.JfsCO7/BUILD/NVIDIA-Linux-x86_64-390.132-no-compat32/kernel/nvidia/nv-vm.c: In function 'nv_set_memory_array_type': /tmp/B.JfsCO7/BUILD/NVIDIA-Linux-x86_64-390.132-no-compat32/kernel/nvidia/nv-vm.c:86:13: error: implicit declaration of function 'set_memory_array_uc'; did you mean 'set_pages_array_uc'? [-Werror=implicit-function-declaration] 86 | set_memory_array_uc(pages, num_pages); | ^~~~~~~~~~~~~~~~~~~ | set_pages_array_uc /tmp/B.JfsCO7/BUILD/NVIDIA-Linux-x86_64-390.132-no-compat32/kernel/nvidia/nv-vm.c:89:13: error: implicit declaration of function 'set_memory_array_wb'; did you mean 'set_pages_array_wb'? [-Werror=implicit-function-declaration] 89 | set_memory_array_wb(pages, num_pages); | ^~~~~~~~~~~~~~~~~~~ | set_pages_array_wb cc1: some warnings being treated as errors make[2]: *** [scripts/Makefile.build:267: /tmp/B.JfsCO7/BUILD/NVIDIA-Linux-x86_64-390.132-no-compat32/kernel/nvidia/nv-vm.o] Error 1 make[2]: *** Waiting for unfinished jobs.... x86_64-pld-linux-gcc -Wp,-MD,/tmp/B.JfsCO7/BUILD/NVIDIA-Linux-x86_64-390.132-no-compat32/kernel/nvidia/.os-mlock.o.d -nostdinc -isystem /usr/lib64/gcc/x86_64-pld-linux/10.1.0/include -I./arch/x86/include -I./arch/x86/include/generated -I./include -I./arch/x86/include/uapi -I./arch/x86/include/generated/uapi -I./include/uapi -I./include/generated/uapi -include ./include/linux/kconfig.h -include ./include/linux/compiler_types.h -D__KERNEL__ -Wall -Wundef -Werror=strict-prototypes -Wno-trigraphs -fno-strict-aliasing -fno-common -fshort-wchar -fno-PIE -Werror=implicit-function-declaration -Werror=implicit-int -Wno-format-security -std=gnu89 -mno-sse -mno-mmx -mno-sse2 -mno-3dnow -mno-avx -m64 -falign-jumps=1 -falign-loops=1 -mno-80387 -mno-fp-ret-in-387 -mpreferred-stack-boundary=3 -mskip-rax-setup -mtune=generic -mno-red-zone -mcmodel=kernel -DCONFIG_X86_X32_ABI -Wno-sign-compare -fno-asynchronous-unwind-tables -mindirect-branch=thunk-extern -mindirect-branch-register -fno-jump-tables -fno-delete-null-pointer-checks -Wno-frame-address -Wno-format-truncation -Wno-format-overflow -Wno-address-of-packed-member -O2 -fno-allow-store-data-races -fplugin=./scripts/gcc-plugins/structleak_plugin.so -fplugin=./scripts/gcc-plugins/randomize_layout_plugin.so -fplugin=./scripts/gcc-plugins/stackleak_plugin.so -fplugin-arg-structleak_plugin-byref-all -DSTRUCTLEAK_PLUGIN -DRANDSTRUCT_PLUGIN -fplugin-arg-randomize_layout_plugin-performance-mode -DSTACKLEAK_PLUGIN -fplugin-arg-stackleak_plugin-track-min-size=100 -Wframe-larger-than=2048 -fstack-protector-strong -Wno-unused-but-set-variable -Wimplicit-fallthrough -Wno-unused-const-variable -fno-var-tracking-assignments -gsplit-dwarf -gdwarf-4 -pg -mrecord-mcount -mfentry -DCC_USING_FENTRY -flive-patching=inline-clone -Wdeclaration-after-statement -Wvla -Wno-pointer-sign -Wno-stringop-truncation -Wno-zero-length-bounds -Wno-array-bounds -Wno-stringop-overflow -Wno-restrict -Wno-maybe-uninitialized -fno-strict-overflow -fno-merge-all-constants -fmerge-constants -fno-stack-check -fconserve-stack -Werror=date-time -Werror=incompatible-pointer-types -Werror=designated-init -fmacro-prefix-map=./= -fcf-protection=none -Wno-packed-not-aligned -I/tmp/B.JfsCO7/BUILD/NVIDIA-Linux-x86_64-390.132-no-compat32/kernel/common/inc -I/tmp/B.JfsCO7/BUILD/NVIDIA-Linux-x86_64-390.132-no-compat32/kernel -Wall -MD -Wsign-compare -Wno-cast-qual -Wno-error -D__KERNEL__ -DMODULE -DNVRM -DNV_VERSION_STRING=\"390.132\" -Wno-unused-function -Wuninitialized -fno-strict-aliasing -mno-red-zone -mcmodel=kernel -DNV_UVM_ENABLE -Wno-sign-compare -Wno-format-extra-args -Werror=undef -DNV_SPECTRE_V2=0 -I/tmp/B.JfsCO7/BUILD/NVIDIA-Linux-x86_64-390.132-no-compat32/kernel/nvidia -DNV_BUILD_MODULE_INSTANCES=0 -DNVIDIA_UNDEF_LEGACY_BIT_MACROS -UDEBUG -U_DEBUG -DNDEBUG -DMODULE -DKBUILD_BASENAME='"os_mlock"' -DKBUILD_MODNAME='"nvidia"' -c -o /tmp/B.JfsCO7/BUILD/NVIDIA-Linux-x86_64-390.132-no-compat32/kernel/nvidia/os-mlock.o /tmp/B.JfsCO7/BUILD/NVIDIA-Linux-x86_64-390.132-no-compat32/kernel/nvidia/os-mlock.c ./tools/objtool/objtool orc generate --module --no-fp --retpoline --uaccess /tmp/B.JfsCO7/BUILD/NVIDIA-Linux-x86_64-390.132-no-compat32/kernel/nvidia/os-mlock.o if objdump -h /tmp/B.JfsCO7/BUILD/NVIDIA-Linux-x86_64-390.132-no-compat32/kernel/nvidia/os-mlock.o | grep -q __ksymtab; then x86_64-pld-linux-gcc -E -D__GENKSYMS__ -Wp,-MD,/tmp/B.JfsCO7/BUILD/NVIDIA-Linux-x86_64-390.132-no-compat32/kernel/nvidia/.os-mlock.o.d -nostdinc -isystem /usr/lib64/gcc/x86_64-pld-linux/10.1.0/include -I./arch/x86/include -I./arch/x86/include/generated -I./include -I./arch/x86/include/uapi -I./arch/x86/include/generated/uapi -I./include/uapi -I./include/generated/uapi -include ./include/linux/kconfig.h -include ./include/linux/compiler_types.h -D__KERNEL__ -Wall -Wundef -Werror=strict-prototypes -Wno-trigraphs -fno-strict-aliasing -fno-common -fshort-wchar -fno-PIE -Werror=implicit-function-declaration -Werror=implicit-int -Wno-format-security -std=gnu89 -mno-sse -mno-mmx -mno-sse2 -mno-3dnow -mno-avx -m64 -falign-jumps=1 -falign-loops=1 -mno-80387 -mno-fp-ret-in-387 -mpreferred-stack-boundary=3 -mskip-rax-setup -mtune=generic -mno-red-zone -mcmodel=kernel -DCONFIG_X86_X32_ABI -Wno-sign-compare -fno-asynchronous-unwind-tables -mindirect-branch=thunk-extern -mindirect-branch-register -fno-jump-tables -fno-delete-null-pointer-checks -Wno-frame-address -Wno-format-truncation -Wno-format-overflow -Wno-address-of-packed-member -O2 -fno-allow-store-data-races -fplugin=./scripts/gcc-plugins/structleak_plugin.so -fplugin=./scripts/gcc-plugins/randomize_layout_plugin.so -fplugin=./scripts/gcc-plugins/stackleak_plugin.so -fplugin-arg-structleak_plugin-byref-all -DSTRUCTLEAK_PLUGIN -DRANDSTRUCT_PLUGIN -fplugin-arg-randomize_layout_plugin-performance-mode -DSTACKLEAK_PLUGIN -fplugin-arg-stackleak_plugin-track-min-size=100 -Wframe-larger-than=2048 -fstack-protector-strong -Wno-unused-but-set-variable -Wimplicit-fallthrough -Wno-unused-const-variable -fno-var-tracking-assignments -gsplit-dwarf -gdwarf-4 -pg -mrecord-mcount -mfentry -DCC_USING_FENTRY -flive-patching=inline-clone -Wdeclaration-after-statement -Wvla -Wno-pointer-sign -Wno-stringop-truncation -Wno-zero-length-bounds -Wno-array-bounds -Wno-stringop-overflow -Wno-restrict -Wno-maybe-uninitialized -fno-strict-overflow -fno-merge-all-constants -fmerge-constants -fno-stack-check -fconserve-stack -Werror=date-time -Werror=incompatible-pointer-types -Werror=designated-init -fmacro-prefix-map=./= -fcf-protection=none -Wno-packed-not-aligned -I/tmp/B.JfsCO7/BUILD/NVIDIA-Linux-x86_64-390.132-no-compat32/kernel/common/inc -I/tmp/B.JfsCO7/BUILD/NVIDIA-Linux-x86_64-390.132-no-compat32/kernel -Wall -MD -Wsign-compare -Wno-cast-qual -Wno-error -D__KERNEL__ -DMODULE -DNVRM -DNV_VERSION_STRING=\"390.132\" -Wno-unused-function -Wuninitialized -fno-strict-aliasing -mno-red-zone -mcmodel=kernel -DNV_UVM_ENABLE -Wno-sign-compare -Wno-format-extra-args -Werror=undef -DNV_SPECTRE_V2=0 -I/tmp/B.JfsCO7/BUILD/NVIDIA-Linux-x86_64-390.132-no-compat32/kernel/nvidia -DNV_BUILD_MODULE_INSTANCES=0 -DNVIDIA_UNDEF_LEGACY_BIT_MACROS -UDEBUG -U_DEBUG -DNDEBUG -DMODULE -DKBUILD_BASENAME='"os_mlock"' -DKBUILD_MODNAME='"nvidia"' /tmp/B.JfsCO7/BUILD/NVIDIA-Linux-x86_64-390.132-no-compat32/kernel/nvidia/os-mlock.c | scripts/genksyms/genksyms -r /dev/null > /tmp/B.JfsCO7/BUILD/NVIDIA-Linux-x86_64-390.132-no-compat32/kernel/nvidia/.tmp_os-mlock.ver; ld -m elf_x86_64 -z max-page-size=0x200000 -r -o /tmp/B.JfsCO7/BUILD/NVIDIA-Linux-x86_64-390.132-no-compat32/kernel/nvidia/.tmp_os-mlock.o /tmp/B.JfsCO7/BUILD/NVIDIA-Linux-x86_64-390.132-no-compat32/kernel/nvidia/os-mlock.o -T /tmp/B.JfsCO7/BUILD/NVIDIA-Linux-x86_64-390.132-no-compat32/kernel/nvidia/.tmp_os-mlock.ver; mv -f /tmp/B.JfsCO7/BUILD/NVIDIA-Linux-x86_64-390.132-no-compat32/kernel/nvidia/.tmp_os-mlock.o /tmp/B.JfsCO7/BUILD/NVIDIA-Linux-x86_64-390.132-no-compat32/kernel/nvidia/os-mlock.o; rm -f /tmp/B.JfsCO7/BUILD/NVIDIA-Linux-x86_64-390.132-no-compat32/kernel/nvidia/.tmp_os-mlock.ver; fi x86_64-pld-linux-gcc -Wp,-MD,/tmp/B.JfsCO7/BUILD/NVIDIA-Linux-x86_64-390.132-no-compat32/kernel/nvidia/.os-pci.o.d -nostdinc -isystem /usr/lib64/gcc/x86_64-pld-linux/10.1.0/include -I./arch/x86/include -I./arch/x86/include/generated -I./include -I./arch/x86/include/uapi -I./arch/x86/include/generated/uapi -I./include/uapi -I./include/generated/uapi -include ./include/linux/kconfig.h -include ./include/linux/compiler_types.h -D__KERNEL__ -Wall -Wundef -Werror=strict-prototypes -Wno-trigraphs -fno-strict-aliasing -fno-common -fshort-wchar -fno-PIE -Werror=implicit-function-declaration -Werror=implicit-int -Wno-format-security -std=gnu89 -mno-sse -mno-mmx -mno-sse2 -mno-3dnow -mno-avx -m64 -falign-jumps=1 -falign-loops=1 -mno-80387 -mno-fp-ret-in-387 -mpreferred-stack-boundary=3 -mskip-rax-setup -mtune=generic -mno-red-zone -mcmodel=kernel -DCONFIG_X86_X32_ABI -Wno-sign-compare -fno-asynchronous-unwind-tables -mindirect-branch=thunk-extern -mindirect-branch-register -fno-jump-tables -fno-delete-null-pointer-checks -Wno-frame-address -Wno-format-truncation -Wno-format-overflow -Wno-address-of-packed-member -O2 -fno-allow-store-data-races -fplugin=./scripts/gcc-plugins/structleak_plugin.so -fplugin=./scripts/gcc-plugins/randomize_layout_plugin.so -fplugin=./scripts/gcc-plugins/stackleak_plugin.so -fplugin-arg-structleak_plugin-byref-all -DSTRUCTLEAK_PLUGIN -DRANDSTRUCT_PLUGIN -fplugin-arg-randomize_layout_plugin-performance-mode -DSTACKLEAK_PLUGIN -fplugin-arg-stackleak_plugin-track-min-size=100 -Wframe-larger-than=2048 -fstack-protector-strong -Wno-unused-but-set-variable -Wimplicit-fallthrough -Wno-unused-const-variable -fno-var-tracking-assignments -gsplit-dwarf -gdwarf-4 -pg -mrecord-mcount -mfentry -DCC_USING_FENTRY -flive-patching=inline-clone -Wdeclaration-after-statement -Wvla -Wno-pointer-sign -Wno-stringop-truncation -Wno-zero-length-bounds -Wno-array-bounds -Wno-stringop-overflow -Wno-restrict -Wno-maybe-uninitialized -fno-strict-overflow -fno-merge-all-constants -fmerge-constants -fno-stack-check -fconserve-stack -Werror=date-time -Werror=incompatible-pointer-types -Werror=designated-init -fmacro-prefix-map=./= -fcf-protection=none -Wno-packed-not-aligned -I/tmp/B.JfsCO7/BUILD/NVIDIA-Linux-x86_64-390.132-no-compat32/kernel/common/inc -I/tmp/B.JfsCO7/BUILD/NVIDIA-Linux-x86_64-390.132-no-compat32/kernel -Wall -MD -Wsign-compare -Wno-cast-qual -Wno-error -D__KERNEL__ -DMODULE -DNVRM -DNV_VERSION_STRING=\"390.132\" -Wno-unused-function -Wuninitialized -fno-strict-aliasing -mno-red-zone -mcmodel=kernel -DNV_UVM_ENABLE -Wno-sign-compare -Wno-format-extra-args -Werror=undef -DNV_SPECTRE_V2=0 -I/tmp/B.JfsCO7/BUILD/NVIDIA-Linux-x86_64-390.132-no-compat32/kernel/nvidia -DNV_BUILD_MODULE_INSTANCES=0 -DNVIDIA_UNDEF_LEGACY_BIT_MACROS -UDEBUG -U_DEBUG -DNDEBUG -DMODULE -DKBUILD_BASENAME='"os_pci"' -DKBUILD_MODNAME='"nvidia"' -c -o /tmp/B.JfsCO7/BUILD/NVIDIA-Linux-x86_64-390.132-no-compat32/kernel/nvidia/os-pci.o /tmp/B.JfsCO7/BUILD/NVIDIA-Linux-x86_64-390.132-no-compat32/kernel/nvidia/os-pci.c ./tools/objtool/objtool orc generate --module --no-fp --retpoline --uaccess /tmp/B.JfsCO7/BUILD/NVIDIA-Linux-x86_64-390.132-no-compat32/kernel/nvidia/os-pci.o if objdump -h /tmp/B.JfsCO7/BUILD/NVIDIA-Linux-x86_64-390.132-no-compat32/kernel/nvidia/os-pci.o | grep -q __ksymtab; then x86_64-pld-linux-gcc -E -D__GENKSYMS__ -Wp,-MD,/tmp/B.JfsCO7/BUILD/NVIDIA-Linux-x86_64-390.132-no-compat32/kernel/nvidia/.os-pci.o.d -nostdinc -isystem /usr/lib64/gcc/x86_64-pld-linux/10.1.0/include -I./arch/x86/include -I./arch/x86/include/generated -I./include -I./arch/x86/include/uapi -I./arch/x86/include/generated/uapi -I./include/uapi -I./include/generated/uapi -include ./include/linux/kconfig.h -include ./include/linux/compiler_types.h -D__KERNEL__ -Wall -Wundef -Werror=strict-prototypes -Wno-trigraphs -fno-strict-aliasing -fno-common -fshort-wchar -fno-PIE -Werror=implicit-function-declaration -Werror=implicit-int -Wno-format-security -std=gnu89 -mno-sse -mno-mmx -mno-sse2 -mno-3dnow -mno-avx -m64 -falign-jumps=1 -falign-loops=1 -mno-80387 -mno-fp-ret-in-387 -mpreferred-stack-boundary=3 -mskip-rax-setup -mtune=generic -mno-red-zone -mcmodel=kernel -DCONFIG_X86_X32_ABI -Wno-sign-compare -fno-asynchronous-unwind-tables -mindirect-branch=thunk-extern -mindirect-branch-register -fno-jump-tables -fno-delete-null-pointer-checks -Wno-frame-address -Wno-format-truncation -Wno-format-overflow -Wno-address-of-packed-member -O2 -fno-allow-store-data-races -fplugin=./scripts/gcc-plugins/structleak_plugin.so -fplugin=./scripts/gcc-plugins/randomize_layout_plugin.so -fplugin=./scripts/gcc-plugins/stackleak_plugin.so -fplugin-arg-structleak_plugin-byref-all -DSTRUCTLEAK_PLUGIN -DRANDSTRUCT_PLUGIN -fplugin-arg-randomize_layout_plugin-performance-mode -DSTACKLEAK_PLUGIN -fplugin-arg-stackleak_plugin-track-min-size=100 -Wframe-larger-than=2048 -fstack-protector-strong -Wno-unused-but-set-variable -Wimplicit-fallthrough -Wno-unused-const-variable -fno-var-tracking-assignments -gsplit-dwarf -gdwarf-4 -pg -mrecord-mcount -mfentry -DCC_USING_FENTRY -flive-patching=inline-clone -Wdeclaration-after-statement -Wvla -Wno-pointer-sign -Wno-stringop-truncation -Wno-zero-length-bounds -Wno-array-bounds -Wno-stringop-overflow -Wno-restrict -Wno-maybe-uninitialized -fno-strict-overflow -fno-merge-all-constants -fmerge-constants -fno-stack-check -fconserve-stack -Werror=date-time -Werror=incompatible-pointer-types -Werror=designated-init -fmacro-prefix-map=./= -fcf-protection=none -Wno-packed-not-aligned -I/tmp/B.JfsCO7/BUILD/NVIDIA-Linux-x86_64-390.132-no-compat32/kernel/common/inc -I/tmp/B.JfsCO7/BUILD/NVIDIA-Linux-x86_64-390.132-no-compat32/kernel -Wall -MD -Wsign-compare -Wno-cast-qual -Wno-error -D__KERNEL__ -DMODULE -DNVRM -DNV_VERSION_STRING=\"390.132\" -Wno-unused-function -Wuninitialized -fno-strict-aliasing -mno-red-zone -mcmodel=kernel -DNV_UVM_ENABLE -Wno-sign-compare -Wno-format-extra-args -Werror=undef -DNV_SPECTRE_V2=0 -I/tmp/B.JfsCO7/BUILD/NVIDIA-Linux-x86_64-390.132-no-compat32/kernel/nvidia -DNV_BUILD_MODULE_INSTANCES=0 -DNVIDIA_UNDEF_LEGACY_BIT_MACROS -UDEBUG -U_DEBUG -DNDEBUG -DMODULE -DKBUILD_BASENAME='"os_pci"' -DKBUILD_MODNAME='"nvidia"' /tmp/B.JfsCO7/BUILD/NVIDIA-Linux-x86_64-390.132-no-compat32/kernel/nvidia/os-pci.c | scripts/genksyms/genksyms -r /dev/null > /tmp/B.JfsCO7/BUILD/NVIDIA-Linux-x86_64-390.132-no-compat32/kernel/nvidia/.tmp_os-pci.ver; ld -m elf_x86_64 -z max-page-size=0x200000 -r -o /tmp/B.JfsCO7/BUILD/NVIDIA-Linux-x86_64-390.132-no-compat32/kernel/nvidia/.tmp_os-pci.o /tmp/B.JfsCO7/BUILD/NVIDIA-Linux-x86_64-390.132-no-compat32/kernel/nvidia/os-pci.o -T /tmp/B.JfsCO7/BUILD/NVIDIA-Linux-x86_64-390.132-no-compat32/kernel/nvidia/.tmp_os-pci.ver; mv -f /tmp/B.JfsCO7/BUILD/NVIDIA-Linux-x86_64-390.132-no-compat32/kernel/nvidia/.tmp_os-pci.o /tmp/B.JfsCO7/BUILD/NVIDIA-Linux-x86_64-390.132-no-compat32/kernel/nvidia/os-pci.o; rm -f /tmp/B.JfsCO7/BUILD/NVIDIA-Linux-x86_64-390.132-no-compat32/kernel/nvidia/.tmp_os-pci.ver; fi x86_64-pld-linux-gcc -Wp,-MD,/tmp/B.JfsCO7/BUILD/NVIDIA-Linux-x86_64-390.132-no-compat32/kernel/nvidia/.nv-pci-table.o.d -nostdinc -isystem /usr/lib64/gcc/x86_64-pld-linux/10.1.0/include -I./arch/x86/include -I./arch/x86/include/generated -I./include -I./arch/x86/include/uapi -I./arch/x86/include/generated/uapi -I./include/uapi -I./include/generated/uapi -include ./include/linux/kconfig.h -include ./include/linux/compiler_types.h -D__KERNEL__ -Wall -Wundef -Werror=strict-prototypes -Wno-trigraphs -fno-strict-aliasing -fno-common -fshort-wchar -fno-PIE -Werror=implicit-function-declaration -Werror=implicit-int -Wno-format-security -std=gnu89 -mno-sse -mno-mmx -mno-sse2 -mno-3dnow -mno-avx -m64 -falign-jumps=1 -falign-loops=1 -mno-80387 -mno-fp-ret-in-387 -mpreferred-stack-boundary=3 -mskip-rax-setup -mtune=generic -mno-red-zone -mcmodel=kernel -DCONFIG_X86_X32_ABI -Wno-sign-compare -fno-asynchronous-unwind-tables -mindirect-branch=thunk-extern -mindirect-branch-register -fno-jump-tables -fno-delete-null-pointer-checks -Wno-frame-address -Wno-format-truncation -Wno-format-overflow -Wno-address-of-packed-member -O2 -fno-allow-store-data-races -fplugin=./scripts/gcc-plugins/structleak_plugin.so -fplugin=./scripts/gcc-plugins/randomize_layout_plugin.so -fplugin=./scripts/gcc-plugins/stackleak_plugin.so -fplugin-arg-structleak_plugin-byref-all -DSTRUCTLEAK_PLUGIN -DRANDSTRUCT_PLUGIN -fplugin-arg-randomize_layout_plugin-performance-mode -DSTACKLEAK_PLUGIN -fplugin-arg-stackleak_plugin-track-min-size=100 -Wframe-larger-than=2048 -fstack-protector-strong -Wno-unused-but-set-variable -Wimplicit-fallthrough -Wno-unused-const-variable -fno-var-tracking-assignments -gsplit-dwarf -gdwarf-4 -pg -mrecord-mcount -mfentry -DCC_USING_FENTRY -flive-patching=inline-clone -Wdeclaration-after-statement -Wvla -Wno-pointer-sign -Wno-stringop-truncation -Wno-zero-length-bounds -Wno-array-bounds -Wno-stringop-overflow -Wno-restrict -Wno-maybe-uninitialized -fno-strict-overflow -fno-merge-all-constants -fmerge-constants -fno-stack-check -fconserve-stack -Werror=date-time -Werror=incompatible-pointer-types -Werror=designated-init -fmacro-prefix-map=./= -fcf-protection=none -Wno-packed-not-aligned -I/tmp/B.JfsCO7/BUILD/NVIDIA-Linux-x86_64-390.132-no-compat32/kernel/common/inc -I/tmp/B.JfsCO7/BUILD/NVIDIA-Linux-x86_64-390.132-no-compat32/kernel -Wall -MD -Wsign-compare -Wno-cast-qual -Wno-error -D__KERNEL__ -DMODULE -DNVRM -DNV_VERSION_STRING=\"390.132\" -Wno-unused-function -Wuninitialized -fno-strict-aliasing -mno-red-zone -mcmodel=kernel -DNV_UVM_ENABLE -Wno-sign-compare -Wno-format-extra-args -Werror=undef -DNV_SPECTRE_V2=0 -I/tmp/B.JfsCO7/BUILD/NVIDIA-Linux-x86_64-390.132-no-compat32/kernel/nvidia -DNV_BUILD_MODULE_INSTANCES=0 -DNVIDIA_UNDEF_LEGACY_BIT_MACROS -UDEBUG -U_DEBUG -DNDEBUG -DMODULE -DKBUILD_BASENAME='"nv_pci_table"' -DKBUILD_MODNAME='"nvidia"' -c -o /tmp/B.JfsCO7/BUILD/NVIDIA-Linux-x86_64-390.132-no-compat32/kernel/nvidia/nv-pci-table.o /tmp/B.JfsCO7/BUILD/NVIDIA-Linux-x86_64-390.132-no-compat32/kernel/nvidia/nv-pci-table.c ./tools/objtool/objtool orc generate --module --no-fp --retpoline --uaccess /tmp/B.JfsCO7/BUILD/NVIDIA-Linux-x86_64-390.132-no-compat32/kernel/nvidia/nv-pci-table.o if objdump -h /tmp/B.JfsCO7/BUILD/NVIDIA-Linux-x86_64-390.132-no-compat32/kernel/nvidia/nv-pci-table.o | grep -q __ksymtab; then x86_64-pld-linux-gcc -E -D__GENKSYMS__ -Wp,-MD,/tmp/B.JfsCO7/BUILD/NVIDIA-Linux-x86_64-390.132-no-compat32/kernel/nvidia/.nv-pci-table.o.d -nostdinc -isystem /usr/lib64/gcc/x86_64-pld-linux/10.1.0/include -I./arch/x86/include -I./arch/x86/include/generated -I./include -I./arch/x86/include/uapi -I./arch/x86/include/generated/uapi -I./include/uapi -I./include/generated/uapi -include ./include/linux/kconfig.h -include ./include/linux/compiler_types.h -D__KERNEL__ -Wall -Wundef -Werror=strict-prototypes -Wno-trigraphs -fno-strict-aliasing -fno-common -fshort-wchar -fno-PIE -Werror=implicit-function-declaration -Werror=implicit-int -Wno-format-security -std=gnu89 -mno-sse -mno-mmx -mno-sse2 -mno-3dnow -mno-avx -m64 -falign-jumps=1 -falign-loops=1 -mno-80387 -mno-fp-ret-in-387 -mpreferred-stack-boundary=3 -mskip-rax-setup -mtune=generic -mno-red-zone -mcmodel=kernel -DCONFIG_X86_X32_ABI -Wno-sign-compare -fno-asynchronous-unwind-tables -mindirect-branch=thunk-extern -mindirect-branch-register -fno-jump-tables -fno-delete-null-pointer-checks -Wno-frame-address -Wno-format-truncation -Wno-format-overflow -Wno-address-of-packed-member -O2 -fno-allow-store-data-races -fplugin=./scripts/gcc-plugins/structleak_plugin.so -fplugin=./scripts/gcc-plugins/randomize_layout_plugin.so -fplugin=./scripts/gcc-plugins/stackleak_plugin.so -fplugin-arg-structleak_plugin-byref-all -DSTRUCTLEAK_PLUGIN -DRANDSTRUCT_PLUGIN -fplugin-arg-randomize_layout_plugin-performance-mode -DSTACKLEAK_PLUGIN -fplugin-arg-stackleak_plugin-track-min-size=100 -Wframe-larger-than=2048 -fstack-protector-strong -Wno-unused-but-set-variable -Wimplicit-fallthrough -Wno-unused-const-variable -fno-var-tracking-assignments -gsplit-dwarf -gdwarf-4 -pg -mrecord-mcount -mfentry -DCC_USING_FENTRY -flive-patching=inline-clone -Wdeclaration-after-statement -Wvla -Wno-pointer-sign -Wno-stringop-truncation -Wno-zero-length-bounds -Wno-array-bounds -Wno-stringop-overflow -Wno-restrict -Wno-maybe-uninitialized -fno-strict-overflow -fno-merge-all-constants -fmerge-constants -fno-stack-check -fconserve-stack -Werror=date-time -Werror=incompatible-pointer-types -Werror=designated-init -fmacro-prefix-map=./= -fcf-protection=none -Wno-packed-not-aligned -I/tmp/B.JfsCO7/BUILD/NVIDIA-Linux-x86_64-390.132-no-compat32/kernel/common/inc -I/tmp/B.JfsCO7/BUILD/NVIDIA-Linux-x86_64-390.132-no-compat32/kernel -Wall -MD -Wsign-compare -Wno-cast-qual -Wno-error -D__KERNEL__ -DMODULE -DNVRM -DNV_VERSION_STRING=\"390.132\" -Wno-unused-function -Wuninitialized -fno-strict-aliasing -mno-red-zone -mcmodel=kernel -DNV_UVM_ENABLE -Wno-sign-compare -Wno-format-extra-args -Werror=undef -DNV_SPECTRE_V2=0 -I/tmp/B.JfsCO7/BUILD/NVIDIA-Linux-x86_64-390.132-no-compat32/kernel/nvidia -DNV_BUILD_MODULE_INSTANCES=0 -DNVIDIA_UNDEF_LEGACY_BIT_MACROS -UDEBUG -U_DEBUG -DNDEBUG -DMODULE -DKBUILD_BASENAME='"nv_pci_table"' -DKBUILD_MODNAME='"nvidia"' /tmp/B.JfsCO7/BUILD/NVIDIA-Linux-x86_64-390.132-no-compat32/kernel/nvidia/nv-pci-table.c | scripts/genksyms/genksyms -r /dev/null > /tmp/B.JfsCO7/BUILD/NVIDIA-Linux-x86_64-390.132-no-compat32/kernel/nvidia/.tmp_nv-pci-table.ver; ld -m elf_x86_64 -z max-page-size=0x200000 -r -o /tmp/B.JfsCO7/BUILD/NVIDIA-Linux-x86_64-390.132-no-compat32/kernel/nvidia/.tmp_nv-pci-table.o /tmp/B.JfsCO7/BUILD/NVIDIA-Linux-x86_64-390.132-no-compat32/kernel/nvidia/nv-pci-table.o -T /tmp/B.JfsCO7/BUILD/NVIDIA-Linux-x86_64-390.132-no-compat32/kernel/nvidia/.tmp_nv-pci-table.ver; mv -f /tmp/B.JfsCO7/BUILD/NVIDIA-Linux-x86_64-390.132-no-compat32/kernel/nvidia/.tmp_nv-pci-table.o /tmp/B.JfsCO7/BUILD/NVIDIA-Linux-x86_64-390.132-no-compat32/kernel/nvidia/nv-pci-table.o; rm -f /tmp/B.JfsCO7/BUILD/NVIDIA-Linux-x86_64-390.132-no-compat32/kernel/nvidia/.tmp_nv-pci-table.ver; fi x86_64-pld-linux-gcc -Wp,-MD,/tmp/B.JfsCO7/BUILD/NVIDIA-Linux-x86_64-390.132-no-compat32/kernel/nvidia/.os-registry.o.d -nostdinc -isystem /usr/lib64/gcc/x86_64-pld-linux/10.1.0/include -I./arch/x86/include -I./arch/x86/include/generated -I./include -I./arch/x86/include/uapi -I./arch/x86/include/generated/uapi -I./include/uapi -I./include/generated/uapi -include ./include/linux/kconfig.h -include ./include/linux/compiler_types.h -D__KERNEL__ -Wall -Wundef -Werror=strict-prototypes -Wno-trigraphs -fno-strict-aliasing -fno-common -fshort-wchar -fno-PIE -Werror=implicit-function-declaration -Werror=implicit-int -Wno-format-security -std=gnu89 -mno-sse -mno-mmx -mno-sse2 -mno-3dnow -mno-avx -m64 -falign-jumps=1 -falign-loops=1 -mno-80387 -mno-fp-ret-in-387 -mpreferred-stack-boundary=3 -mskip-rax-setup -mtune=generic -mno-red-zone -mcmodel=kernel -DCONFIG_X86_X32_ABI -Wno-sign-compare -fno-asynchronous-unwind-tables -mindirect-branch=thunk-extern -mindirect-branch-register -fno-jump-tables -fno-delete-null-pointer-checks -Wno-frame-address -Wno-format-truncation -Wno-format-overflow -Wno-address-of-packed-member -O2 -fno-allow-store-data-races -fplugin=./scripts/gcc-plugins/structleak_plugin.so -fplugin=./scripts/gcc-plugins/randomize_layout_plugin.so -fplugin=./scripts/gcc-plugins/stackleak_plugin.so -fplugin-arg-structleak_plugin-byref-all -DSTRUCTLEAK_PLUGIN -DRANDSTRUCT_PLUGIN -fplugin-arg-randomize_layout_plugin-performance-mode -DSTACKLEAK_PLUGIN -fplugin-arg-stackleak_plugin-track-min-size=100 -Wframe-larger-than=2048 -fstack-protector-strong -Wno-unused-but-set-variable -Wimplicit-fallthrough -Wno-unused-const-variable -fno-var-tracking-assignments -gsplit-dwarf -gdwarf-4 -pg -mrecord-mcount -mfentry -DCC_USING_FENTRY -flive-patching=inline-clone -Wdeclaration-after-statement -Wvla -Wno-pointer-sign -Wno-stringop-truncation -Wno-zero-length-bounds -Wno-array-bounds -Wno-stringop-overflow -Wno-restrict -Wno-maybe-uninitialized -fno-strict-overflow -fno-merge-all-constants -fmerge-constants -fno-stack-check -fconserve-stack -Werror=date-time -Werror=incompatible-pointer-types -Werror=designated-init -fmacro-prefix-map=./= -fcf-protection=none -Wno-packed-not-aligned -I/tmp/B.JfsCO7/BUILD/NVIDIA-Linux-x86_64-390.132-no-compat32/kernel/common/inc -I/tmp/B.JfsCO7/BUILD/NVIDIA-Linux-x86_64-390.132-no-compat32/kernel -Wall -MD -Wsign-compare -Wno-cast-qual -Wno-error -D__KERNEL__ -DMODULE -DNVRM -DNV_VERSION_STRING=\"390.132\" -Wno-unused-function -Wuninitialized -fno-strict-aliasing -mno-red-zone -mcmodel=kernel -DNV_UVM_ENABLE -Wno-sign-compare -Wno-format-extra-args -Werror=undef -DNV_SPECTRE_V2=0 -I/tmp/B.JfsCO7/BUILD/NVIDIA-Linux-x86_64-390.132-no-compat32/kernel/nvidia -DNV_BUILD_MODULE_INSTANCES=0 -DNVIDIA_UNDEF_LEGACY_BIT_MACROS -UDEBUG -U_DEBUG -DNDEBUG -DMODULE -DKBUILD_BASENAME='"os_registry"' -DKBUILD_MODNAME='"nvidia"' -c -o /tmp/B.JfsCO7/BUILD/NVIDIA-Linux-x86_64-390.132-no-compat32/kernel/nvidia/os-registry.o /tmp/B.JfsCO7/BUILD/NVIDIA-Linux-x86_64-390.132-no-compat32/kernel/nvidia/os-registry.c ./tools/objtool/objtool orc generate --module --no-fp --retpoline --uaccess /tmp/B.JfsCO7/BUILD/NVIDIA-Linux-x86_64-390.132-no-compat32/kernel/nvidia/os-registry.o if objdump -h /tmp/B.JfsCO7/BUILD/NVIDIA-Linux-x86_64-390.132-no-compat32/kernel/nvidia/os-registry.o | grep -q __ksymtab; then x86_64-pld-linux-gcc -E -D__GENKSYMS__ -Wp,-MD,/tmp/B.JfsCO7/BUILD/NVIDIA-Linux-x86_64-390.132-no-compat32/kernel/nvidia/.os-registry.o.d -nostdinc -isystem /usr/lib64/gcc/x86_64-pld-linux/10.1.0/include -I./arch/x86/include -I./arch/x86/include/generated -I./include -I./arch/x86/include/uapi -I./arch/x86/include/generated/uapi -I./include/uapi -I./include/generated/uapi -include ./include/linux/kconfig.h -include ./include/linux/compiler_types.h -D__KERNEL__ -Wall -Wundef -Werror=strict-prototypes -Wno-trigraphs -fno-strict-aliasing -fno-common -fshort-wchar -fno-PIE -Werror=implicit-function-declaration -Werror=implicit-int -Wno-format-security -std=gnu89 -mno-sse -mno-mmx -mno-sse2 -mno-3dnow -mno-avx -m64 -falign-jumps=1 -falign-loops=1 -mno-80387 -mno-fp-ret-in-387 -mpreferred-stack-boundary=3 -mskip-rax-setup -mtune=generic -mno-red-zone -mcmodel=kernel -DCONFIG_X86_X32_ABI -Wno-sign-compare -fno-asynchronous-unwind-tables -mindirect-branch=thunk-extern -mindirect-branch-register -fno-jump-tables -fno-delete-null-pointer-checks -Wno-frame-address -Wno-format-truncation -Wno-format-overflow -Wno-address-of-packed-member -O2 -fno-allow-store-data-races -fplugin=./scripts/gcc-plugins/structleak_plugin.so -fplugin=./scripts/gcc-plugins/randomize_layout_plugin.so -fplugin=./scripts/gcc-plugins/stackleak_plugin.so -fplugin-arg-structleak_plugin-byref-all -DSTRUCTLEAK_PLUGIN -DRANDSTRUCT_PLUGIN -fplugin-arg-randomize_layout_plugin-performance-mode -DSTACKLEAK_PLUGIN -fplugin-arg-stackleak_plugin-track-min-size=100 -Wframe-larger-than=2048 -fstack-protector-strong -Wno-unused-but-set-variable -Wimplicit-fallthrough -Wno-unused-const-variable -fno-var-tracking-assignments -gsplit-dwarf -gdwarf-4 -pg -mrecord-mcount -mfentry -DCC_USING_FENTRY -flive-patching=inline-clone -Wdeclaration-after-statement -Wvla -Wno-pointer-sign -Wno-stringop-truncation -Wno-zero-length-bounds -Wno-array-bounds -Wno-stringop-overflow -Wno-restrict -Wno-maybe-uninitialized -fno-strict-overflow -fno-merge-all-constants -fmerge-constants -fno-stack-check -fconserve-stack -Werror=date-time -Werror=incompatible-pointer-types -Werror=designated-init -fmacro-prefix-map=./= -fcf-protection=none -Wno-packed-not-aligned -I/tmp/B.JfsCO7/BUILD/NVIDIA-Linux-x86_64-390.132-no-compat32/kernel/common/inc -I/tmp/B.JfsCO7/BUILD/NVIDIA-Linux-x86_64-390.132-no-compat32/kernel -Wall -MD -Wsign-compare -Wno-cast-qual -Wno-error -D__KERNEL__ -DMODULE -DNVRM -DNV_VERSION_STRING=\"390.132\" -Wno-unused-function -Wuninitialized -fno-strict-aliasing -mno-red-zone -mcmodel=kernel -DNV_UVM_ENABLE -Wno-sign-compare -Wno-format-extra-args -Werror=undef -DNV_SPECTRE_V2=0 -I/tmp/B.JfsCO7/BUILD/NVIDIA-Linux-x86_64-390.132-no-compat32/kernel/nvidia -DNV_BUILD_MODULE_INSTANCES=0 -DNVIDIA_UNDEF_LEGACY_BIT_MACROS -UDEBUG -U_DEBUG -DNDEBUG -DMODULE -DKBUILD_BASENAME='"os_registry"' -DKBUILD_MODNAME='"nvidia"' /tmp/B.JfsCO7/BUILD/NVIDIA-Linux-x86_64-390.132-no-compat32/kernel/nvidia/os-registry.c | scripts/genksyms/genksyms -r /dev/null > /tmp/B.JfsCO7/BUILD/NVIDIA-Linux-x86_64-390.132-no-compat32/kernel/nvidia/.tmp_os-registry.ver; ld -m elf_x86_64 -z max-page-size=0x200000 -r -o /tmp/B.JfsCO7/BUILD/NVIDIA-Linux-x86_64-390.132-no-compat32/kernel/nvidia/.tmp_os-registry.o /tmp/B.JfsCO7/BUILD/NVIDIA-Linux-x86_64-390.132-no-compat32/kernel/nvidia/os-registry.o -T /tmp/B.JfsCO7/BUILD/NVIDIA-Linux-x86_64-390.132-no-compat32/kernel/nvidia/.tmp_os-registry.ver; mv -f /tmp/B.JfsCO7/BUILD/NVIDIA-Linux-x86_64-390.132-no-compat32/kernel/nvidia/.tmp_os-registry.o /tmp/B.JfsCO7/BUILD/NVIDIA-Linux-x86_64-390.132-no-compat32/kernel/nvidia/os-registry.o; rm -f /tmp/B.JfsCO7/BUILD/NVIDIA-Linux-x86_64-390.132-no-compat32/kernel/nvidia/.tmp_os-registry.ver; fi x86_64-pld-linux-gcc -Wp,-MD,/tmp/B.JfsCO7/BUILD/NVIDIA-Linux-x86_64-390.132-no-compat32/kernel/nvidia/.os-interface.o.d -nostdinc -isystem /usr/lib64/gcc/x86_64-pld-linux/10.1.0/include -I./arch/x86/include -I./arch/x86/include/generated -I./include -I./arch/x86/include/uapi -I./arch/x86/include/generated/uapi -I./include/uapi -I./include/generated/uapi -include ./include/linux/kconfig.h -include ./include/linux/compiler_types.h -D__KERNEL__ -Wall -Wundef -Werror=strict-prototypes -Wno-trigraphs -fno-strict-aliasing -fno-common -fshort-wchar -fno-PIE -Werror=implicit-function-declaration -Werror=implicit-int -Wno-format-security -std=gnu89 -mno-sse -mno-mmx -mno-sse2 -mno-3dnow -mno-avx -m64 -falign-jumps=1 -falign-loops=1 -mno-80387 -mno-fp-ret-in-387 -mpreferred-stack-boundary=3 -mskip-rax-setup -mtune=generic -mno-red-zone -mcmodel=kernel -DCONFIG_X86_X32_ABI -Wno-sign-compare -fno-asynchronous-unwind-tables -mindirect-branch=thunk-extern -mindirect-branch-register -fno-jump-tables -fno-delete-null-pointer-checks -Wno-frame-address -Wno-format-truncation -Wno-format-overflow -Wno-address-of-packed-member -O2 -fno-allow-store-data-races -fplugin=./scripts/gcc-plugins/structleak_plugin.so -fplugin=./scripts/gcc-plugins/randomize_layout_plugin.so -fplugin=./scripts/gcc-plugins/stackleak_plugin.so -fplugin-arg-structleak_plugin-byref-all -DSTRUCTLEAK_PLUGIN -DRANDSTRUCT_PLUGIN -fplugin-arg-randomize_layout_plugin-performance-mode -DSTACKLEAK_PLUGIN -fplugin-arg-stackleak_plugin-track-min-size=100 -Wframe-larger-than=2048 -fstack-protector-strong -Wno-unused-but-set-variable -Wimplicit-fallthrough -Wno-unused-const-variable -fno-var-tracking-assignments -gsplit-dwarf -gdwarf-4 -pg -mrecord-mcount -mfentry -DCC_USING_FENTRY -flive-patching=inline-clone -Wdeclaration-after-statement -Wvla -Wno-pointer-sign -Wno-stringop-truncation -Wno-zero-length-bounds -Wno-array-bounds -Wno-stringop-overflow -Wno-restrict -Wno-maybe-uninitialized -fno-strict-overflow -fno-merge-all-constants -fmerge-constants -fno-stack-check -fconserve-stack -Werror=date-time -Werror=incompatible-pointer-types -Werror=designated-init -fmacro-prefix-map=./= -fcf-protection=none -Wno-packed-not-aligned -I/tmp/B.JfsCO7/BUILD/NVIDIA-Linux-x86_64-390.132-no-compat32/kernel/common/inc -I/tmp/B.JfsCO7/BUILD/NVIDIA-Linux-x86_64-390.132-no-compat32/kernel -Wall -MD -Wsign-compare -Wno-cast-qual -Wno-error -D__KERNEL__ -DMODULE -DNVRM -DNV_VERSION_STRING=\"390.132\" -Wno-unused-function -Wuninitialized -fno-strict-aliasing -mno-red-zone -mcmodel=kernel -DNV_UVM_ENABLE -Wno-sign-compare -Wno-format-extra-args -Werror=undef -DNV_SPECTRE_V2=0 -I/tmp/B.JfsCO7/BUILD/NVIDIA-Linux-x86_64-390.132-no-compat32/kernel/nvidia -DNV_BUILD_MODULE_INSTANCES=0 -DNVIDIA_UNDEF_LEGACY_BIT_MACROS -UDEBUG -U_DEBUG -DNDEBUG -DMODULE -DKBUILD_BASENAME='"os_interface"' -DKBUILD_MODNAME='"nvidia"' -c -o /tmp/B.JfsCO7/BUILD/NVIDIA-Linux-x86_64-390.132-no-compat32/kernel/nvidia/os-interface.o /tmp/B.JfsCO7/BUILD/NVIDIA-Linux-x86_64-390.132-no-compat32/kernel/nvidia/os-interface.c ./tools/objtool/objtool orc generate --module --no-fp --retpoline --uaccess /tmp/B.JfsCO7/BUILD/NVIDIA-Linux-x86_64-390.132-no-compat32/kernel/nvidia/os-interface.o if objdump -h /tmp/B.JfsCO7/BUILD/NVIDIA-Linux-x86_64-390.132-no-compat32/kernel/nvidia/os-interface.o | grep -q __ksymtab; then x86_64-pld-linux-gcc -E -D__GENKSYMS__ -Wp,-MD,/tmp/B.JfsCO7/BUILD/NVIDIA-Linux-x86_64-390.132-no-compat32/kernel/nvidia/.os-interface.o.d -nostdinc -isystem /usr/lib64/gcc/x86_64-pld-linux/10.1.0/include -I./arch/x86/include -I./arch/x86/include/generated -I./include -I./arch/x86/include/uapi -I./arch/x86/include/generated/uapi -I./include/uapi -I./include/generated/uapi -include ./include/linux/kconfig.h -include ./include/linux/compiler_types.h -D__KERNEL__ -Wall -Wundef -Werror=strict-prototypes -Wno-trigraphs -fno-strict-aliasing -fno-common -fshort-wchar -fno-PIE -Werror=implicit-function-declaration -Werror=implicit-int -Wno-format-security -std=gnu89 -mno-sse -mno-mmx -mno-sse2 -mno-3dnow -mno-avx -m64 -falign-jumps=1 -falign-loops=1 -mno-80387 -mno-fp-ret-in-387 -mpreferred-stack-boundary=3 -mskip-rax-setup -mtune=generic -mno-red-zone -mcmodel=kernel -DCONFIG_X86_X32_ABI -Wno-sign-compare -fno-asynchronous-unwind-tables -mindirect-branch=thunk-extern -mindirect-branch-register -fno-jump-tables -fno-delete-null-pointer-checks -Wno-frame-address -Wno-format-truncation -Wno-format-overflow -Wno-address-of-packed-member -O2 -fno-allow-store-data-races -fplugin=./scripts/gcc-plugins/structleak_plugin.so -fplugin=./scripts/gcc-plugins/randomize_layout_plugin.so -fplugin=./scripts/gcc-plugins/stackleak_plugin.so -fplugin-arg-structleak_plugin-byref-all -DSTRUCTLEAK_PLUGIN -DRANDSTRUCT_PLUGIN -fplugin-arg-randomize_layout_plugin-performance-mode -DSTACKLEAK_PLUGIN -fplugin-arg-stackleak_plugin-track-min-size=100 -Wframe-larger-than=2048 -fstack-protector-strong -Wno-unused-but-set-variable -Wimplicit-fallthrough -Wno-unused-const-variable -fno-var-tracking-assignments -gsplit-dwarf -gdwarf-4 -pg -mrecord-mcount -mfentry -DCC_USING_FENTRY -flive-patching=inline-clone -Wdeclaration-after-statement -Wvla -Wno-pointer-sign -Wno-stringop-truncation -Wno-zero-length-bounds -Wno-array-bounds -Wno-stringop-overflow -Wno-restrict -Wno-maybe-uninitialized -fno-strict-overflow -fno-merge-all-constants -fmerge-constants -fno-stack-check -fconserve-stack -Werror=date-time -Werror=incompatible-pointer-types -Werror=designated-init -fmacro-prefix-map=./= -fcf-protection=none -Wno-packed-not-aligned -I/tmp/B.JfsCO7/BUILD/NVIDIA-Linux-x86_64-390.132-no-compat32/kernel/common/inc -I/tmp/B.JfsCO7/BUILD/NVIDIA-Linux-x86_64-390.132-no-compat32/kernel -Wall -MD -Wsign-compare -Wno-cast-qual -Wno-error -D__KERNEL__ -DMODULE -DNVRM -DNV_VERSION_STRING=\"390.132\" -Wno-unused-function -Wuninitialized -fno-strict-aliasing -mno-red-zone -mcmodel=kernel -DNV_UVM_ENABLE -Wno-sign-compare -Wno-format-extra-args -Werror=undef -DNV_SPECTRE_V2=0 -I/tmp/B.JfsCO7/BUILD/NVIDIA-Linux-x86_64-390.132-no-compat32/kernel/nvidia -DNV_BUILD_MODULE_INSTANCES=0 -DNVIDIA_UNDEF_LEGACY_BIT_MACROS -UDEBUG -U_DEBUG -DNDEBUG -DMODULE -DKBUILD_BASENAME='"os_interface"' -DKBUILD_MODNAME='"nvidia"' /tmp/B.JfsCO7/BUILD/NVIDIA-Linux-x86_64-390.132-no-compat32/kernel/nvidia/os-interface.c | scripts/genksyms/genksyms -r /dev/null > /tmp/B.JfsCO7/BUILD/NVIDIA-Linux-x86_64-390.132-no-compat32/kernel/nvidia/.tmp_os-interface.ver; ld -m elf_x86_64 -z max-page-size=0x200000 -r -o /tmp/B.JfsCO7/BUILD/NVIDIA-Linux-x86_64-390.132-no-compat32/kernel/nvidia/.tmp_os-interface.o /tmp/B.JfsCO7/BUILD/NVIDIA-Linux-x86_64-390.132-no-compat32/kernel/nvidia/os-interface.o -T /tmp/B.JfsCO7/BUILD/NVIDIA-Linux-x86_64-390.132-no-compat32/kernel/nvidia/.tmp_os-interface.ver; mv -f /tmp/B.JfsCO7/BUILD/NVIDIA-Linux-x86_64-390.132-no-compat32/kernel/nvidia/.tmp_os-interface.o /tmp/B.JfsCO7/BUILD/NVIDIA-Linux-x86_64-390.132-no-compat32/kernel/nvidia/os-interface.o; rm -f /tmp/B.JfsCO7/BUILD/NVIDIA-Linux-x86_64-390.132-no-compat32/kernel/nvidia/.tmp_os-interface.ver; fi x86_64-pld-linux-gcc -Wp,-MD,/tmp/B.JfsCO7/BUILD/NVIDIA-Linux-x86_64-390.132-no-compat32/kernel/nvidia/.os-usermap.o.d -nostdinc -isystem /usr/lib64/gcc/x86_64-pld-linux/10.1.0/include -I./arch/x86/include -I./arch/x86/include/generated -I./include -I./arch/x86/include/uapi -I./arch/x86/include/generated/uapi -I./include/uapi -I./include/generated/uapi -include ./include/linux/kconfig.h -include ./include/linux/compiler_types.h -D__KERNEL__ -Wall -Wundef -Werror=strict-prototypes -Wno-trigraphs -fno-strict-aliasing -fno-common -fshort-wchar -fno-PIE -Werror=implicit-function-declaration -Werror=implicit-int -Wno-format-security -std=gnu89 -mno-sse -mno-mmx -mno-sse2 -mno-3dnow -mno-avx -m64 -falign-jumps=1 -falign-loops=1 -mno-80387 -mno-fp-ret-in-387 -mpreferred-stack-boundary=3 -mskip-rax-setup -mtune=generic -mno-red-zone -mcmodel=kernel -DCONFIG_X86_X32_ABI -Wno-sign-compare -fno-asynchronous-unwind-tables -mindirect-branch=thunk-extern -mindirect-branch-register -fno-jump-tables -fno-delete-null-pointer-checks -Wno-frame-address -Wno-format-truncation -Wno-format-overflow -Wno-address-of-packed-member -O2 -fno-allow-store-data-races -fplugin=./scripts/gcc-plugins/structleak_plugin.so -fplugin=./scripts/gcc-plugins/randomize_layout_plugin.so -fplugin=./scripts/gcc-plugins/stackleak_plugin.so -fplugin-arg-structleak_plugin-byref-all -DSTRUCTLEAK_PLUGIN -DRANDSTRUCT_PLUGIN -fplugin-arg-randomize_layout_plugin-performance-mode -DSTACKLEAK_PLUGIN -fplugin-arg-stackleak_plugin-track-min-size=100 -Wframe-larger-than=2048 -fstack-protector-strong -Wno-unused-but-set-variable -Wimplicit-fallthrough -Wno-unused-const-variable -fno-var-tracking-assignments -gsplit-dwarf -gdwarf-4 -pg -mrecord-mcount -mfentry -DCC_USING_FENTRY -flive-patching=inline-clone -Wdeclaration-after-statement -Wvla -Wno-pointer-sign -Wno-stringop-truncation -Wno-zero-length-bounds -Wno-array-bounds -Wno-stringop-overflow -Wno-restrict -Wno-maybe-uninitialized -fno-strict-overflow -fno-merge-all-constants -fmerge-constants -fno-stack-check -fconserve-stack -Werror=date-time -Werror=incompatible-pointer-types -Werror=designated-init -fmacro-prefix-map=./= -fcf-protection=none -Wno-packed-not-aligned -I/tmp/B.JfsCO7/BUILD/NVIDIA-Linux-x86_64-390.132-no-compat32/kernel/common/inc -I/tmp/B.JfsCO7/BUILD/NVIDIA-Linux-x86_64-390.132-no-compat32/kernel -Wall -MD -Wsign-compare -Wno-cast-qual -Wno-error -D__KERNEL__ -DMODULE -DNVRM -DNV_VERSION_STRING=\"390.132\" -Wno-unused-function -Wuninitialized -fno-strict-aliasing -mno-red-zone -mcmodel=kernel -DNV_UVM_ENABLE -Wno-sign-compare -Wno-format-extra-args -Werror=undef -DNV_SPECTRE_V2=0 -I/tmp/B.JfsCO7/BUILD/NVIDIA-Linux-x86_64-390.132-no-compat32/kernel/nvidia -DNV_BUILD_MODULE_INSTANCES=0 -DNVIDIA_UNDEF_LEGACY_BIT_MACROS -UDEBUG -U_DEBUG -DNDEBUG -DMODULE -DKBUILD_BASENAME='"os_usermap"' -DKBUILD_MODNAME='"nvidia"' -c -o /tmp/B.JfsCO7/BUILD/NVIDIA-Linux-x86_64-390.132-no-compat32/kernel/nvidia/os-usermap.o /tmp/B.JfsCO7/BUILD/NVIDIA-Linux-x86_64-390.132-no-compat32/kernel/nvidia/os-usermap.c ./tools/objtool/objtool orc generate --module --no-fp --retpoline --uaccess /tmp/B.JfsCO7/BUILD/NVIDIA-Linux-x86_64-390.132-no-compat32/kernel/nvidia/os-usermap.o if objdump -h /tmp/B.JfsCO7/BUILD/NVIDIA-Linux-x86_64-390.132-no-compat32/kernel/nvidia/os-usermap.o | grep -q __ksymtab; then x86_64-pld-linux-gcc -E -D__GENKSYMS__ -Wp,-MD,/tmp/B.JfsCO7/BUILD/NVIDIA-Linux-x86_64-390.132-no-compat32/kernel/nvidia/.os-usermap.o.d -nostdinc -isystem /usr/lib64/gcc/x86_64-pld-linux/10.1.0/include -I./arch/x86/include -I./arch/x86/include/generated -I./include -I./arch/x86/include/uapi -I./arch/x86/include/generated/uapi -I./include/uapi -I./include/generated/uapi -include ./include/linux/kconfig.h -include ./include/linux/compiler_types.h -D__KERNEL__ -Wall -Wundef -Werror=strict-prototypes -Wno-trigraphs -fno-strict-aliasing -fno-common -fshort-wchar -fno-PIE -Werror=implicit-function-declaration -Werror=implicit-int -Wno-format-security -std=gnu89 -mno-sse -mno-mmx -mno-sse2 -mno-3dnow -mno-avx -m64 -falign-jumps=1 -falign-loops=1 -mno-80387 -mno-fp-ret-in-387 -mpreferred-stack-boundary=3 -mskip-rax-setup -mtune=generic -mno-red-zone -mcmodel=kernel -DCONFIG_X86_X32_ABI -Wno-sign-compare -fno-asynchronous-unwind-tables -mindirect-branch=thunk-extern -mindirect-branch-register -fno-jump-tables -fno-delete-null-pointer-checks -Wno-frame-address -Wno-format-truncation -Wno-format-overflow -Wno-address-of-packed-member -O2 -fno-allow-store-data-races -fplugin=./scripts/gcc-plugins/structleak_plugin.so -fplugin=./scripts/gcc-plugins/randomize_layout_plugin.so -fplugin=./scripts/gcc-plugins/stackleak_plugin.so -fplugin-arg-structleak_plugin-byref-all -DSTRUCTLEAK_PLUGIN -DRANDSTRUCT_PLUGIN -fplugin-arg-randomize_layout_plugin-performance-mode -DSTACKLEAK_PLUGIN -fplugin-arg-stackleak_plugin-track-min-size=100 -Wframe-larger-than=2048 -fstack-protector-strong -Wno-unused-but-set-variable -Wimplicit-fallthrough -Wno-unused-const-variable -fno-var-tracking-assignments -gsplit-dwarf -gdwarf-4 -pg -mrecord-mcount -mfentry -DCC_USING_FENTRY -flive-patching=inline-clone -Wdeclaration-after-statement -Wvla -Wno-pointer-sign -Wno-stringop-truncation -Wno-zero-length-bounds -Wno-array-bounds -Wno-stringop-overflow -Wno-restrict -Wno-maybe-uninitialized -fno-strict-overflow -fno-merge-all-constants -fmerge-constants -fno-stack-check -fconserve-stack -Werror=date-time -Werror=incompatible-pointer-types -Werror=designated-init -fmacro-prefix-map=./= -fcf-protection=none -Wno-packed-not-aligned -I/tmp/B.JfsCO7/BUILD/NVIDIA-Linux-x86_64-390.132-no-compat32/kernel/common/inc -I/tmp/B.JfsCO7/BUILD/NVIDIA-Linux-x86_64-390.132-no-compat32/kernel -Wall -MD -Wsign-compare -Wno-cast-qual -Wno-error -D__KERNEL__ -DMODULE -DNVRM -DNV_VERSION_STRING=\"390.132\" -Wno-unused-function -Wuninitialized -fno-strict-aliasing -mno-red-zone -mcmodel=kernel -DNV_UVM_ENABLE -Wno-sign-compare -Wno-format-extra-args -Werror=undef -DNV_SPECTRE_V2=0 -I/tmp/B.JfsCO7/BUILD/NVIDIA-Linux-x86_64-390.132-no-compat32/kernel/nvidia -DNV_BUILD_MODULE_INSTANCES=0 -DNVIDIA_UNDEF_LEGACY_BIT_MACROS -UDEBUG -U_DEBUG -DNDEBUG -DMODULE -DKBUILD_BASENAME='"os_usermap"' -DKBUILD_MODNAME='"nvidia"' /tmp/B.JfsCO7/BUILD/NVIDIA-Linux-x86_64-390.132-no-compat32/kernel/nvidia/os-usermap.c | scripts/genksyms/genksyms -r /dev/null > /tmp/B.JfsCO7/BUILD/NVIDIA-Linux-x86_64-390.132-no-compat32/kernel/nvidia/.tmp_os-usermap.ver; ld -m elf_x86_64 -z max-page-size=0x200000 -r -o /tmp/B.JfsCO7/BUILD/NVIDIA-Linux-x86_64-390.132-no-compat32/kernel/nvidia/.tmp_os-usermap.o /tmp/B.JfsCO7/BUILD/NVIDIA-Linux-x86_64-390.132-no-compat32/kernel/nvidia/os-usermap.o -T /tmp/B.JfsCO7/BUILD/NVIDIA-Linux-x86_64-390.132-no-compat32/kernel/nvidia/.tmp_os-usermap.ver; mv -f /tmp/B.JfsCO7/BUILD/NVIDIA-Linux-x86_64-390.132-no-compat32/kernel/nvidia/.tmp_os-usermap.o /tmp/B.JfsCO7/BUILD/NVIDIA-Linux-x86_64-390.132-no-compat32/kernel/nvidia/os-usermap.o; rm -f /tmp/B.JfsCO7/BUILD/NVIDIA-Linux-x86_64-390.132-no-compat32/kernel/nvidia/.tmp_os-usermap.ver; fi x86_64-pld-linux-gcc -Wp,-MD,/tmp/B.JfsCO7/BUILD/NVIDIA-Linux-x86_64-390.132-no-compat32/kernel/nvidia/.nv-kthread-q.o.d -nostdinc -isystem /usr/lib64/gcc/x86_64-pld-linux/10.1.0/include -I./arch/x86/include -I./arch/x86/include/generated -I./include -I./arch/x86/include/uapi -I./arch/x86/include/generated/uapi -I./include/uapi -I./include/generated/uapi -include ./include/linux/kconfig.h -include ./include/linux/compiler_types.h -D__KERNEL__ -Wall -Wundef -Werror=strict-prototypes -Wno-trigraphs -fno-strict-aliasing -fno-common -fshort-wchar -fno-PIE -Werror=implicit-function-declaration -Werror=implicit-int -Wno-format-security -std=gnu89 -mno-sse -mno-mmx -mno-sse2 -mno-3dnow -mno-avx -m64 -falign-jumps=1 -falign-loops=1 -mno-80387 -mno-fp-ret-in-387 -mpreferred-stack-boundary=3 -mskip-rax-setup -mtune=generic -mno-red-zone -mcmodel=kernel -DCONFIG_X86_X32_ABI -Wno-sign-compare -fno-asynchronous-unwind-tables -mindirect-branch=thunk-extern -mindirect-branch-register -fno-jump-tables -fno-delete-null-pointer-checks -Wno-frame-address -Wno-format-truncation -Wno-format-overflow -Wno-address-of-packed-member -O2 -fno-allow-store-data-races -fplugin=./scripts/gcc-plugins/structleak_plugin.so -fplugin=./scripts/gcc-plugins/randomize_layout_plugin.so -fplugin=./scripts/gcc-plugins/stackleak_plugin.so -fplugin-arg-structleak_plugin-byref-all -DSTRUCTLEAK_PLUGIN -DRANDSTRUCT_PLUGIN -fplugin-arg-randomize_layout_plugin-performance-mode -DSTACKLEAK_PLUGIN -fplugin-arg-stackleak_plugin-track-min-size=100 -Wframe-larger-than=2048 -fstack-protector-strong -Wno-unused-but-set-variable -Wimplicit-fallthrough -Wno-unused-const-variable -fno-var-tracking-assignments -gsplit-dwarf -gdwarf-4 -pg -mrecord-mcount -mfentry -DCC_USING_FENTRY -flive-patching=inline-clone -Wdeclaration-after-statement -Wvla -Wno-pointer-sign -Wno-stringop-truncation -Wno-zero-length-bounds -Wno-array-bounds -Wno-stringop-overflow -Wno-restrict -Wno-maybe-uninitialized -fno-strict-overflow -fno-merge-all-constants -fmerge-constants -fno-stack-check -fconserve-stack -Werror=date-time -Werror=incompatible-pointer-types -Werror=designated-init -fmacro-prefix-map=./= -fcf-protection=none -Wno-packed-not-aligned -I/tmp/B.JfsCO7/BUILD/NVIDIA-Linux-x86_64-390.132-no-compat32/kernel/common/inc -I/tmp/B.JfsCO7/BUILD/NVIDIA-Linux-x86_64-390.132-no-compat32/kernel -Wall -MD -Wsign-compare -Wno-cast-qual -Wno-error -D__KERNEL__ -DMODULE -DNVRM -DNV_VERSION_STRING=\"390.132\" -Wno-unused-function -Wuninitialized -fno-strict-aliasing -mno-red-zone -mcmodel=kernel -DNV_UVM_ENABLE -Wno-sign-compare -Wno-format-extra-args -Werror=undef -DNV_SPECTRE_V2=0 -I/tmp/B.JfsCO7/BUILD/NVIDIA-Linux-x86_64-390.132-no-compat32/kernel/nvidia -DNV_BUILD_MODULE_INSTANCES=0 -DNVIDIA_UNDEF_LEGACY_BIT_MACROS -UDEBUG -U_DEBUG -DNDEBUG -DMODULE -DKBUILD_BASENAME='"nv_kthread_q"' -DKBUILD_MODNAME='"nvidia"' -c -o /tmp/B.JfsCO7/BUILD/NVIDIA-Linux-x86_64-390.132-no-compat32/kernel/nvidia/nv-kthread-q.o /tmp/B.JfsCO7/BUILD/NVIDIA-Linux-x86_64-390.132-no-compat32/kernel/nvidia/nv-kthread-q.c ./tools/objtool/objtool orc generate --module --no-fp --retpoline --uaccess /tmp/B.JfsCO7/BUILD/NVIDIA-Linux-x86_64-390.132-no-compat32/kernel/nvidia/nv-kthread-q.o if objdump -h /tmp/B.JfsCO7/BUILD/NVIDIA-Linux-x86_64-390.132-no-compat32/kernel/nvidia/nv-kthread-q.o | grep -q __ksymtab; then x86_64-pld-linux-gcc -E -D__GENKSYMS__ -Wp,-MD,/tmp/B.JfsCO7/BUILD/NVIDIA-Linux-x86_64-390.132-no-compat32/kernel/nvidia/.nv-kthread-q.o.d -nostdinc -isystem /usr/lib64/gcc/x86_64-pld-linux/10.1.0/include -I./arch/x86/include -I./arch/x86/include/generated -I./include -I./arch/x86/include/uapi -I./arch/x86/include/generated/uapi -I./include/uapi -I./include/generated/uapi -include ./include/linux/kconfig.h -include ./include/linux/compiler_types.h -D__KERNEL__ -Wall -Wundef -Werror=strict-prototypes -Wno-trigraphs -fno-strict-aliasing -fno-common -fshort-wchar -fno-PIE -Werror=implicit-function-declaration -Werror=implicit-int -Wno-format-security -std=gnu89 -mno-sse -mno-mmx -mno-sse2 -mno-3dnow -mno-avx -m64 -falign-jumps=1 -falign-loops=1 -mno-80387 -mno-fp-ret-in-387 -mpreferred-stack-boundary=3 -mskip-rax-setup -mtune=generic -mno-red-zone -mcmodel=kernel -DCONFIG_X86_X32_ABI -Wno-sign-compare -fno-asynchronous-unwind-tables -mindirect-branch=thunk-extern -mindirect-branch-register -fno-jump-tables -fno-delete-null-pointer-checks -Wno-frame-address -Wno-format-truncation -Wno-format-overflow -Wno-address-of-packed-member -O2 -fno-allow-store-data-races -fplugin=./scripts/gcc-plugins/structleak_plugin.so -fplugin=./scripts/gcc-plugins/randomize_layout_plugin.so -fplugin=./scripts/gcc-plugins/stackleak_plugin.so -fplugin-arg-structleak_plugin-byref-all -DSTRUCTLEAK_PLUGIN -DRANDSTRUCT_PLUGIN -fplugin-arg-randomize_layout_plugin-performance-mode -DSTACKLEAK_PLUGIN -fplugin-arg-stackleak_plugin-track-min-size=100 -Wframe-larger-than=2048 -fstack-protector-strong -Wno-unused-but-set-variable -Wimplicit-fallthrough -Wno-unused-const-variable -fno-var-tracking-assignments -gsplit-dwarf -gdwarf-4 -pg -mrecord-mcount -mfentry -DCC_USING_FENTRY -flive-patching=inline-clone -Wdeclaration-after-statement -Wvla -Wno-pointer-sign -Wno-stringop-truncation -Wno-zero-length-bounds -Wno-array-bounds -Wno-stringop-overflow -Wno-restrict -Wno-maybe-uninitialized -fno-strict-overflow -fno-merge-all-constants -fmerge-constants -fno-stack-check -fconserve-stack -Werror=date-time -Werror=incompatible-pointer-types -Werror=designated-init -fmacro-prefix-map=./= -fcf-protection=none -Wno-packed-not-aligned -I/tmp/B.JfsCO7/BUILD/NVIDIA-Linux-x86_64-390.132-no-compat32/kernel/common/inc -I/tmp/B.JfsCO7/BUILD/NVIDIA-Linux-x86_64-390.132-no-compat32/kernel -Wall -MD -Wsign-compare -Wno-cast-qual -Wno-error -D__KERNEL__ -DMODULE -DNVRM -DNV_VERSION_STRING=\"390.132\" -Wno-unused-function -Wuninitialized -fno-strict-aliasing -mno-red-zone -mcmodel=kernel -DNV_UVM_ENABLE -Wno-sign-compare -Wno-format-extra-args -Werror=undef -DNV_SPECTRE_V2=0 -I/tmp/B.JfsCO7/BUILD/NVIDIA-Linux-x86_64-390.132-no-compat32/kernel/nvidia -DNV_BUILD_MODULE_INSTANCES=0 -DNVIDIA_UNDEF_LEGACY_BIT_MACROS -UDEBUG -U_DEBUG -DNDEBUG -DMODULE -DKBUILD_BASENAME='"nv_kthread_q"' -DKBUILD_MODNAME='"nvidia"' /tmp/B.JfsCO7/BUILD/NVIDIA-Linux-x86_64-390.132-no-compat32/kernel/nvidia/nv-kthread-q.c | scripts/genksyms/genksyms -r /dev/null > /tmp/B.JfsCO7/BUILD/NVIDIA-Linux-x86_64-390.132-no-compat32/kernel/nvidia/.tmp_nv-kthread-q.ver; ld -m elf_x86_64 -z max-page-size=0x200000 -r -o /tmp/B.JfsCO7/BUILD/NVIDIA-Linux-x86_64-390.132-no-compat32/kernel/nvidia/.tmp_nv-kthread-q.o /tmp/B.JfsCO7/BUILD/NVIDIA-Linux-x86_64-390.132-no-compat32/kernel/nvidia/nv-kthread-q.o -T /tmp/B.JfsCO7/BUILD/NVIDIA-Linux-x86_64-390.132-no-compat32/kernel/nvidia/.tmp_nv-kthread-q.ver; mv -f /tmp/B.JfsCO7/BUILD/NVIDIA-Linux-x86_64-390.132-no-compat32/kernel/nvidia/.tmp_nv-kthread-q.o /tmp/B.JfsCO7/BUILD/NVIDIA-Linux-x86_64-390.132-no-compat32/kernel/nvidia/nv-kthread-q.o; rm -f /tmp/B.JfsCO7/BUILD/NVIDIA-Linux-x86_64-390.132-no-compat32/kernel/nvidia/.tmp_nv-kthread-q.ver; fi x86_64-pld-linux-gcc -Wp,-MD,/tmp/B.JfsCO7/BUILD/NVIDIA-Linux-x86_64-390.132-no-compat32/kernel/nvidia/.nv-modeset-interface.o.d -nostdinc -isystem /usr/lib64/gcc/x86_64-pld-linux/10.1.0/include -I./arch/x86/include -I./arch/x86/include/generated -I./include -I./arch/x86/include/uapi -I./arch/x86/include/generated/uapi -I./include/uapi -I./include/generated/uapi -include ./include/linux/kconfig.h -include ./include/linux/compiler_types.h -D__KERNEL__ -Wall -Wundef -Werror=strict-prototypes -Wno-trigraphs -fno-strict-aliasing -fno-common -fshort-wchar -fno-PIE -Werror=implicit-function-declaration -Werror=implicit-int -Wno-format-security -std=gnu89 -mno-sse -mno-mmx -mno-sse2 -mno-3dnow -mno-avx -m64 -falign-jumps=1 -falign-loops=1 -mno-80387 -mno-fp-ret-in-387 -mpreferred-stack-boundary=3 -mskip-rax-setup -mtune=generic -mno-red-zone -mcmodel=kernel -DCONFIG_X86_X32_ABI -Wno-sign-compare -fno-asynchronous-unwind-tables -mindirect-branch=thunk-extern -mindirect-branch-register -fno-jump-tables -fno-delete-null-pointer-checks -Wno-frame-address -Wno-format-truncation -Wno-format-overflow -Wno-address-of-packed-member -O2 -fno-allow-store-data-races -fplugin=./scripts/gcc-plugins/structleak_plugin.so -fplugin=./scripts/gcc-plugins/randomize_layout_plugin.so -fplugin=./scripts/gcc-plugins/stackleak_plugin.so -fplugin-arg-structleak_plugin-byref-all -DSTRUCTLEAK_PLUGIN -DRANDSTRUCT_PLUGIN -fplugin-arg-randomize_layout_plugin-performance-mode -DSTACKLEAK_PLUGIN -fplugin-arg-stackleak_plugin-track-min-size=100 -Wframe-larger-than=2048 -fstack-protector-strong -Wno-unused-but-set-variable -Wimplicit-fallthrough -Wno-unused-const-variable -fno-var-tracking-assignments -gsplit-dwarf -gdwarf-4 -pg -mrecord-mcount -mfentry -DCC_USING_FENTRY -flive-patching=inline-clone -Wdeclaration-after-statement -Wvla -Wno-pointer-sign -Wno-stringop-truncation -Wno-zero-length-bounds -Wno-array-bounds -Wno-stringop-overflow -Wno-restrict -Wno-maybe-uninitialized -fno-strict-overflow -fno-merge-all-constants -fmerge-constants -fno-stack-check -fconserve-stack -Werror=date-time -Werror=incompatible-pointer-types -Werror=designated-init -fmacro-prefix-map=./= -fcf-protection=none -Wno-packed-not-aligned -I/tmp/B.JfsCO7/BUILD/NVIDIA-Linux-x86_64-390.132-no-compat32/kernel/common/inc -I/tmp/B.JfsCO7/BUILD/NVIDIA-Linux-x86_64-390.132-no-compat32/kernel -Wall -MD -Wsign-compare -Wno-cast-qual -Wno-error -D__KERNEL__ -DMODULE -DNVRM -DNV_VERSION_STRING=\"390.132\" -Wno-unused-function -Wuninitialized -fno-strict-aliasing -mno-red-zone -mcmodel=kernel -DNV_UVM_ENABLE -Wno-sign-compare -Wno-format-extra-args -Werror=undef -DNV_SPECTRE_V2=0 -I/tmp/B.JfsCO7/BUILD/NVIDIA-Linux-x86_64-390.132-no-compat32/kernel/nvidia -DNV_BUILD_MODULE_INSTANCES=0 -DNVIDIA_UNDEF_LEGACY_BIT_MACROS -UDEBUG -U_DEBUG -DNDEBUG -DMODULE -DKBUILD_BASENAME='"nv_modeset_interface"' -DKBUILD_MODNAME='"nvidia"' -c -o /tmp/B.JfsCO7/BUILD/NVIDIA-Linux-x86_64-390.132-no-compat32/kernel/nvidia/nv-modeset-interface.o /tmp/B.JfsCO7/BUILD/NVIDIA-Linux-x86_64-390.132-no-compat32/kernel/nvidia/nv-modeset-interface.c ./tools/objtool/objtool orc generate --module --no-fp --retpoline --uaccess /tmp/B.JfsCO7/BUILD/NVIDIA-Linux-x86_64-390.132-no-compat32/kernel/nvidia/nv-modeset-interface.o if objdump -h /tmp/B.JfsCO7/BUILD/NVIDIA-Linux-x86_64-390.132-no-compat32/kernel/nvidia/nv-modeset-interface.o | grep -q __ksymtab; then x86_64-pld-linux-gcc -E -D__GENKSYMS__ -Wp,-MD,/tmp/B.JfsCO7/BUILD/NVIDIA-Linux-x86_64-390.132-no-compat32/kernel/nvidia/.nv-modeset-interface.o.d -nostdinc -isystem /usr/lib64/gcc/x86_64-pld-linux/10.1.0/include -I./arch/x86/include -I./arch/x86/include/generated -I./include -I./arch/x86/include/uapi -I./arch/x86/include/generated/uapi -I./include/uapi -I./include/generated/uapi -include ./include/linux/kconfig.h -include ./include/linux/compiler_types.h -D__KERNEL__ -Wall -Wundef -Werror=strict-prototypes -Wno-trigraphs -fno-strict-aliasing -fno-common -fshort-wchar -fno-PIE -Werror=implicit-function-declaration -Werror=implicit-int -Wno-format-security -std=gnu89 -mno-sse -mno-mmx -mno-sse2 -mno-3dnow -mno-avx -m64 -falign-jumps=1 -falign-loops=1 -mno-80387 -mno-fp-ret-in-387 -mpreferred-stack-boundary=3 -mskip-rax-setup -mtune=generic -mno-red-zone -mcmodel=kernel -DCONFIG_X86_X32_ABI -Wno-sign-compare -fno-asynchronous-unwind-tables -mindirect-branch=thunk-extern -mindirect-branch-register -fno-jump-tables -fno-delete-null-pointer-checks -Wno-frame-address -Wno-format-truncation -Wno-format-overflow -Wno-address-of-packed-member -O2 -fno-allow-store-data-races -fplugin=./scripts/gcc-plugins/structleak_plugin.so -fplugin=./scripts/gcc-plugins/randomize_layout_plugin.so -fplugin=./scripts/gcc-plugins/stackleak_plugin.so -fplugin-arg-structleak_plugin-byref-all -DSTRUCTLEAK_PLUGIN -DRANDSTRUCT_PLUGIN -fplugin-arg-randomize_layout_plugin-performance-mode -DSTACKLEAK_PLUGIN -fplugin-arg-stackleak_plugin-track-min-size=100 -Wframe-larger-than=2048 -fstack-protector-strong -Wno-unused-but-set-variable -Wimplicit-fallthrough -Wno-unused-const-variable -fno-var-tracking-assignments -gsplit-dwarf -gdwarf-4 -pg -mrecord-mcount -mfentry -DCC_USING_FENTRY -flive-patching=inline-clone -Wdeclaration-after-statement -Wvla -Wno-pointer-sign -Wno-stringop-truncation -Wno-zero-length-bounds -Wno-array-bounds -Wno-stringop-overflow -Wno-restrict -Wno-maybe-uninitialized -fno-strict-overflow -fno-merge-all-constants -fmerge-constants -fno-stack-check -fconserve-stack -Werror=date-time -Werror=incompatible-pointer-types -Werror=designated-init -fmacro-prefix-map=./= -fcf-protection=none -Wno-packed-not-aligned -I/tmp/B.JfsCO7/BUILD/NVIDIA-Linux-x86_64-390.132-no-compat32/kernel/common/inc -I/tmp/B.JfsCO7/BUILD/NVIDIA-Linux-x86_64-390.132-no-compat32/kernel -Wall -MD -Wsign-compare -Wno-cast-qual -Wno-error -D__KERNEL__ -DMODULE -DNVRM -DNV_VERSION_STRING=\"390.132\" -Wno-unused-function -Wuninitialized -fno-strict-aliasing -mno-red-zone -mcmodel=kernel -DNV_UVM_ENABLE -Wno-sign-compare -Wno-format-extra-args -Werror=undef -DNV_SPECTRE_V2=0 -I/tmp/B.JfsCO7/BUILD/NVIDIA-Linux-x86_64-390.132-no-compat32/kernel/nvidia -DNV_BUILD_MODULE_INSTANCES=0 -DNVIDIA_UNDEF_LEGACY_BIT_MACROS -UDEBUG -U_DEBUG -DNDEBUG -DMODULE -DKBUILD_BASENAME='"nv_modeset_interface"' -DKBUILD_MODNAME='"nvidia"' /tmp/B.JfsCO7/BUILD/NVIDIA-Linux-x86_64-390.132-no-compat32/kernel/nvidia/nv-modeset-interface.c | scripts/genksyms/genksyms -r /dev/null > /tmp/B.JfsCO7/BUILD/NVIDIA-Linux-x86_64-390.132-no-compat32/kernel/nvidia/.tmp_nv-modeset-interface.ver; ld -m elf_x86_64 -z max-page-size=0x200000 -r -o /tmp/B.JfsCO7/BUILD/NVIDIA-Linux-x86_64-390.132-no-compat32/kernel/nvidia/.tmp_nv-modeset-interface.o /tmp/B.JfsCO7/BUILD/NVIDIA-Linux-x86_64-390.132-no-compat32/kernel/nvidia/nv-modeset-interface.o -T /tmp/B.JfsCO7/BUILD/NVIDIA-Linux-x86_64-390.132-no-compat32/kernel/nvidia/.tmp_nv-modeset-interface.ver; mv -f /tmp/B.JfsCO7/BUILD/NVIDIA-Linux-x86_64-390.132-no-compat32/kernel/nvidia/.tmp_nv-modeset-interface.o /tmp/B.JfsCO7/BUILD/NVIDIA-Linux-x86_64-390.132-no-compat32/kernel/nvidia/nv-modeset-interface.o; rm -f /tmp/B.JfsCO7/BUILD/NVIDIA-Linux-x86_64-390.132-no-compat32/kernel/nvidia/.tmp_nv-modeset-interface.ver; fi make[1]: *** [Makefile:1729: /tmp/B.JfsCO7/BUILD/NVIDIA-Linux-x86_64-390.132-no-compat32/kernel] Error 2 make: *** [Makefile:81: modules] Error 2 error: Bad exit status from /tmp/B.JfsCO7/BUILD/tmp/rpm-tmp.69078 (%build) RPM build errors: Bad exit status from /tmp/B.JfsCO7/BUILD/tmp/rpm-tmp.69078 (%build) ended at: Sat Jun 6 10:25:17 2020, done in 0:00:17.434959 error: No files produced. + chmod -R u+rwX /tmp/B.JfsCO7/BUILD + rm -rf /tmp/B.JfsCO7/tmp /tmp/B.JfsCO7/BUILD + rm -rf /tmp/B.JfsCO7 Begin-PLD-Builder-Info Build-Time: user:68.21s sys:10.54s real:41.73s (faults io:0 non-io:3008292) End-PLD-Builder-Info
[Back to list of logs] [View rpm -qa of builder]