FailedOk

th/SRPMS[OK]
th/x32[OK]
th/i686[OK]
th/x86_64[OK]

ac/SRPMS[OK]
ac/i386[OK]
ac/i586[OK]
ac/i686[OK]
ac/alpha[OK]
ac/amd64[OK]
ac/athlon[OK]
ac/ppc[OK]
ac/sparc[OK]
ac/sparc64[OK]

Advanced Search
main()
Powered by PLD Linux
(c) 2002-2021 PLD Team
$Revision: 1.37 $
Powered by NSA.
Your IP: 3.237.97.64

xorg-driver-video-nvidia-legacy-390xx d5be0474-6334-4e36-a307-e3a9317af592

Status:Failed
Source URL:https://buildlogs.pld-linux.org/pld/th/x86_64/FAIL/xorg-driver-video-nvidia-legacy-390xx,d5be0474-6334-4e36-a307-e3a9317af592.bz2
text/plain URL:View!
rpm -qa of builder:View!
Date:2021/02/23 01:37:51
Runtime:0:00:15.167530

Toc:

  • prep
  • Executing(%prep): /bin/sh -e /tmp/B.scl2CX/BUILD/tmp/rpm-tmp.M5wD4i
  • build
  • Executing(%build): /bin/sh -e /tmp/B.scl2CX/BUILD/tmp/rpm-tmp.sW1LQ2
  • error 1
  • echo >&2 " ERROR: Kernel configuration is invalid."; \
  • error 2
  • /tmp/B.scl2CX/BUILD/NVIDIA-Linux-x86_64-390.141-no-compat32/kernel/common/inc/nv-linux.h:118:10: fatal error: asm/kmap_types.h: No such file or directory
  • error 3
  • compilation terminated.
  • error 4
  • make[2]: *** [scripts/Makefile.build:279: /tmp/B.scl2CX/BUILD/NVIDIA-Linux-x86_64-390.141-no-compat32/kernel/nvidia/nv-instance.o] Error 1
  • error 5
  • /tmp/B.scl2CX/BUILD/NVIDIA-Linux-x86_64-390.141-no-compat32/kernel/common/inc/nv-linux.h:118:10: fatal error: asm/kmap_types.h: No such file or directory
  • error 6
  • compilation terminated.
  • error 7
  • make[2]: *** [scripts/Makefile.build:279: /tmp/B.scl2CX/BUILD/NVIDIA-Linux-x86_64-390.141-no-compat32/kernel/nvidia/nv-acpi.o] Error 1
  • error 8
  • /tmp/B.scl2CX/BUILD/NVIDIA-Linux-x86_64-390.141-no-compat32/kernel/common/inc/nv-linux.h:118:10: fatal error: asm/kmap_types.h: No such file or directory
  • error 9
  • compilation terminated.
  • error 10
  • make[2]: *** [scripts/Makefile.build:279: /tmp/B.scl2CX/BUILD/NVIDIA-Linux-x86_64-390.141-no-compat32/kernel/nvidia/nv-gpu-numa.o] Error 1
  • error 11
  • /tmp/B.scl2CX/BUILD/NVIDIA-Linux-x86_64-390.141-no-compat32/kernel/common/inc/nv-linux.h:118:10: fatal error: asm/kmap_types.h: No such file or directory
  • error 12
  • compilation terminated.
  • error 13
  • make[2]: *** [scripts/Makefile.build:279: /tmp/B.scl2CX/BUILD/NVIDIA-Linux-x86_64-390.141-no-compat32/kernel/nvidia/nv-chrdev.o] Error 1
  • error 14
  • /tmp/B.scl2CX/BUILD/NVIDIA-Linux-x86_64-390.141-no-compat32/kernel/common/inc/nv-linux.h:118:10: fatal error: asm/kmap_types.h: No such file or directory
  • error 15
  • compilation terminated.
  • error 16
  • make[2]: *** [scripts/Makefile.build:279: /tmp/B.scl2CX/BUILD/NVIDIA-Linux-x86_64-390.141-no-compat32/kernel/nvidia/nv-dma.o] Error 1
  • error 17
  • /tmp/B.scl2CX/BUILD/NVIDIA-Linux-x86_64-390.141-no-compat32/kernel/common/inc/nv-linux.h:118:10: fatal error: asm/kmap_types.h: No such file or directory
  • error 18
  • compilation terminated.
  • error 19
  • make[2]: *** [scripts/Makefile.build:279: /tmp/B.scl2CX/BUILD/NVIDIA-Linux-x86_64-390.141-no-compat32/kernel/nvidia/nv-cray.o] Error 1
  • error 20
  • /tmp/B.scl2CX/BUILD/NVIDIA-Linux-x86_64-390.141-no-compat32/kernel/common/inc/nv-linux.h:118:10: fatal error: asm/kmap_types.h: No such file or directory
  • error 21
  • compilation terminated.
  • error 22
  • make[2]: *** [scripts/Makefile.build:279: /tmp/B.scl2CX/BUILD/NVIDIA-Linux-x86_64-390.141-no-compat32/kernel/nvidia/nv-frontend.o] Error 1
  • error 23
  • /tmp/B.scl2CX/BUILD/NVIDIA-Linux-x86_64-390.141-no-compat32/kernel/common/inc/nv-linux.h:118:10: fatal error: asm/kmap_types.h: No such file or directory
  • error 24
  • compilation terminated.
  • error 25
  • make[2]: *** [scripts/Makefile.build:279: /tmp/B.scl2CX/BUILD/NVIDIA-Linux-x86_64-390.141-no-compat32/kernel/nvidia/nv.o] Error 1
  • error 26
  • /tmp/B.scl2CX/BUILD/NVIDIA-Linux-x86_64-390.141-no-compat32/kernel/common/inc/nv-linux.h:118:10: fatal error: asm/kmap_types.h: No such file or directory
  • error 27
  • compilation terminated.
  • error 28
  • make[2]: *** [scripts/Makefile.build:279: /tmp/B.scl2CX/BUILD/NVIDIA-Linux-x86_64-390.141-no-compat32/kernel/nvidia/nv-gvi.o] Error 1
  • error 29
  • make[1]: *** [Makefile:1800: /tmp/B.scl2CX/BUILD/NVIDIA-Linux-x86_64-390.141-no-compat32/kernel] Error 2
  • error 30
  • error: Bad exit status from /tmp/B.scl2CX/BUILD/tmp/rpm-tmp.sW1LQ2 (%build)
  • error 31
  • RPM build errors:
  • error 32
  • error: No files produced.

Content:

request from: baggins
checking if we should skip the build
started at: Tue Feb 23 01:37:29 2021
killing old processes on a builder
sending signal 9 to pid -1
cleaning up /tmp
fetching https://srcbuilder.pld-linux.org/th//srpms/d5be0474-6334-4e36-a307-e3a9317af592/xorg-driver-video-nvidia-legacy-390xx-kernel-390.141-1%405.11.0_1.src.rpm
fetched 98287363 bytes, 30411.5 K/s
installing srpm: xorg-driver-video-nvidia-legacy-390xx-kernel-390.141-1@5.11.0_1.src.rpm
+ install -d /tmp/B.scl2CX/BUILD /tmp/B.scl2CX/RPMS
+ LC_ALL=en_US.UTF-8
+ rpm -qp --changelog xorg-driver-video-nvidia-legacy-390xx-kernel-390.141-1@5.11.0_1.src.rpm
* Tue Feb 23 2021 PLD Linux Team <feedback@pld-linux.org>
- For complete changelog see: http://git.pld-linux.org/?p=packages/xorg-driver-video-nvidia-legacy-390xx.git;a=log;h=master
* Fri Jan 08 2021 Jan Palus <atler@pld-linux.org> ebe2077
- multiple security fixes, see: https://nvidia.custhelp.com/app/answers/detail/a_id/5142/kw/Security%20Bulletin * Thu Dec 24 2020 Jan Rękorajski <baggins@pld-linux.org> e02f646
- release 4 (by relup.sh) * Tue Dec 22 2020 Jan Palus <atler@pld-linux.org> 183f8e0
- fix build with kernel 5.10 * Wed Oct 21 2020 Jan Rękorajski <baggins@pld-linux.org> f69d11a
- remove uvm bits from generic patch - run compile tests * Wed Oct 21 2020 Jan Rękorajski <baggins@pld-linux.org> 88d459b
- move uvm bits to separate patch * Wed Oct 21 2020 Jan Rękorajski <baggins@pld-linux.org> 4dcaafe
- fix building modules for kernel 5.9 - rel 3 * Wed Aug 19 2020 Jan Rękorajski <baggins@pld-linux.org> 23fbb02
- patch nvidia-uvm inly on x8886, module is not present on 32bit arch * Wed Aug 19 2020 Jan Rękorajski <baggins@pld-linux.org> e94cfbe
- install nvidia-uvm stub module for kernel 5.8 * Wed Aug 19 2020 Jan Rękorajski <baggins@pld-linux.org> b068543
- fix building with kernel 5.8 - disabled nvidia-uvm on 5.8+ because symbols used by module are now GPL-only - rel 2 * Wed Jun 24 2020 Jan Palus <atler@pld-linux.org> eb52342
- up to 390.138 * Sat Jun 06 2020 Jan Rękorajski <baggins@pld-linux.org> 7459cc2
- release 7 (by relup.sh) * Thu Jun 04 2020 Jan Palus <atler@pld-linux.org> bf926a1
- fix build with kernel 5.7 * Mon Apr 06 2020 Jan Rękorajski <baggins@pld-linux.org> ecd2497
- rel 6 * Mon Apr 06 2020 Jan Rękorajski <baggins@pld-linux.org> 23759ce
- fix patching on i686 * Mon Apr 06 2020 Jan Rękorajski <baggins@pld-linux.org> 05601f3
- fix build checks - rel 5 * Mon Apr 06 2020 Jan Rękorajski <baggins@pld-linux.org> 0d7fb07
- some build fixes, still fails on 4.14 * Sun Apr 05 2020 Jan Rękorajski <baggins@pld-linux.org> 47227e1
- fix buulding for kernel 5.6 - rel 4 * Wed Jan 29 2020 Jan Rękorajski <baggins@pld-linux.org> 80f05ca
- fix building with kernel 5.5 - rel 3 * Sat Jan 18 2020 Jan Palus <atler@pld-linux.org> 41fed34
- release 2 (by relup.sh) * Sat Jan 18 2020 Jan Palus <atler@pld-linux.org> bf4bf75
- appears to work fine with abi 24.1 + rpm -Uhv --nodeps --define '_topdir /tmp/B.scl2CX' --define '_specdir %{_topdir}' --define '_sourcedir %{_specdir}' --define '_rpmdir %{_topdir}/RPMS' --define '_builddir %{_topdir}/BUILD' --without userspace --define 'build_kernels head' xorg-driver-video-nvidia-legacy-390xx-kernel-390.141-1@5.11.0_1.src.rpm Updating / installing... xorg-driver-video-nvidia-legacy-390xx-######################################## + rm -f xorg-driver-video-nvidia-legacy-390xx-kernel-390.141-1@5.11.0_1.src.rpm + install -m 700 -d /tmp/B.scl2CX/BUILD/tmp + TMPDIR=/tmp/B.scl2CX/BUILD/tmp + exec nice -n 0 rpmbuild -bp --short-circuit --nodeps --define '_topdir /tmp/B.scl2CX' --define '_specdir %{_topdir}' --define '_sourcedir %{_specdir}' --define '_rpmdir %{_topdir}/RPMS' --define '_builddir %{_topdir}/BUILD' --without userspace --target x86_64-pld-linux --define 'build_kernels head' --define 'prep exit 0' /tmp/B.scl2CX/xorg-driver-video-nvidia-legacy-390xx.spec warning: line 72: It's not recommended to have unversioned Obsoletes: Obsoletes: XFree86-driver-nvidia warning: line 73: It's not recommended to have unversioned Obsoletes: Obsoletes: XFree86-nvidia warning: line 149: It's not recommended to have unversioned Obsoletes: Obsoletes: X11-OpenGL-devel-base warning: line 150: It's not recommended to have unversioned Obsoletes: Obsoletes: XFree86-OpenGL-devel-base warning: line 151: It's not recommended to have unversioned Obsoletes: Obsoletes: XFree86-driver-nvidia-devel warning: line 183: It's not recommended to have unversioned Obsoletes: Obsoletes: XFree86-driver-nvidia-progs warning: line 250: It's not recommended to have unversioned Obsoletes: Obsoletes: XFree86-nvidia-kernel warning: Could not canonicalize hostname: ymir Building target platforms: x86_64-pld-linux Building for target x86_64-pld-linux checking BuildConflict-ing packages no BuildConflicts found checking BR no BR needed building RPM using: set -ex; : build-id: d5be0474-6334-4e36-a307-e3a9317af592; TMPDIR=/tmp/B.scl2CX/BUILD/tmp exec nice -n 0 rpmbuild -bb --define '_smp_mflags -j9' --define '_make_opts -Otarget' --define '_pld_builder 1' --define '_topdir /tmp/B.scl2CX' --define '_specdir %{_topdir}' --define '_sourcedir %{_specdir}' --define '_rpmdir %{_topdir}/RPMS' --define '_builddir %{_topdir}/BUILD' --without userspace --target x86_64-pld-linux --define 'build_kernels head' /tmp/B.scl2CX/xorg-driver-video-nvidia-legacy-390xx.spec + : build-id: d5be0474-6334-4e36-a307-e3a9317af592 + TMPDIR=/tmp/B.scl2CX/BUILD/tmp + exec nice -n 0 rpmbuild -bb --define '_smp_mflags -j9' --define '_make_opts -Otarget' --define '_pld_builder 1' --define '_topdir /tmp/B.scl2CX' --define '_specdir %{_topdir}' --define '_sourcedir %{_specdir}' --define '_rpmdir %{_topdir}/RPMS' --define '_builddir %{_topdir}/BUILD' --without userspace --target x86_64-pld-linux --define 'build_kernels head' /tmp/B.scl2CX/xorg-driver-video-nvidia-legacy-390xx.spec warning: line 72: It's not recommended to have unversioned Obsoletes: Obsoletes: XFree86-driver-nvidia warning: line 73: It's not recommended to have unversioned Obsoletes: Obsoletes: XFree86-nvidia warning: line 149: It's not recommended to have unversioned Obsoletes: Obsoletes: X11-OpenGL-devel-base warning: line 150: It's not recommended to have unversioned Obsoletes: Obsoletes: XFree86-OpenGL-devel-base warning: line 151: It's not recommended to have unversioned Obsoletes: Obsoletes: XFree86-driver-nvidia-devel warning: line 183: It's not recommended to have unversioned Obsoletes: Obsoletes: XFree86-driver-nvidia-progs warning: line 250: It's not recommended to have unversioned Obsoletes: Obsoletes: XFree86-nvidia-kernel warning: Could not canonicalize hostname: ymir Building target platforms: x86_64-pld-linux Building for target x86_64-pld-linux Executing(%prep): /bin/sh -e /tmp/B.scl2CX/BUILD/tmp/rpm-tmp.M5wD4i + umask 022 + cd /tmp/B.scl2CX/BUILD + cd /tmp/B.scl2CX/BUILD + rm -rf 'NVIDIA-Linux-x86*-390.141*' + /bin/sh /tmp/B.scl2CX/NVIDIA-Linux-x86_64-390.141-no-compat32.run --extract-only Creating directory NVIDIA-Linux-x86_64-390.141-no-compat32 Verifying archive integrity... OK Uncompressing NVIDIA Accelerated Graphics Driver for Linux-x86_64 390.141........................................................................................................................................................................................................................................................................................................................................................................................................................................................................................ + cd /tmp/B.scl2CX/BUILD + cd NVIDIA-Linux-x86_64-390.141-no-compat32 + /bin/chmod -Rf a+rX,u+w,g-w,o-w . + echo 'Patch #0 (X11-driver-nvidia-GL.patch):' Patch #0 (X11-driver-nvidia-GL.patch): + </tmp/B.scl2CX/X11-driver-nvidia-GL.patch + /usr/bin/patch -s -p1 '--fuzz=0' + echo 'Patch #1 (X11-driver-nvidia-desktop.patch):' Patch #1 (X11-driver-nvidia-desktop.patch): + </tmp/B.scl2CX/X11-driver-nvidia-desktop.patch + /usr/bin/patch -s -p1 '--fuzz=0' + >>kernel/Makefile.kbuild + echo 'EXTRA_CFLAGS += -Wno-pointer-arith -Wno-sign-compare -Wno-unused' + RPM_EC=0 + jobs -p + exit 0 Executing(%build): /bin/sh -e /tmp/B.scl2CX/BUILD/tmp/rpm-tmp.sW1LQ2 TMP=/home/users/builder/tmp HOME=/home/users/builder PATH=/home/users/builder/GNUstep/Tools:/bin:/usr/bin:/usr/local/bin:/home/users/builder/bin TMPDIR=/tmp/B.scl2CX/BUILD/tmp + umask 022 + cd /tmp/B.scl2CX/BUILD + cd NVIDIA-Linux-x86_64-390.141-no-compat32 + cd kernel + /usr/bin/make -Otarget -j9 'SYSSRC=/usr/src/linux' clean rm -f -r conftest + /usr/bin/make -Otarget -j9 'SYSSRC=/usr/src/linux' 'IGNORE_CC_MISMATCH=1' 'NV_VERBOSE=1' 'CC=x86_64-pld-linux-gcc' module make[1]: Entering directory '/usr/src/linux-5.11.0' test -e include/generated/autoconf.h -a -e include/config/auto.conf || ( \ echo >&2; \ echo >&2 " ERROR: Kernel configuration is invalid."; \ echo >&2 " include/generated/autoconf.h or include/config/auto.conf are missing.";\ echo >&2 " Run 'make oldconfig && make prepare' on kernel src to fix it."; \ echo >&2 ; \ /bin/false) make[1]: Leaving directory '/usr/src/linux-5.11.0' /usr/bin/make -f ./scripts/Makefile.build obj=/tmp/B.scl2CX/BUILD/NVIDIA-Linux-x86_64-390.141-no-compat32/kernel \ single-build= \ need-builtin=1 need-modorder=1 scripts/Makefile.lib:8: 'always' is deprecated. Please use 'always-y' instead ln -sf /tmp/B.scl2CX/BUILD/NVIDIA-Linux-x86_64-390.141-no-compat32/kernel/nvidia/nv-kernel.o_binary /tmp/B.scl2CX/BUILD/NVIDIA-Linux-x86_64-390.141-no-compat32/kernel/nvidia/nv-kernel.o ln -sf /tmp/B.scl2CX/BUILD/NVIDIA-Linux-x86_64-390.141-no-compat32/kernel/nvidia-modeset/nv-modeset-kernel.o_binary /tmp/B.scl2CX/BUILD/NVIDIA-Linux-x86_64-390.141-no-compat32/kernel/nvidia-modeset/nv-modeset-kernel.o CONFTEST: vmap CONFTEST: set_pages_uc CONFTEST: hash__remap_4k_pfn CONFTEST: set_memory_uc CONFTEST: list_is_first CONFTEST: set_memory_array_uc CONFTEST: remap_pfn_range CONFTEST: follow_pfn CONFTEST: acquire_console_sem CONFTEST: change_page_attr CONFTEST: console_lock CONFTEST: INIT_WORK CONFTEST: vm_insert_page CONFTEST: acpi_device_id CONFTEST: pci_choose_state CONFTEST: pci_get_class CONFTEST: ioremap_cache CONFTEST: ioremap_wc CONFTEST: sg_init_table CONFTEST: on_each_cpu CONFTEST: acpi_evaluate_integer CONFTEST: pci_domain_nr CONFTEST: smp_call_function CONFTEST: kmem_cache_create CONFTEST: pci_dma_mapping_error CONFTEST: pci_get_domain_bus_and_slot CONFTEST: acpi_walk_namespace CONFTEST: get_num_physpages CONFTEST: xen_ioemu_inject_msi CONFTEST: pde_data CONFTEST: proc_create_data CONFTEST: pm_vt_switch_required CONFTEST: proc_remove CONFTEST: write_cr4 CONFTEST: of_get_property CONFTEST: efi_enabled CONFTEST: of_find_node_by_phandle CONFTEST: phys_to_dma CONFTEST: get_dma_ops CONFTEST: of_node_to_nid CONFTEST: sg_alloc_table CONFTEST: request_threaded_irq CONFTEST: for_each_online_node CONFTEST: pnv_pci_get_npu_dev CONFTEST: node_end_pfn CONFTEST: pci_stop_and_remove_bus_device CONFTEST: pci_bus_address CONFTEST: register_cpu_notifier CONFTEST: pci_remove_bus_device CONFTEST: cpuhp_setup_state CONFTEST: timer_setup CONFTEST: dma_map_resource CONFTEST: do_gettimeofday CONFTEST: kmem_cache_create_usercopy CONFTEST: jiffies_to_timespec CONFTEST: backlight_device_register CONFTEST: ktime_get_raw_ts64 CONFTEST: ktime_get_real_ts64 CONFTEST: remap_page_range CONFTEST: ioremap_nocache CONFTEST: vga_tryget CONFTEST: kbasename CONFTEST: vmf_insert_pfn CONFTEST: list_cut_position CONFTEST: register_acpi_notifier CONFTEST: dma_direct_map_resource CONFTEST: bitmap_clear CONFTEST: usleep_range CONFTEST: fatal_signal_pending CONFTEST: vzalloc CONFTEST: drm_dev_unref CONFTEST: wait_on_bit_lock_argument_count CONFTEST: address_space_init_once CONFTEST: drm_driver_has_gem_prime_res_obj CONFTEST: radix_tree_empty CONFTEST: drm_framebuffer_get CONFTEST: drm_reinit_primary_mode_group CONFTEST: drm_atomic_state_ref_counting CONFTEST: radix_tree_replace_slot CONFTEST: drm_connector_for_each_possible_encoder CONFTEST: drm_atomic_helper_connector_dpms CONFTEST: drm_connector_funcs_have_mode_in_name CONFTEST: is_export_symbol_gpl_of_node_to_nid CONFTEST: is_export_symbol_present_swiotlb_map_sg_attrs CONFTEST: is_export_symbol_present_swiotlb_dma_ops CONFTEST: get_user_pages CONFTEST: drm_gem_object_get CONFTEST: drm_dev_put CONFTEST: outer_flush_all CONFTEST: drm_gem_object_lookup CONFTEST: i2c_adapter CONFTEST: drm_gem_object_put_unlocked CONFTEST: irq_handler_t CONFTEST: acpi_op_remove CONFTEST: proc_dir_entry CONFTEST: acpi_device_ops CONFTEST: pm_message_t CONFTEST: atomic_long_type CONFTEST: scatterlist CONFTEST: sg_table CONFTEST: get_user_pages_remote CONFTEST: file_inode CONFTEST: task_struct CONFTEST: kuid_t CONFTEST: pci_save_state CONFTEST: dma_ops CONFTEST: vm_fault_has_address CONFTEST: dma_map_ops CONFTEST: vm_fault_present CONFTEST: kernel_write CONFTEST: noncoherent_swiotlb_dma_ops CONFTEST: swiotlb_dma_ops CONFTEST: strnstr CONFTEST: kstrtoull CONFTEST: file_operations CONFTEST: vm_operations_struct CONFTEST: timeval CONFTEST: mm_has_mmap_lock CONFTEST: vmalloc_has_pgprot_t_arg CONFTEST: proc_ops CONFTEST: sysfs_slab_unlink CONFTEST: iterate_dir CONFTEST: atomic64_type CONFTEST: kmem_cache_has_kobj_remove_work CONFTEST: backlight_properties_type CONFTEST: pci_dev_has_skip_bus_pm CONFTEST: address_space CONFTEST: pci_channel_state CONFTEST: fault_flags CONFTEST: pnv_npu2_init_context CONFTEST: drm_bus_present CONFTEST: backing_dev_info CONFTEST: mm_context_t CONFTEST: drm_bus_has_bus_type CONFTEST: drm_bus_has_get_irq CONFTEST: drm_bus_has_get_name CONFTEST: drm_driver_has_set_busid CONFTEST: vm_fault_t CONFTEST: drm_mode_connector_list_update_has_merge_type_bits_arg CONFTEST: drm_driver_unload_has_int_return_type CONFTEST: drm_master_drop_has_from_release_arg CONFTEST: vm_ops_fault_removed_vma_arg CONFTEST: kref_has_refcount_of_type_refcount_t CONFTEST: drm_driver_has_legacy_dev_list CONFTEST: drm_mode_object_find_has_file_priv_arg CONFTEST: drm_driver_prime_flag_present CONFTEST: drm_gem_prime_export_has_dev_arg CONFTEST: drm_crtc_state_has_connectors_changed CONFTEST: drm_helper_mode_fill_fb_struct CONFTEST: drm_crtc_helper_funcs_has_atomic_enable CONFTEST: drm_atomic_helper_crtc_destroy_state_has_crtc_arg CONFTEST: dom0_kernel_present CONFTEST: nvidia_vgpu_kvm_build CONFTEST: drm_driver_master_set_has_int_return_type CONFTEST: drm_driver_has_gem_free_object CONFTEST: nvidia_grid_build CONFTEST: is_export_symbol_gpl_refcount_inc CONFTEST: is_export_symbol_gpl_refcount_dec_and_test CONFTEST: drm_display_mode_has_vrefresh CONFTEST: drm_connector_list_iter CONFTEST: drm_gem_object_has_resv CONFTEST: drm_prime_pages_to_sg_has_drm_device_arg CONFTEST: drm_available CONFTEST: drm_atomic_helper_swap_state_has_stall_arg CONFTEST: drm_init_function_args CONFTEST: drm_atomic_available x86_64-pld-linux-gcc -Wp,-MMD,/tmp/B.scl2CX/BUILD/NVIDIA-Linux-x86_64-390.141-no-compat32/kernel/nvidia/.nv-instance.o.d -nostdinc -isystem /usr/lib64/gcc/x86_64-pld-linux/10.2.0/include -I./arch/x86/include -I./arch/x86/include/generated -I./include -I./arch/x86/include/uapi -I./arch/x86/include/generated/uapi -I./include/uapi -I./include/generated/uapi -include ./include/linux/kconfig.h -include ./include/linux/compiler_types.h -D__KERNEL__ -fmacro-prefix-map=./= -Wall -Wundef -Werror=strict-prototypes -Wno-trigraphs -fno-strict-aliasing -fno-common -fshort-wchar -fno-PIE -Werror=implicit-function-declaration -Werror=implicit-int -Werror=return-type -Wno-format-security -std=gnu89 -mno-sse -mno-mmx -mno-sse2 -mno-3dnow -mno-avx -fcf-protection=none -m64 -falign-jumps=1 -falign-loops=1 -mno-80387 -mno-fp-ret-in-387 -mpreferred-stack-boundary=3 -mskip-rax-setup -mtune=generic -mno-red-zone -mcmodel=kernel -DCONFIG_X86_X32_ABI -Wno-sign-compare -fno-asynchronous-unwind-tables -mindirect-branch=thunk-extern -mindirect-branch-register -fno-jump-tables -fno-delete-null-pointer-checks -Wno-frame-address -Wno-format-truncation -Wno-format-overflow -Wno-address-of-packed-member -O2 -fno-allow-store-data-races -Wframe-larger-than=2048 -fstack-protector-strong -Wno-unused-but-set-variable -Wimplicit-fallthrough -Wno-unused-const-variable -gsplit-dwarf -gdwarf-4 -gz=zlib -pg -mrecord-mcount -mfentry -DCC_USING_FENTRY -Wdeclaration-after-statement -Wvla -Wno-pointer-sign -Wno-stringop-truncation -Wno-zero-length-bounds -Wno-array-bounds -Wno-stringop-overflow -Wno-restrict -Wno-maybe-uninitialized -fno-strict-overflow -fno-stack-check -fconserve-stack -Werror=date-time -Werror=incompatible-pointer-types -Werror=designated-init -Wno-packed-not-aligned -fplugin=./scripts/gcc-plugins/structleak_plugin.so -fplugin=./scripts/gcc-plugins/randomize_layout_plugin.so -fplugin=./scripts/gcc-plugins/stackleak_plugin.so -fplugin-arg-structleak_plugin-byref-all -DSTRUCTLEAK_PLUGIN -DRANDSTRUCT_PLUGIN -fplugin-arg-randomize_layout_plugin-performance-mode -DSTACKLEAK_PLUGIN -fplugin-arg-stackleak_plugin-track-min-size=100 -fplugin-arg-stackleak_plugin-arch=x86 -I/tmp/B.scl2CX/BUILD/NVIDIA-Linux-x86_64-390.141-no-compat32/kernel/common/inc -I/tmp/B.scl2CX/BUILD/NVIDIA-Linux-x86_64-390.141-no-compat32/kernel -Wall -MD -Wsign-compare -Wno-cast-qual -Wno-error -D__KERNEL__ -DMODULE -DNVRM -DNV_VERSION_STRING=\"390.141\" -Wno-unused-function -Wuninitialized -fno-strict-aliasing -mno-red-zone -mcmodel=kernel -DNV_UVM_ENABLE -Wno-sign-compare -Wno-format-extra-args -Werror=undef -DNV_SPECTRE_V2=0 -I/tmp/B.scl2CX/BUILD/NVIDIA-Linux-x86_64-390.141-no-compat32/kernel/nvidia -DNV_BUILD_MODULE_INSTANCES=0 -DNVIDIA_UNDEF_LEGACY_BIT_MACROS -UDEBUG -U_DEBUG -DNDEBUG -DMODULE -DKBUILD_BASENAME='"nv_instance"' -DKBUILD_MODNAME='"nvidia"' -c -o /tmp/B.scl2CX/BUILD/NVIDIA-Linux-x86_64-390.141-no-compat32/kernel/nvidia/nv-instance.o /tmp/B.scl2CX/BUILD/NVIDIA-Linux-x86_64-390.141-no-compat32/kernel/nvidia/nv-instance.c In file included from /tmp/B.scl2CX/BUILD/NVIDIA-Linux-x86_64-390.141-no-compat32/kernel/nvidia/nv-instance.c:13: /tmp/B.scl2CX/BUILD/NVIDIA-Linux-x86_64-390.141-no-compat32/kernel/common/inc/nv-linux.h:118:10: fatal error: asm/kmap_types.h: No such file or directory 118 | #include <asm/kmap_types.h> /* page table entry lookup */ | ^~~~~~~~~~~~~~~~~~ compilation terminated. make[2]: *** [scripts/Makefile.build:279: /tmp/B.scl2CX/BUILD/NVIDIA-Linux-x86_64-390.141-no-compat32/kernel/nvidia/nv-instance.o] Error 1 make[2]: *** Waiting for unfinished jobs.... x86_64-pld-linux-gcc -Wp,-MMD,/tmp/B.scl2CX/BUILD/NVIDIA-Linux-x86_64-390.141-no-compat32/kernel/nvidia/.nv-acpi.o.d -nostdinc -isystem /usr/lib64/gcc/x86_64-pld-linux/10.2.0/include -I./arch/x86/include -I./arch/x86/include/generated -I./include -I./arch/x86/include/uapi -I./arch/x86/include/generated/uapi -I./include/uapi -I./include/generated/uapi -include ./include/linux/kconfig.h -include ./include/linux/compiler_types.h -D__KERNEL__ -fmacro-prefix-map=./= -Wall -Wundef -Werror=strict-prototypes -Wno-trigraphs -fno-strict-aliasing -fno-common -fshort-wchar -fno-PIE -Werror=implicit-function-declaration -Werror=implicit-int -Werror=return-type -Wno-format-security -std=gnu89 -mno-sse -mno-mmx -mno-sse2 -mno-3dnow -mno-avx -fcf-protection=none -m64 -falign-jumps=1 -falign-loops=1 -mno-80387 -mno-fp-ret-in-387 -mpreferred-stack-boundary=3 -mskip-rax-setup -mtune=generic -mno-red-zone -mcmodel=kernel -DCONFIG_X86_X32_ABI -Wno-sign-compare -fno-asynchronous-unwind-tables -mindirect-branch=thunk-extern -mindirect-branch-register -fno-jump-tables -fno-delete-null-pointer-checks -Wno-frame-address -Wno-format-truncation -Wno-format-overflow -Wno-address-of-packed-member -O2 -fno-allow-store-data-races -Wframe-larger-than=2048 -fstack-protector-strong -Wno-unused-but-set-variable -Wimplicit-fallthrough -Wno-unused-const-variable -gsplit-dwarf -gdwarf-4 -gz=zlib -pg -mrecord-mcount -mfentry -DCC_USING_FENTRY -Wdeclaration-after-statement -Wvla -Wno-pointer-sign -Wno-stringop-truncation -Wno-zero-length-bounds -Wno-array-bounds -Wno-stringop-overflow -Wno-restrict -Wno-maybe-uninitialized -fno-strict-overflow -fno-stack-check -fconserve-stack -Werror=date-time -Werror=incompatible-pointer-types -Werror=designated-init -Wno-packed-not-aligned -fplugin=./scripts/gcc-plugins/structleak_plugin.so -fplugin=./scripts/gcc-plugins/randomize_layout_plugin.so -fplugin=./scripts/gcc-plugins/stackleak_plugin.so -fplugin-arg-structleak_plugin-byref-all -DSTRUCTLEAK_PLUGIN -DRANDSTRUCT_PLUGIN -fplugin-arg-randomize_layout_plugin-performance-mode -DSTACKLEAK_PLUGIN -fplugin-arg-stackleak_plugin-track-min-size=100 -fplugin-arg-stackleak_plugin-arch=x86 -I/tmp/B.scl2CX/BUILD/NVIDIA-Linux-x86_64-390.141-no-compat32/kernel/common/inc -I/tmp/B.scl2CX/BUILD/NVIDIA-Linux-x86_64-390.141-no-compat32/kernel -Wall -MD -Wsign-compare -Wno-cast-qual -Wno-error -D__KERNEL__ -DMODULE -DNVRM -DNV_VERSION_STRING=\"390.141\" -Wno-unused-function -Wuninitialized -fno-strict-aliasing -mno-red-zone -mcmodel=kernel -DNV_UVM_ENABLE -Wno-sign-compare -Wno-format-extra-args -Werror=undef -DNV_SPECTRE_V2=0 -I/tmp/B.scl2CX/BUILD/NVIDIA-Linux-x86_64-390.141-no-compat32/kernel/nvidia -DNV_BUILD_MODULE_INSTANCES=0 -DNVIDIA_UNDEF_LEGACY_BIT_MACROS -UDEBUG -U_DEBUG -DNDEBUG -DMODULE -DKBUILD_BASENAME='"nv_acpi"' -DKBUILD_MODNAME='"nvidia"' -c -o /tmp/B.scl2CX/BUILD/NVIDIA-Linux-x86_64-390.141-no-compat32/kernel/nvidia/nv-acpi.o /tmp/B.scl2CX/BUILD/NVIDIA-Linux-x86_64-390.141-no-compat32/kernel/nvidia/nv-acpi.c In file included from /tmp/B.scl2CX/BUILD/NVIDIA-Linux-x86_64-390.141-no-compat32/kernel/nvidia/nv-acpi.c:15: /tmp/B.scl2CX/BUILD/NVIDIA-Linux-x86_64-390.141-no-compat32/kernel/common/inc/nv-linux.h:118:10: fatal error: asm/kmap_types.h: No such file or directory 118 | #include <asm/kmap_types.h> /* page table entry lookup */ | ^~~~~~~~~~~~~~~~~~ compilation terminated. make[2]: *** [scripts/Makefile.build:279: /tmp/B.scl2CX/BUILD/NVIDIA-Linux-x86_64-390.141-no-compat32/kernel/nvidia/nv-acpi.o] Error 1 x86_64-pld-linux-gcc -Wp,-MMD,/tmp/B.scl2CX/BUILD/NVIDIA-Linux-x86_64-390.141-no-compat32/kernel/nvidia/.nv-gpu-numa.o.d -nostdinc -isystem /usr/lib64/gcc/x86_64-pld-linux/10.2.0/include -I./arch/x86/include -I./arch/x86/include/generated -I./include -I./arch/x86/include/uapi -I./arch/x86/include/generated/uapi -I./include/uapi -I./include/generated/uapi -include ./include/linux/kconfig.h -include ./include/linux/compiler_types.h -D__KERNEL__ -fmacro-prefix-map=./= -Wall -Wundef -Werror=strict-prototypes -Wno-trigraphs -fno-strict-aliasing -fno-common -fshort-wchar -fno-PIE -Werror=implicit-function-declaration -Werror=implicit-int -Werror=return-type -Wno-format-security -std=gnu89 -mno-sse -mno-mmx -mno-sse2 -mno-3dnow -mno-avx -fcf-protection=none -m64 -falign-jumps=1 -falign-loops=1 -mno-80387 -mno-fp-ret-in-387 -mpreferred-stack-boundary=3 -mskip-rax-setup -mtune=generic -mno-red-zone -mcmodel=kernel -DCONFIG_X86_X32_ABI -Wno-sign-compare -fno-asynchronous-unwind-tables -mindirect-branch=thunk-extern -mindirect-branch-register -fno-jump-tables -fno-delete-null-pointer-checks -Wno-frame-address -Wno-format-truncation -Wno-format-overflow -Wno-address-of-packed-member -O2 -fno-allow-store-data-races -Wframe-larger-than=2048 -fstack-protector-strong -Wno-unused-but-set-variable -Wimplicit-fallthrough -Wno-unused-const-variable -gsplit-dwarf -gdwarf-4 -gz=zlib -pg -mrecord-mcount -mfentry -DCC_USING_FENTRY -Wdeclaration-after-statement -Wvla -Wno-pointer-sign -Wno-stringop-truncation -Wno-zero-length-bounds -Wno-array-bounds -Wno-stringop-overflow -Wno-restrict -Wno-maybe-uninitialized -fno-strict-overflow -fno-stack-check -fconserve-stack -Werror=date-time -Werror=incompatible-pointer-types -Werror=designated-init -Wno-packed-not-aligned -fplugin=./scripts/gcc-plugins/structleak_plugin.so -fplugin=./scripts/gcc-plugins/randomize_layout_plugin.so -fplugin=./scripts/gcc-plugins/stackleak_plugin.so -fplugin-arg-structleak_plugin-byref-all -DSTRUCTLEAK_PLUGIN -DRANDSTRUCT_PLUGIN -fplugin-arg-randomize_layout_plugin-performance-mode -DSTACKLEAK_PLUGIN -fplugin-arg-stackleak_plugin-track-min-size=100 -fplugin-arg-stackleak_plugin-arch=x86 -I/tmp/B.scl2CX/BUILD/NVIDIA-Linux-x86_64-390.141-no-compat32/kernel/common/inc -I/tmp/B.scl2CX/BUILD/NVIDIA-Linux-x86_64-390.141-no-compat32/kernel -Wall -MD -Wsign-compare -Wno-cast-qual -Wno-error -D__KERNEL__ -DMODULE -DNVRM -DNV_VERSION_STRING=\"390.141\" -Wno-unused-function -Wuninitialized -fno-strict-aliasing -mno-red-zone -mcmodel=kernel -DNV_UVM_ENABLE -Wno-sign-compare -Wno-format-extra-args -Werror=undef -DNV_SPECTRE_V2=0 -I/tmp/B.scl2CX/BUILD/NVIDIA-Linux-x86_64-390.141-no-compat32/kernel/nvidia -DNV_BUILD_MODULE_INSTANCES=0 -DNVIDIA_UNDEF_LEGACY_BIT_MACROS -UDEBUG -U_DEBUG -DNDEBUG -DMODULE -DKBUILD_BASENAME='"nv_gpu_numa"' -DKBUILD_MODNAME='"nvidia"' -c -o /tmp/B.scl2CX/BUILD/NVIDIA-Linux-x86_64-390.141-no-compat32/kernel/nvidia/nv-gpu-numa.o /tmp/B.scl2CX/BUILD/NVIDIA-Linux-x86_64-390.141-no-compat32/kernel/nvidia/nv-gpu-numa.c In file included from /tmp/B.scl2CX/BUILD/NVIDIA-Linux-x86_64-390.141-no-compat32/kernel/nvidia/nv-gpu-numa.c:24: /tmp/B.scl2CX/BUILD/NVIDIA-Linux-x86_64-390.141-no-compat32/kernel/common/inc/nv-linux.h:118:10: fatal error: asm/kmap_types.h: No such file or directory 118 | #include <asm/kmap_types.h> /* page table entry lookup */ | ^~~~~~~~~~~~~~~~~~ compilation terminated. make[2]: *** [scripts/Makefile.build:279: /tmp/B.scl2CX/BUILD/NVIDIA-Linux-x86_64-390.141-no-compat32/kernel/nvidia/nv-gpu-numa.o] Error 1 x86_64-pld-linux-gcc -Wp,-MMD,/tmp/B.scl2CX/BUILD/NVIDIA-Linux-x86_64-390.141-no-compat32/kernel/nvidia/.nv-chrdev.o.d -nostdinc -isystem /usr/lib64/gcc/x86_64-pld-linux/10.2.0/include -I./arch/x86/include -I./arch/x86/include/generated -I./include -I./arch/x86/include/uapi -I./arch/x86/include/generated/uapi -I./include/uapi -I./include/generated/uapi -include ./include/linux/kconfig.h -include ./include/linux/compiler_types.h -D__KERNEL__ -fmacro-prefix-map=./= -Wall -Wundef -Werror=strict-prototypes -Wno-trigraphs -fno-strict-aliasing -fno-common -fshort-wchar -fno-PIE -Werror=implicit-function-declaration -Werror=implicit-int -Werror=return-type -Wno-format-security -std=gnu89 -mno-sse -mno-mmx -mno-sse2 -mno-3dnow -mno-avx -fcf-protection=none -m64 -falign-jumps=1 -falign-loops=1 -mno-80387 -mno-fp-ret-in-387 -mpreferred-stack-boundary=3 -mskip-rax-setup -mtune=generic -mno-red-zone -mcmodel=kernel -DCONFIG_X86_X32_ABI -Wno-sign-compare -fno-asynchronous-unwind-tables -mindirect-branch=thunk-extern -mindirect-branch-register -fno-jump-tables -fno-delete-null-pointer-checks -Wno-frame-address -Wno-format-truncation -Wno-format-overflow -Wno-address-of-packed-member -O2 -fno-allow-store-data-races -Wframe-larger-than=2048 -fstack-protector-strong -Wno-unused-but-set-variable -Wimplicit-fallthrough -Wno-unused-const-variable -gsplit-dwarf -gdwarf-4 -gz=zlib -pg -mrecord-mcount -mfentry -DCC_USING_FENTRY -Wdeclaration-after-statement -Wvla -Wno-pointer-sign -Wno-stringop-truncation -Wno-zero-length-bounds -Wno-array-bounds -Wno-stringop-overflow -Wno-restrict -Wno-maybe-uninitialized -fno-strict-overflow -fno-stack-check -fconserve-stack -Werror=date-time -Werror=incompatible-pointer-types -Werror=designated-init -Wno-packed-not-aligned -fplugin=./scripts/gcc-plugins/structleak_plugin.so -fplugin=./scripts/gcc-plugins/randomize_layout_plugin.so -fplugin=./scripts/gcc-plugins/stackleak_plugin.so -fplugin-arg-structleak_plugin-byref-all -DSTRUCTLEAK_PLUGIN -DRANDSTRUCT_PLUGIN -fplugin-arg-randomize_layout_plugin-performance-mode -DSTACKLEAK_PLUGIN -fplugin-arg-stackleak_plugin-track-min-size=100 -fplugin-arg-stackleak_plugin-arch=x86 -I/tmp/B.scl2CX/BUILD/NVIDIA-Linux-x86_64-390.141-no-compat32/kernel/common/inc -I/tmp/B.scl2CX/BUILD/NVIDIA-Linux-x86_64-390.141-no-compat32/kernel -Wall -MD -Wsign-compare -Wno-cast-qual -Wno-error -D__KERNEL__ -DMODULE -DNVRM -DNV_VERSION_STRING=\"390.141\" -Wno-unused-function -Wuninitialized -fno-strict-aliasing -mno-red-zone -mcmodel=kernel -DNV_UVM_ENABLE -Wno-sign-compare -Wno-format-extra-args -Werror=undef -DNV_SPECTRE_V2=0 -I/tmp/B.scl2CX/BUILD/NVIDIA-Linux-x86_64-390.141-no-compat32/kernel/nvidia -DNV_BUILD_MODULE_INSTANCES=0 -DNVIDIA_UNDEF_LEGACY_BIT_MACROS -UDEBUG -U_DEBUG -DNDEBUG -DMODULE -DKBUILD_BASENAME='"nv_chrdev"' -DKBUILD_MODNAME='"nvidia"' -c -o /tmp/B.scl2CX/BUILD/NVIDIA-Linux-x86_64-390.141-no-compat32/kernel/nvidia/nv-chrdev.o /tmp/B.scl2CX/BUILD/NVIDIA-Linux-x86_64-390.141-no-compat32/kernel/nvidia/nv-chrdev.c In file included from /tmp/B.scl2CX/BUILD/NVIDIA-Linux-x86_64-390.141-no-compat32/kernel/nvidia/nv-chrdev.c:15: /tmp/B.scl2CX/BUILD/NVIDIA-Linux-x86_64-390.141-no-compat32/kernel/common/inc/nv-linux.h:118:10: fatal error: asm/kmap_types.h: No such file or directory 118 | #include <asm/kmap_types.h> /* page table entry lookup */ | ^~~~~~~~~~~~~~~~~~ compilation terminated. make[2]: *** [scripts/Makefile.build:279: /tmp/B.scl2CX/BUILD/NVIDIA-Linux-x86_64-390.141-no-compat32/kernel/nvidia/nv-chrdev.o] Error 1 x86_64-pld-linux-gcc -Wp,-MMD,/tmp/B.scl2CX/BUILD/NVIDIA-Linux-x86_64-390.141-no-compat32/kernel/nvidia/.nv-dma.o.d -nostdinc -isystem /usr/lib64/gcc/x86_64-pld-linux/10.2.0/include -I./arch/x86/include -I./arch/x86/include/generated -I./include -I./arch/x86/include/uapi -I./arch/x86/include/generated/uapi -I./include/uapi -I./include/generated/uapi -include ./include/linux/kconfig.h -include ./include/linux/compiler_types.h -D__KERNEL__ -fmacro-prefix-map=./= -Wall -Wundef -Werror=strict-prototypes -Wno-trigraphs -fno-strict-aliasing -fno-common -fshort-wchar -fno-PIE -Werror=implicit-function-declaration -Werror=implicit-int -Werror=return-type -Wno-format-security -std=gnu89 -mno-sse -mno-mmx -mno-sse2 -mno-3dnow -mno-avx -fcf-protection=none -m64 -falign-jumps=1 -falign-loops=1 -mno-80387 -mno-fp-ret-in-387 -mpreferred-stack-boundary=3 -mskip-rax-setup -mtune=generic -mno-red-zone -mcmodel=kernel -DCONFIG_X86_X32_ABI -Wno-sign-compare -fno-asynchronous-unwind-tables -mindirect-branch=thunk-extern -mindirect-branch-register -fno-jump-tables -fno-delete-null-pointer-checks -Wno-frame-address -Wno-format-truncation -Wno-format-overflow -Wno-address-of-packed-member -O2 -fno-allow-store-data-races -Wframe-larger-than=2048 -fstack-protector-strong -Wno-unused-but-set-variable -Wimplicit-fallthrough -Wno-unused-const-variable -gsplit-dwarf -gdwarf-4 -gz=zlib -pg -mrecord-mcount -mfentry -DCC_USING_FENTRY -Wdeclaration-after-statement -Wvla -Wno-pointer-sign -Wno-stringop-truncation -Wno-zero-length-bounds -Wno-array-bounds -Wno-stringop-overflow -Wno-restrict -Wno-maybe-uninitialized -fno-strict-overflow -fno-stack-check -fconserve-stack -Werror=date-time -Werror=incompatible-pointer-types -Werror=designated-init -Wno-packed-not-aligned -fplugin=./scripts/gcc-plugins/structleak_plugin.so -fplugin=./scripts/gcc-plugins/randomize_layout_plugin.so -fplugin=./scripts/gcc-plugins/stackleak_plugin.so -fplugin-arg-structleak_plugin-byref-all -DSTRUCTLEAK_PLUGIN -DRANDSTRUCT_PLUGIN -fplugin-arg-randomize_layout_plugin-performance-mode -DSTACKLEAK_PLUGIN -fplugin-arg-stackleak_plugin-track-min-size=100 -fplugin-arg-stackleak_plugin-arch=x86 -I/tmp/B.scl2CX/BUILD/NVIDIA-Linux-x86_64-390.141-no-compat32/kernel/common/inc -I/tmp/B.scl2CX/BUILD/NVIDIA-Linux-x86_64-390.141-no-compat32/kernel -Wall -MD -Wsign-compare -Wno-cast-qual -Wno-error -D__KERNEL__ -DMODULE -DNVRM -DNV_VERSION_STRING=\"390.141\" -Wno-unused-function -Wuninitialized -fno-strict-aliasing -mno-red-zone -mcmodel=kernel -DNV_UVM_ENABLE -Wno-sign-compare -Wno-format-extra-args -Werror=undef -DNV_SPECTRE_V2=0 -I/tmp/B.scl2CX/BUILD/NVIDIA-Linux-x86_64-390.141-no-compat32/kernel/nvidia -DNV_BUILD_MODULE_INSTANCES=0 -DNVIDIA_UNDEF_LEGACY_BIT_MACROS -UDEBUG -U_DEBUG -DNDEBUG -DMODULE -DKBUILD_BASENAME='"nv_dma"' -DKBUILD_MODNAME='"nvidia"' -c -o /tmp/B.scl2CX/BUILD/NVIDIA-Linux-x86_64-390.141-no-compat32/kernel/nvidia/nv-dma.o /tmp/B.scl2CX/BUILD/NVIDIA-Linux-x86_64-390.141-no-compat32/kernel/nvidia/nv-dma.c In file included from /tmp/B.scl2CX/BUILD/NVIDIA-Linux-x86_64-390.141-no-compat32/kernel/nvidia/nv-dma.c:15: /tmp/B.scl2CX/BUILD/NVIDIA-Linux-x86_64-390.141-no-compat32/kernel/common/inc/nv-linux.h:118:10: fatal error: asm/kmap_types.h: No such file or directory 118 | #include <asm/kmap_types.h> /* page table entry lookup */ | ^~~~~~~~~~~~~~~~~~ compilation terminated. make[2]: *** [scripts/Makefile.build:279: /tmp/B.scl2CX/BUILD/NVIDIA-Linux-x86_64-390.141-no-compat32/kernel/nvidia/nv-dma.o] Error 1 x86_64-pld-linux-gcc -Wp,-MMD,/tmp/B.scl2CX/BUILD/NVIDIA-Linux-x86_64-390.141-no-compat32/kernel/nvidia/.nv-cray.o.d -nostdinc -isystem /usr/lib64/gcc/x86_64-pld-linux/10.2.0/include -I./arch/x86/include -I./arch/x86/include/generated -I./include -I./arch/x86/include/uapi -I./arch/x86/include/generated/uapi -I./include/uapi -I./include/generated/uapi -include ./include/linux/kconfig.h -include ./include/linux/compiler_types.h -D__KERNEL__ -fmacro-prefix-map=./= -Wall -Wundef -Werror=strict-prototypes -Wno-trigraphs -fno-strict-aliasing -fno-common -fshort-wchar -fno-PIE -Werror=implicit-function-declaration -Werror=implicit-int -Werror=return-type -Wno-format-security -std=gnu89 -mno-sse -mno-mmx -mno-sse2 -mno-3dnow -mno-avx -fcf-protection=none -m64 -falign-jumps=1 -falign-loops=1 -mno-80387 -mno-fp-ret-in-387 -mpreferred-stack-boundary=3 -mskip-rax-setup -mtune=generic -mno-red-zone -mcmodel=kernel -DCONFIG_X86_X32_ABI -Wno-sign-compare -fno-asynchronous-unwind-tables -mindirect-branch=thunk-extern -mindirect-branch-register -fno-jump-tables -fno-delete-null-pointer-checks -Wno-frame-address -Wno-format-truncation -Wno-format-overflow -Wno-address-of-packed-member -O2 -fno-allow-store-data-races -Wframe-larger-than=2048 -fstack-protector-strong -Wno-unused-but-set-variable -Wimplicit-fallthrough -Wno-unused-const-variable -gsplit-dwarf -gdwarf-4 -gz=zlib -pg -mrecord-mcount -mfentry -DCC_USING_FENTRY -Wdeclaration-after-statement -Wvla -Wno-pointer-sign -Wno-stringop-truncation -Wno-zero-length-bounds -Wno-array-bounds -Wno-stringop-overflow -Wno-restrict -Wno-maybe-uninitialized -fno-strict-overflow -fno-stack-check -fconserve-stack -Werror=date-time -Werror=incompatible-pointer-types -Werror=designated-init -Wno-packed-not-aligned -fplugin=./scripts/gcc-plugins/structleak_plugin.so -fplugin=./scripts/gcc-plugins/randomize_layout_plugin.so -fplugin=./scripts/gcc-plugins/stackleak_plugin.so -fplugin-arg-structleak_plugin-byref-all -DSTRUCTLEAK_PLUGIN -DRANDSTRUCT_PLUGIN -fplugin-arg-randomize_layout_plugin-performance-mode -DSTACKLEAK_PLUGIN -fplugin-arg-stackleak_plugin-track-min-size=100 -fplugin-arg-stackleak_plugin-arch=x86 -I/tmp/B.scl2CX/BUILD/NVIDIA-Linux-x86_64-390.141-no-compat32/kernel/common/inc -I/tmp/B.scl2CX/BUILD/NVIDIA-Linux-x86_64-390.141-no-compat32/kernel -Wall -MD -Wsign-compare -Wno-cast-qual -Wno-error -D__KERNEL__ -DMODULE -DNVRM -DNV_VERSION_STRING=\"390.141\" -Wno-unused-function -Wuninitialized -fno-strict-aliasing -mno-red-zone -mcmodel=kernel -DNV_UVM_ENABLE -Wno-sign-compare -Wno-format-extra-args -Werror=undef -DNV_SPECTRE_V2=0 -I/tmp/B.scl2CX/BUILD/NVIDIA-Linux-x86_64-390.141-no-compat32/kernel/nvidia -DNV_BUILD_MODULE_INSTANCES=0 -DNVIDIA_UNDEF_LEGACY_BIT_MACROS -UDEBUG -U_DEBUG -DNDEBUG -DMODULE -DKBUILD_BASENAME='"nv_cray"' -DKBUILD_MODNAME='"nvidia"' -c -o /tmp/B.scl2CX/BUILD/NVIDIA-Linux-x86_64-390.141-no-compat32/kernel/nvidia/nv-cray.o /tmp/B.scl2CX/BUILD/NVIDIA-Linux-x86_64-390.141-no-compat32/kernel/nvidia/nv-cray.c In file included from /tmp/B.scl2CX/BUILD/NVIDIA-Linux-x86_64-390.141-no-compat32/kernel/nvidia/nv-cray.c:15: /tmp/B.scl2CX/BUILD/NVIDIA-Linux-x86_64-390.141-no-compat32/kernel/common/inc/nv-linux.h:118:10: fatal error: asm/kmap_types.h: No such file or directory 118 | #include <asm/kmap_types.h> /* page table entry lookup */ | ^~~~~~~~~~~~~~~~~~ compilation terminated. make[2]: *** [scripts/Makefile.build:279: /tmp/B.scl2CX/BUILD/NVIDIA-Linux-x86_64-390.141-no-compat32/kernel/nvidia/nv-cray.o] Error 1 x86_64-pld-linux-gcc -Wp,-MMD,/tmp/B.scl2CX/BUILD/NVIDIA-Linux-x86_64-390.141-no-compat32/kernel/nvidia/.nv-frontend.o.d -nostdinc -isystem /usr/lib64/gcc/x86_64-pld-linux/10.2.0/include -I./arch/x86/include -I./arch/x86/include/generated -I./include -I./arch/x86/include/uapi -I./arch/x86/include/generated/uapi -I./include/uapi -I./include/generated/uapi -include ./include/linux/kconfig.h -include ./include/linux/compiler_types.h -D__KERNEL__ -fmacro-prefix-map=./= -Wall -Wundef -Werror=strict-prototypes -Wno-trigraphs -fno-strict-aliasing -fno-common -fshort-wchar -fno-PIE -Werror=implicit-function-declaration -Werror=implicit-int -Werror=return-type -Wno-format-security -std=gnu89 -mno-sse -mno-mmx -mno-sse2 -mno-3dnow -mno-avx -fcf-protection=none -m64 -falign-jumps=1 -falign-loops=1 -mno-80387 -mno-fp-ret-in-387 -mpreferred-stack-boundary=3 -mskip-rax-setup -mtune=generic -mno-red-zone -mcmodel=kernel -DCONFIG_X86_X32_ABI -Wno-sign-compare -fno-asynchronous-unwind-tables -mindirect-branch=thunk-extern -mindirect-branch-register -fno-jump-tables -fno-delete-null-pointer-checks -Wno-frame-address -Wno-format-truncation -Wno-format-overflow -Wno-address-of-packed-member -O2 -fno-allow-store-data-races -Wframe-larger-than=2048 -fstack-protector-strong -Wno-unused-but-set-variable -Wimplicit-fallthrough -Wno-unused-const-variable -gsplit-dwarf -gdwarf-4 -gz=zlib -pg -mrecord-mcount -mfentry -DCC_USING_FENTRY -Wdeclaration-after-statement -Wvla -Wno-pointer-sign -Wno-stringop-truncation -Wno-zero-length-bounds -Wno-array-bounds -Wno-stringop-overflow -Wno-restrict -Wno-maybe-uninitialized -fno-strict-overflow -fno-stack-check -fconserve-stack -Werror=date-time -Werror=incompatible-pointer-types -Werror=designated-init -Wno-packed-not-aligned -fplugin=./scripts/gcc-plugins/structleak_plugin.so -fplugin=./scripts/gcc-plugins/randomize_layout_plugin.so -fplugin=./scripts/gcc-plugins/stackleak_plugin.so -fplugin-arg-structleak_plugin-byref-all -DSTRUCTLEAK_PLUGIN -DRANDSTRUCT_PLUGIN -fplugin-arg-randomize_layout_plugin-performance-mode -DSTACKLEAK_PLUGIN -fplugin-arg-stackleak_plugin-track-min-size=100 -fplugin-arg-stackleak_plugin-arch=x86 -I/tmp/B.scl2CX/BUILD/NVIDIA-Linux-x86_64-390.141-no-compat32/kernel/common/inc -I/tmp/B.scl2CX/BUILD/NVIDIA-Linux-x86_64-390.141-no-compat32/kernel -Wall -MD -Wsign-compare -Wno-cast-qual -Wno-error -D__KERNEL__ -DMODULE -DNVRM -DNV_VERSION_STRING=\"390.141\" -Wno-unused-function -Wuninitialized -fno-strict-aliasing -mno-red-zone -mcmodel=kernel -DNV_UVM_ENABLE -Wno-sign-compare -Wno-format-extra-args -Werror=undef -DNV_SPECTRE_V2=0 -I/tmp/B.scl2CX/BUILD/NVIDIA-Linux-x86_64-390.141-no-compat32/kernel/nvidia -DNV_BUILD_MODULE_INSTANCES=0 -DNVIDIA_UNDEF_LEGACY_BIT_MACROS -UDEBUG -U_DEBUG -DNDEBUG -DMODULE -DKBUILD_BASENAME='"nv_frontend"' -DKBUILD_MODNAME='"nvidia"' -c -o /tmp/B.scl2CX/BUILD/NVIDIA-Linux-x86_64-390.141-no-compat32/kernel/nvidia/nv-frontend.o /tmp/B.scl2CX/BUILD/NVIDIA-Linux-x86_64-390.141-no-compat32/kernel/nvidia/nv-frontend.c In file included from /tmp/B.scl2CX/BUILD/NVIDIA-Linux-x86_64-390.141-no-compat32/kernel/nvidia/nv-frontend.c:13: /tmp/B.scl2CX/BUILD/NVIDIA-Linux-x86_64-390.141-no-compat32/kernel/common/inc/nv-linux.h:118:10: fatal error: asm/kmap_types.h: No such file or directory 118 | #include <asm/kmap_types.h> /* page table entry lookup */ | ^~~~~~~~~~~~~~~~~~ compilation terminated. make[2]: *** [scripts/Makefile.build:279: /tmp/B.scl2CX/BUILD/NVIDIA-Linux-x86_64-390.141-no-compat32/kernel/nvidia/nv-frontend.o] Error 1 x86_64-pld-linux-gcc -Wp,-MMD,/tmp/B.scl2CX/BUILD/NVIDIA-Linux-x86_64-390.141-no-compat32/kernel/nvidia/.nv.o.d -nostdinc -isystem /usr/lib64/gcc/x86_64-pld-linux/10.2.0/include -I./arch/x86/include -I./arch/x86/include/generated -I./include -I./arch/x86/include/uapi -I./arch/x86/include/generated/uapi -I./include/uapi -I./include/generated/uapi -include ./include/linux/kconfig.h -include ./include/linux/compiler_types.h -D__KERNEL__ -fmacro-prefix-map=./= -Wall -Wundef -Werror=strict-prototypes -Wno-trigraphs -fno-strict-aliasing -fno-common -fshort-wchar -fno-PIE -Werror=implicit-function-declaration -Werror=implicit-int -Werror=return-type -Wno-format-security -std=gnu89 -mno-sse -mno-mmx -mno-sse2 -mno-3dnow -mno-avx -fcf-protection=none -m64 -falign-jumps=1 -falign-loops=1 -mno-80387 -mno-fp-ret-in-387 -mpreferred-stack-boundary=3 -mskip-rax-setup -mtune=generic -mno-red-zone -mcmodel=kernel -DCONFIG_X86_X32_ABI -Wno-sign-compare -fno-asynchronous-unwind-tables -mindirect-branch=thunk-extern -mindirect-branch-register -fno-jump-tables -fno-delete-null-pointer-checks -Wno-frame-address -Wno-format-truncation -Wno-format-overflow -Wno-address-of-packed-member -O2 -fno-allow-store-data-races -Wframe-larger-than=2048 -fstack-protector-strong -Wno-unused-but-set-variable -Wimplicit-fallthrough -Wno-unused-const-variable -gsplit-dwarf -gdwarf-4 -gz=zlib -pg -mrecord-mcount -mfentry -DCC_USING_FENTRY -Wdeclaration-after-statement -Wvla -Wno-pointer-sign -Wno-stringop-truncation -Wno-zero-length-bounds -Wno-array-bounds -Wno-stringop-overflow -Wno-restrict -Wno-maybe-uninitialized -fno-strict-overflow -fno-stack-check -fconserve-stack -Werror=date-time -Werror=incompatible-pointer-types -Werror=designated-init -Wno-packed-not-aligned -fplugin=./scripts/gcc-plugins/structleak_plugin.so -fplugin=./scripts/gcc-plugins/randomize_layout_plugin.so -fplugin=./scripts/gcc-plugins/stackleak_plugin.so -fplugin-arg-structleak_plugin-byref-all -DSTRUCTLEAK_PLUGIN -DRANDSTRUCT_PLUGIN -fplugin-arg-randomize_layout_plugin-performance-mode -DSTACKLEAK_PLUGIN -fplugin-arg-stackleak_plugin-track-min-size=100 -fplugin-arg-stackleak_plugin-arch=x86 -I/tmp/B.scl2CX/BUILD/NVIDIA-Linux-x86_64-390.141-no-compat32/kernel/common/inc -I/tmp/B.scl2CX/BUILD/NVIDIA-Linux-x86_64-390.141-no-compat32/kernel -Wall -MD -Wsign-compare -Wno-cast-qual -Wno-error -D__KERNEL__ -DMODULE -DNVRM -DNV_VERSION_STRING=\"390.141\" -Wno-unused-function -Wuninitialized -fno-strict-aliasing -mno-red-zone -mcmodel=kernel -DNV_UVM_ENABLE -Wno-sign-compare -Wno-format-extra-args -Werror=undef -DNV_SPECTRE_V2=0 -I/tmp/B.scl2CX/BUILD/NVIDIA-Linux-x86_64-390.141-no-compat32/kernel/nvidia -DNV_BUILD_MODULE_INSTANCES=0 -DNVIDIA_UNDEF_LEGACY_BIT_MACROS -UDEBUG -U_DEBUG -DNDEBUG -DMODULE -DKBUILD_BASENAME='"nv"' -DKBUILD_MODNAME='"nvidia"' -c -o /tmp/B.scl2CX/BUILD/NVIDIA-Linux-x86_64-390.141-no-compat32/kernel/nvidia/nv.o /tmp/B.scl2CX/BUILD/NVIDIA-Linux-x86_64-390.141-no-compat32/kernel/nvidia/nv.c In file included from /tmp/B.scl2CX/BUILD/NVIDIA-Linux-x86_64-390.141-no-compat32/kernel/nvidia/nv.c:13: /tmp/B.scl2CX/BUILD/NVIDIA-Linux-x86_64-390.141-no-compat32/kernel/common/inc/nv-linux.h:118:10: fatal error: asm/kmap_types.h: No such file or directory 118 | #include <asm/kmap_types.h> /* page table entry lookup */ | ^~~~~~~~~~~~~~~~~~ compilation terminated. make[2]: *** [scripts/Makefile.build:279: /tmp/B.scl2CX/BUILD/NVIDIA-Linux-x86_64-390.141-no-compat32/kernel/nvidia/nv.o] Error 1 x86_64-pld-linux-gcc -Wp,-MMD,/tmp/B.scl2CX/BUILD/NVIDIA-Linux-x86_64-390.141-no-compat32/kernel/nvidia/.nv-gvi.o.d -nostdinc -isystem /usr/lib64/gcc/x86_64-pld-linux/10.2.0/include -I./arch/x86/include -I./arch/x86/include/generated -I./include -I./arch/x86/include/uapi -I./arch/x86/include/generated/uapi -I./include/uapi -I./include/generated/uapi -include ./include/linux/kconfig.h -include ./include/linux/compiler_types.h -D__KERNEL__ -fmacro-prefix-map=./= -Wall -Wundef -Werror=strict-prototypes -Wno-trigraphs -fno-strict-aliasing -fno-common -fshort-wchar -fno-PIE -Werror=implicit-function-declaration -Werror=implicit-int -Werror=return-type -Wno-format-security -std=gnu89 -mno-sse -mno-mmx -mno-sse2 -mno-3dnow -mno-avx -fcf-protection=none -m64 -falign-jumps=1 -falign-loops=1 -mno-80387 -mno-fp-ret-in-387 -mpreferred-stack-boundary=3 -mskip-rax-setup -mtune=generic -mno-red-zone -mcmodel=kernel -DCONFIG_X86_X32_ABI -Wno-sign-compare -fno-asynchronous-unwind-tables -mindirect-branch=thunk-extern -mindirect-branch-register -fno-jump-tables -fno-delete-null-pointer-checks -Wno-frame-address -Wno-format-truncation -Wno-format-overflow -Wno-address-of-packed-member -O2 -fno-allow-store-data-races -Wframe-larger-than=2048 -fstack-protector-strong -Wno-unused-but-set-variable -Wimplicit-fallthrough -Wno-unused-const-variable -gsplit-dwarf -gdwarf-4 -gz=zlib -pg -mrecord-mcount -mfentry -DCC_USING_FENTRY -Wdeclaration-after-statement -Wvla -Wno-pointer-sign -Wno-stringop-truncation -Wno-zero-length-bounds -Wno-array-bounds -Wno-stringop-overflow -Wno-restrict -Wno-maybe-uninitialized -fno-strict-overflow -fno-stack-check -fconserve-stack -Werror=date-time -Werror=incompatible-pointer-types -Werror=designated-init -Wno-packed-not-aligned -fplugin=./scripts/gcc-plugins/structleak_plugin.so -fplugin=./scripts/gcc-plugins/randomize_layout_plugin.so -fplugin=./scripts/gcc-plugins/stackleak_plugin.so -fplugin-arg-structleak_plugin-byref-all -DSTRUCTLEAK_PLUGIN -DRANDSTRUCT_PLUGIN -fplugin-arg-randomize_layout_plugin-performance-mode -DSTACKLEAK_PLUGIN -fplugin-arg-stackleak_plugin-track-min-size=100 -fplugin-arg-stackleak_plugin-arch=x86 -I/tmp/B.scl2CX/BUILD/NVIDIA-Linux-x86_64-390.141-no-compat32/kernel/common/inc -I/tmp/B.scl2CX/BUILD/NVIDIA-Linux-x86_64-390.141-no-compat32/kernel -Wall -MD -Wsign-compare -Wno-cast-qual -Wno-error -D__KERNEL__ -DMODULE -DNVRM -DNV_VERSION_STRING=\"390.141\" -Wno-unused-function -Wuninitialized -fno-strict-aliasing -mno-red-zone -mcmodel=kernel -DNV_UVM_ENABLE -Wno-sign-compare -Wno-format-extra-args -Werror=undef -DNV_SPECTRE_V2=0 -I/tmp/B.scl2CX/BUILD/NVIDIA-Linux-x86_64-390.141-no-compat32/kernel/nvidia -DNV_BUILD_MODULE_INSTANCES=0 -DNVIDIA_UNDEF_LEGACY_BIT_MACROS -UDEBUG -U_DEBUG -DNDEBUG -DMODULE -DKBUILD_BASENAME='"nv_gvi"' -DKBUILD_MODNAME='"nvidia"' -c -o /tmp/B.scl2CX/BUILD/NVIDIA-Linux-x86_64-390.141-no-compat32/kernel/nvidia/nv-gvi.o /tmp/B.scl2CX/BUILD/NVIDIA-Linux-x86_64-390.141-no-compat32/kernel/nvidia/nv-gvi.c In file included from /tmp/B.scl2CX/BUILD/NVIDIA-Linux-x86_64-390.141-no-compat32/kernel/nvidia/nv-gvi.c:15: /tmp/B.scl2CX/BUILD/NVIDIA-Linux-x86_64-390.141-no-compat32/kernel/common/inc/nv-linux.h:118:10: fatal error: asm/kmap_types.h: No such file or directory 118 | #include <asm/kmap_types.h> /* page table entry lookup */ | ^~~~~~~~~~~~~~~~~~ compilation terminated. make[2]: *** [scripts/Makefile.build:279: /tmp/B.scl2CX/BUILD/NVIDIA-Linux-x86_64-390.141-no-compat32/kernel/nvidia/nv-gvi.o] Error 1 make[1]: *** [Makefile:1800: /tmp/B.scl2CX/BUILD/NVIDIA-Linux-x86_64-390.141-no-compat32/kernel] Error 2 make: *** [Makefile:81: modules] Error 2 error: Bad exit status from /tmp/B.scl2CX/BUILD/tmp/rpm-tmp.sW1LQ2 (%build) RPM build errors: line 72: It's not recommended to have unversioned Obsoletes: Obsoletes: XFree86-driver-nvidia line 73: It's not recommended to have unversioned Obsoletes: Obsoletes: XFree86-nvidia line 149: It's not recommended to have unversioned Obsoletes: Obsoletes: X11-OpenGL-devel-base line 150: It's not recommended to have unversioned Obsoletes: Obsoletes: XFree86-OpenGL-devel-base line 151: It's not recommended to have unversioned Obsoletes: Obsoletes: XFree86-driver-nvidia-devel line 183: It's not recommended to have unversioned Obsoletes: Obsoletes: XFree86-driver-nvidia-progs line 250: It's not recommended to have unversioned Obsoletes: Obsoletes: XFree86-nvidia-kernel Could not canonicalize hostname: ymir Bad exit status from /tmp/B.scl2CX/BUILD/tmp/rpm-tmp.sW1LQ2 (%build) ended at: Tue Feb 23 01:37:51 2021, done in 0:00:15.167530 error: No files produced. + chmod -R u+rwX /tmp/B.scl2CX/BUILD + rm -rf /tmp/B.scl2CX/tmp /tmp/B.scl2CX/BUILD + rm -rf /tmp/B.scl2CX Begin-PLD-Builder-Info Build-Time: user:58.79s sys:11.77s real:22.31s (faults io:14 non-io:2515504) End-PLD-Builder-Info
[Back to list of logs] [View rpm -qa of builder]