FailedOk

th/SRPMS[OK]
th/x32[OK]
th/i686[OK]
th/x86_64[OK]

ac/SRPMS[OK]
ac/i386[OK]
ac/i586[OK]
ac/i686[OK]
ac/alpha[OK]
ac/amd64[OK]
ac/athlon[OK]
ac/ppc[OK]
ac/sparc[OK]
ac/sparc64[OK]

Advanced Search
main()
Powered by PLD Linux
(c) 2002-2018 PLD Team
$Revision: 1.37 $
Powered by Dark Side of the Force.
Your IP: 54.81.183.183

xorg-driver-video-vmware afbc93b9-3feb-4380-b002-c7a82944140f

Status:Failed
Source URL:ftp://buildlogs.pld-linux.org/th/x86_64/FAIL/xorg-driver-video-vmware,afbc93b9-3feb-4380-b002-c7a82944140f.bz2
text/plain URL:View!
rpm -qa of builder:View!
Date:2018/05/14 04:30:57
Runtime:0:00:11.087490

Toc:

  • error 1
  • rpm: error: Failed build dependencies:
  • error 2
  • rpm: error: Failed build dependencies:
  • prep
  • Executing(%prep): /bin/sh -e /tmp/B.Qe8UT1/BUILD/tmp/rpm-tmp.97225
  • build
  • Executing(%build): /bin/sh -e /tmp/B.Qe8UT1/BUILD/tmp/rpm-tmp.97225
  • error 3
  • saa.c:399:31: error: implicit declaration of function 'fbGetRotatedPixmap'; did you mean 'fbGetScreenPixmap'? [-Werror=implicit-function-declaration]
  • error 4
  • make[2]: *** [Makefile:438: libsaa_la-saa.lo] Error 1
  • error 5
  • make[1]: *** [Makefile:450: all-recursive] Error 1
  • error 6
  • error: Bad exit status from /tmp/B.Qe8UT1/BUILD/tmp/rpm-tmp.97225 (%build)
  • error 7
  • RPM build errors:
  • error 8
  • error: No files produced.

Content:

request from: baggins
checking if we should skip the build
started at: Mon May 14 04:30:31 2018
killing old processes on a builder
mesg: ttyname failed: Inappropriate ioctl for device
sending signal 9 to pid -1
Killed
fetching https://srcbuilder.pld-linux.org/th//srpms/afbc93b9-3feb-4380-b002-c7a82944140f/xorg-driver-video-vmware-13.2.1-1.src.rpm
fetched 482924 bytes, 911.5 K/s
installing srpm: xorg-driver-video-vmware-13.2.1-1.src.rpm
mesg: ttyname failed: Inappropriate ioctl for device
+ install -d /tmp/B.Qe8UT1/BUILD /tmp/B.Qe8UT1/RPMS
+ LC_ALL=en_US.UTF-8
+ rpm -qp --changelog xorg-driver-video-vmware-13.2.1-1.src.rpm
* Mon May 14 2018 PLD Linux Team <feedback@pld-linux.org>
- For complete changelog see: http://git.pld-linux.org/?p=packages/xorg-driver-video-vmware.git;a=log;h=master
+ rpm -Uhv --nodeps --define '_topdir /tmp/B.Qe8UT1' --define '_specdir %{_topdir}' --define '_sourcedir %{_specdir}' --define '_rpmdir %{_topdir}/RPMS' --define '_builddir %{_topdir}/BUILD' xorg-driver-video-vmware-13.2.1-1.src.rpm Preparing... ################################################## xorg-driver-video-vmware ################################################## + rm -f xorg-driver-video-vmware-13.2.1-1.src.rpm mesg: ttyname failed: Inappropriate ioctl for device + install -m 700 -d /tmp/B.Qe8UT1/BUILD/tmp mesg: ttyname failed: Inappropriate ioctl for device + TMPDIR=/tmp/B.Qe8UT1/BUILD/tmp + exec nice -n 0 rpmbuild -bp --short-circuit --nodeps --define '_topdir /tmp/B.Qe8UT1' --define '_specdir %{_topdir}' --define '_sourcedir %{_specdir}' --define '_rpmdir %{_topdir}/RPMS' --define '_builddir %{_topdir}/BUILD' --target x86_64-pld-linux --define 'prep exit 0' /tmp/B.Qe8UT1/xorg-driver-video-vmware.spec Building target platforms: x86_64-pld-linux checking BuildConflict-ing packages no BuildConflicts found checking BR rpm: error: Failed build dependencies: rpm: Mesa-libxatracker-devel >= 8 is needed by xorg-driver-video-vmware-13.2.1-1.src rpm: Building target platforms: x86_64-pld-linux updating poldek cache... ready is up to date Retrieving th::packages.ndir.md... th is up to date Retrieving th::packages.ndir.md... th is up to date Retrieving th-ready::packages.ndir.md... th-ready is up to date Retrieving th-ready::packages.ndir.md... th-ready is up to date Retrieving th-test::packages.ndir.md... th-test is up to date Retrieving th-test::packages.ndir.md... th-test is up to date checking conflicting packages in BRed packages poldek: Loading [pndir]ready... poldek: Loading [pndir]th-test... poldek: Loading [pndir]th-test... poldek: Loading [pndir]th-ready... poldek: Loading [pndir]th-ready... poldek: Loading [pndir]th... poldek: Loading [pndir]th... poldek: 27537 packages read poldek: Removed 746 duplicate packages from available set poldek: Processing dependencies... poldek: Mesa-libxatracker-devel-18.0.2-1.x86_64 marks Mesa-libxatracker-18.0.2-1.x86_64 (cap Mesa-libxatracker = 18.0.2-1) poldek: There are 2 packages to install (1 marked by dependencies): poldek: I Mesa-libxatracker-devel-18.0.2-1.x86_64 poldek: D Mesa-libxatracker-18.0.2-1.x86_64 poldek: This operation will use 3.2MB of disk space. poldek: Need to get 1.1MB of archives (1.1MB to download). poldek: poldek: Retrieving [1/2] th::Mesa-libxatracker-18.0.2-1.x86_64.rpm... poldek: ..............................done poldek: Retrieving [2/2] th::Mesa-libxatracker-devel-18.0.2-1.x86_64.rpm... poldek: ..............................done poldek: Executing pm-command.sh --upgrade -vh --test --root / --define _check_dirname_deps 1... poldek: Preparing... ################################################## no conflicts found checking BR rpm: error: Failed build dependencies: rpm: Mesa-libxatracker-devel >= 8 is needed by xorg-driver-video-vmware-13.2.1-1.src rpm: Building target platforms: x86_64-pld-linux installing BR: Mesa\-libxatracker\-devel + poldek --noask --caplookup -Q -v '--ignore=hhvm-*' '--ignore=php4-*' '--ignore=php52-*' '--ignore=php54-*' '--ignore=php55-*' '--ignore=php56-*' '--ignore=php70-*' '--ignore=php71-*' '--ignore=php72-*' --upgrade Mesa-libxatracker-devel Loading [pndir]ready... Loading [pndir]th-test... Loading [pndir]th-test... Loading [pndir]th-ready... Loading [pndir]th-ready... Loading [pndir]th... Loading [pndir]th... 27537 packages read Removed 746 duplicate packages from available set Processing dependencies... Mesa-libxatracker-devel-18.0.2-1.x86_64 marks Mesa-libxatracker-18.0.2-1.x86_64 (cap Mesa-libxatracker = 18.0.2-1) There are 2 packages to install (1 marked by dependencies): I Mesa-libxatracker-devel-18.0.2-1.x86_64 D Mesa-libxatracker-18.0.2-1.x86_64 This operation will use 3.2MB of disk space. Need to get 1.1MB of archives. Executing pm-command.sh --upgrade -vh --root / --define _check_dirname_deps 1... Preparing... ################################################## Mesa-libxatracker ################################################## Mesa-libxatracker-devel ################################################## building RPM using: set -ex; : build-id: afbc93b9-3feb-4380-b002-c7a82944140f; TMPDIR=/tmp/B.Qe8UT1/BUILD/tmp exec nice -n 0 rpmbuild -bb --define '_smp_mflags -j9' --define '_make_opts -Otarget' --define '_pld_builder 1' --define '_topdir /tmp/B.Qe8UT1' --define '_specdir %{_topdir}' --define '_sourcedir %{_specdir}' --define '_rpmdir %{_topdir}/RPMS' --define '_builddir %{_topdir}/BUILD' --target x86_64-pld-linux /tmp/B.Qe8UT1/xorg-driver-video-vmware.spec mesg: ttyname failed: Inappropriate ioctl for device + : build-id: afbc93b9-3feb-4380-b002-c7a82944140f + TMPDIR=/tmp/B.Qe8UT1/BUILD/tmp + exec nice -n 0 rpmbuild -bb --define '_smp_mflags -j9' --define '_make_opts -Otarget' --define '_pld_builder 1' --define '_topdir /tmp/B.Qe8UT1' --define '_specdir %{_topdir}' --define '_sourcedir %{_specdir}' --define '_rpmdir %{_topdir}/RPMS' --define '_builddir %{_topdir}/BUILD' --target x86_64-pld-linux /tmp/B.Qe8UT1/xorg-driver-video-vmware.spec Building target platforms: x86_64-pld-linux Executing(%prep): /bin/sh -e /tmp/B.Qe8UT1/BUILD/tmp/rpm-tmp.97225 + umask 022 + cd /tmp/B.Qe8UT1/BUILD + cd /tmp/B.Qe8UT1/BUILD + rm -rf xf86-video-vmware-13.2.1 + /usr/bin/bzip2 -dc /tmp/B.Qe8UT1/xf86-video-vmware-13.2.1.tar.bz2 + /bin/tar -xf - bzip2: I/O or other error, bailing out. Possible reason follows. bzip2: Broken pipe Input file = /tmp/B.Qe8UT1/xf86-video-vmware-13.2.1.tar.bz2, output file = (stdout) + STATUS=0 + '[' 0 -ne 0 ']' + cd xf86-video-vmware-13.2.1 + /bin/id -u + '[' 1000 '=' 0 ']' + /bin/id -u + '[' 1000 '=' 0 ']' + /bin/chmod -Rf a+rX,u+w,g-w,o-w . + exit 0 Executing(%build): /bin/sh -e /tmp/B.Qe8UT1/BUILD/tmp/rpm-tmp.97225 TMP=/home/users/builder/tmp HOME=/home/users/builder PATH=/home/users/builder/GNUstep/Tools:/usr/local/bin:/usr/bin:/bin:/home/users/builder/bin TMPDIR=/tmp/B.Qe8UT1/BUILD/tmp + umask 022 + cd /tmp/B.Qe8UT1/BUILD + cd xf86-video-vmware-13.2.1 + libtoolize --copy --force --install libtoolize: putting auxiliary files in AC_CONFIG_AUX_DIR, '.'. libtoolize: copying file './config.guess' libtoolize: copying file './config.sub' libtoolize: copying file './install-sh' libtoolize: copying file './ltmain.sh' libtoolize: You should add the contents of the following files to 'aclocal.m4': libtoolize: '/usr/share/aclocal/libtool.m4' libtoolize: '/usr/share/aclocal/ltoptions.m4' libtoolize: '/usr/share/aclocal/ltversion.m4' libtoolize: Consider adding 'AC_CONFIG_MACRO_DIRS([m4])' to configure.ac, libtoolize: and rerunning libtoolize and aclocal. libtoolize: Consider adding '-I m4' to ACLOCAL_AMFLAGS in Makefile.am. + aclocal + autoconf + autoheader + automake -a -c -f --foreign configure.ac:32: installing './compile' configure.ac:35: installing './missing' saa/Makefile.am: installing './depcomp' + ./configure 'LDFLAGS=-Wl,--as-needed -Wl,--no-copy-dt-needed-entries -Wl,-z,relro -Wl,-z,combreloc ' 'CFLAGS=-O2 -fwrapv -pipe -Wformat -Werror=format-security -gdwarf-4 -fno-debug-types-section -fvar-tracking-assignments -g2 -Wp,-D_FORTIFY_SOURCE=2 -fstack-protector-strong --param=ssp-buffer-size=4 -fPIC -march=x86-64 -gdwarf-4 -fno-debug-types-section -fvar-tracking-assignments -g2 ' 'CXXFLAGS=-O2 -fwrapv -pipe -Wformat -Werror=format-security -gdwarf-4 -fno-debug-types-section -fvar-tracking-assignments -g2 -Wp,-D_FORTIFY_SOURCE=2 -fstack-protector-strong --param=ssp-buffer-size=4 -fPIC -march=x86-64 -gdwarf-4 -fno-debug-types-section -fvar-tracking-assignments -g2 ' 'FFLAGS=-O2 -fwrapv -pipe -Wformat -Werror=format-security -gdwarf-4 -fno-debug-types-section -fvar-tracking-assignments -g2 -Wp,-D_FORTIFY_SOURCE=2 -fstack-protector-strong --param=ssp-buffer-size=4 -fPIC -march=x86-64 -gdwarf-4 -fno-debug-types-section -fvar-tracking-assignments -g2 ' 'FCFLAGS=-O2 -fwrapv -pipe -Wformat -Werror=format-security -gdwarf-4 -fno-debug-types-section -fvar-tracking-assignments -g2 -Wp,-D_FORTIFY_SOURCE=2 -fstack-protector-strong --param=ssp-buffer-size=4 -fPIC -march=x86-64 -gdwarf-4 -fno-debug-types-section -fvar-tracking-assignments -g2 ' 'CPPFLAGS=' 'CC=x86_64-pld-linux-gcc' 'CXX=x86_64-pld-linux-g++' '--host=x86_64-pld-linux' '--build=x86_64-pld-linux' '--prefix=/usr' '--exec-prefix=/usr' '--bindir=/usr/bin' '--sbindir=/usr/sbin' '--sysconfdir=/etc' '--datadir=/usr/share' '--includedir=/usr/include' '--libdir=/usr/lib64' '--libexecdir=/usr/libexec' '--localstatedir=/var' '--sharedstatedir=/var/lib' '--mandir=/usr/share/man' '--infodir=/usr/share/info' '--x-libraries=/usr/lib64' --enable-vmwarectrl-client checking for x86_64-pld-linux-gcc... x86_64-pld-linux-gcc checking whether the C compiler works... yes checking for C compiler default output file name... a.out checking for suffix of executables... checking whether we are cross compiling... no checking for suffix of object files... o checking whether we are using the GNU C compiler... yes checking whether x86_64-pld-linux-gcc accepts -g... yes checking for x86_64-pld-linux-gcc option to accept ISO C89... none needed checking whether x86_64-pld-linux-gcc understands -c and -o together... yes checking for special C compiler options needed for large files... no checking for _FILE_OFFSET_BITS value needed for large files... no checking for a BSD-compatible install... /usr/bin/install -c checking whether build environment is sane... yes checking for a thread-safe mkdir -p... /bin/mkdir -p checking for mawk... mawk checking whether make sets $(MAKE)... yes checking whether make supports the include directive... yes (GNU style) checking whether make supports nested variables... yes checking dependency style of x86_64-pld-linux-gcc... gcc3 checking whether to enable maintainer-specific portions of Makefiles... no checking for x86_64-pld-linux-gcc option to accept ISO C99... none needed checking how to run the C preprocessor... x86_64-pld-linux-gcc -E checking for grep that handles long lines and -e... /bin/grep checking for egrep... /bin/grep -E checking for ANSI C header files... yes checking for sys/types.h... yes checking for sys/stat.h... yes checking for stdlib.h... yes checking for string.h... yes checking for memory.h... yes checking for strings.h... yes checking for inttypes.h... yes checking for stdint.h... yes checking for unistd.h... yes checking whether __clang__ is declared... no checking whether __INTEL_COMPILER is declared... no checking whether __SUNPRO_C is declared... no checking for x86_64-pld-linux-pkg-config... no checking for pkg-config... /usr/bin/pkg-config checking pkg-config is at least version 0.9.0... yes checking build system type... x86_64-pld-linux-gnu checking host system type... x86_64-pld-linux-gnu checking for a sed that does not truncate output... /bin/sed checking if x86_64-pld-linux-gcc supports -Werror=unknown-warning-option... no checking if x86_64-pld-linux-gcc supports -Werror=unused-command-line-argument... no checking if x86_64-pld-linux-gcc supports -Wall... yes checking if x86_64-pld-linux-gcc supports -Wpointer-arith... yes checking if x86_64-pld-linux-gcc supports -Wmissing-declarations... yes checking if x86_64-pld-linux-gcc supports -Wformat=2... yes checking if x86_64-pld-linux-gcc supports -Wstrict-prototypes... yes checking if x86_64-pld-linux-gcc supports -Wmissing-prototypes... yes checking if x86_64-pld-linux-gcc supports -Wnested-externs... yes checking if x86_64-pld-linux-gcc supports -Wbad-function-cast... yes checking if x86_64-pld-linux-gcc supports -Wold-style-definition... yes checking if x86_64-pld-linux-gcc supports -Wdeclaration-after-statement... yes checking if x86_64-pld-linux-gcc supports -Wunused... yes checking if x86_64-pld-linux-gcc supports -Wuninitialized... yes checking if x86_64-pld-linux-gcc supports -Wshadow... yes checking if x86_64-pld-linux-gcc supports -Wmissing-noreturn... yes checking if x86_64-pld-linux-gcc supports -Wmissing-format-attribute... yes checking if x86_64-pld-linux-gcc supports -Wredundant-decls... yes checking if x86_64-pld-linux-gcc supports -Wlogical-op... yes checking if x86_64-pld-linux-gcc supports -Werror=implicit... yes checking if x86_64-pld-linux-gcc supports -Werror=nonnull... yes checking if x86_64-pld-linux-gcc supports -Werror=init-self... yes checking if x86_64-pld-linux-gcc supports -Werror=main... yes checking if x86_64-pld-linux-gcc supports -Werror=missing-braces... yes checking if x86_64-pld-linux-gcc supports -Werror=sequence-point... yes checking if x86_64-pld-linux-gcc supports -Werror=return-type... yes checking if x86_64-pld-linux-gcc supports -Werror=trigraphs... yes checking if x86_64-pld-linux-gcc supports -Werror=array-bounds... yes checking if x86_64-pld-linux-gcc supports -Werror=write-strings... yes checking if x86_64-pld-linux-gcc supports -Werror=address... yes checking if x86_64-pld-linux-gcc supports -Werror=int-to-pointer-cast... yes checking if x86_64-pld-linux-gcc supports -Werror=pointer-to-int-cast... yes checking if x86_64-pld-linux-gcc supports -pedantic... yes checking if x86_64-pld-linux-gcc supports -Werror... yes checking if x86_64-pld-linux-gcc supports -Werror=attributes... yes checking whether make supports nested variables... (cached) yes checking how to print strings... print -r checking for a sed that does not truncate output... (cached) /bin/sed checking for fgrep... /bin/grep -F checking for ld used by x86_64-pld-linux-gcc... /usr/bin/ld checking if the linker (/usr/bin/ld) is GNU ld... yes checking for BSD- or MS-compatible name lister (nm)... /usr/bin/nm -B checking the name lister (/usr/bin/nm -B) interface... BSD nm checking whether ln -s works... yes checking the maximum length of command line arguments... 1572864 checking how to convert x86_64-pld-linux-gnu file names to x86_64-pld-linux-gnu format... func_convert_file_noop checking how to convert x86_64-pld-linux-gnu file names to toolchain format... func_convert_file_noop checking for /usr/bin/ld option to reload object files... -r checking for x86_64-pld-linux-objdump... no checking for objdump... objdump checking how to recognize dependent libraries... pass_all checking for x86_64-pld-linux-dlltool... no checking for dlltool... no checking how to associate runtime and link libraries... print -r -- checking for x86_64-pld-linux-ar... no checking for ar... ar checking for archiver @FILE support... @ checking for x86_64-pld-linux-strip... no checking for strip... strip checking for x86_64-pld-linux-ranlib... no checking for ranlib... ranlib checking command to parse /usr/bin/nm -B output from x86_64-pld-linux-gcc object... ok checking for sysroot... no checking for a working dd... /bin/dd checking how to truncate binary pipes... /bin/dd bs=4096 count=1 checking for x86_64-pld-linux-mt... no checking for mt... no checking if : is a manifest tool... no checking for dlfcn.h... yes checking for objdir... .libs checking if x86_64-pld-linux-gcc supports -fno-rtti -fno-exceptions... no checking for x86_64-pld-linux-gcc option to produce PIC... -fPIC -DPIC checking if x86_64-pld-linux-gcc PIC flag -fPIC -DPIC works... yes checking if x86_64-pld-linux-gcc static flag -static works... yes checking if x86_64-pld-linux-gcc supports -c -o file.o... yes checking if x86_64-pld-linux-gcc supports -c -o file.o... (cached) yes checking whether the x86_64-pld-linux-gcc linker (/usr/bin/ld -m elf_x86_64) supports shared libraries... yes checking whether -lc should be explicitly linked in... no checking dynamic linker characteristics... GNU/Linux ld.so checking how to hardcode library paths into programs... immediate checking whether stripping libraries is possible... yes checking if libtool supports shared libraries... yes checking whether to build shared libraries... yes checking whether to build static libraries... no checking if RANDR is defined... yes checking if RENDER is defined... yes checking if DPMSExtension is defined... yes checking if XINERAMA is defined... yes checking if XV is defined... yes checking for xorg-server >= 1.0.1 xproto fontsproto randrproto renderproto xextproto xineramaproto videoproto... yes checking for x11 xext... yes checking whether XSERVER_LIBPCIACCESS is declared... yes checking for pciaccess >= 0.8.0... yes checking for libdrm... yes checking for xatracker >= 0.4.0... yes checking whether to build Kernel Mode Setting and 3D... yes checking for libudev... yes checking that generated files are newer than configure... done configure: creating ./config.status config.status: creating Makefile config.status: creating man/Makefile config.status: creating saa/Makefile config.status: creating vmwgfx/Makefile config.status: creating src/Makefile config.status: creating vmwarectrl/Makefile config.status: creating config.h config.status: executing depfiles commands config.status: executing libtool commands + /usr/bin/make -Otarget -j9 /usr/bin/make all-recursive Making all in man make[2]: Entering directory '/tmp/B.Qe8UT1/BUILD/xf86-video-vmware-13.2.1/man' /bin/sed -e 's|__vendorversion__|"xf86-video-vmware 13.2.1" "X Version 11"|' -e 's|__xorgversion__|"xf86-video-vmware 13.2.1" "X Version 11"|' -e 's|__xservername__|Xorg|g' -e 's|__xconfigfile__|xorg.conf|g' -e 's|__projectroot__|/usr|g' -e 's|__apploaddir__||g' -e 's|__appmansuffix__|1|g' -e 's|__drivermansuffix__|4|g' -e 's|__adminmansuffix__|8|g' -e 's|__libmansuffix__|3|g' -e 's|__miscmansuffix__|7|g' -e 's|__filemansuffix__|5|g' < vmware.man > vmware.4 make[2]: Leaving directory '/tmp/B.Qe8UT1/BUILD/xf86-video-vmware-13.2.1/man' Making all in saa make[2]: Entering directory '/tmp/B.Qe8UT1/BUILD/xf86-video-vmware-13.2.1/saa' /bin/sh ../libtool --tag=CC --mode=compile x86_64-pld-linux-gcc -DHAVE_CONFIG_H -I. -I.. -Wall -Wpointer-arith -Wmissing-declarations -Wformat=2 -Wstrict-prototypes -Wmissing-prototypes -Wnested-externs -Wbad-function-cast -Wold-style-definition -Wdeclaration-after-statement -Wunused -Wuninitialized -Wshadow -Wmissing-noreturn -Wmissing-format-attribute -Wredundant-decls -Wlogical-op -Werror=implicit -Werror=nonnull -Werror=init-self -Werror=main -Werror=missing-braces -Werror=sequence-point -Werror=return-type -Werror=trigraphs -Werror=array-bounds -Werror=write-strings -Werror=address -Werror=int-to-pointer-cast -Werror=pointer-to-int-cast -fno-strict-aliasing -fvisibility=hidden -I/usr/include/xorg -I/usr/include/pixman-1 -I/usr/include/libdrm -I/usr/include/X11/dri -O2 -fwrapv -pipe -Wformat -Werror=format-security -gdwarf-4 -fno-debug-types-section -fvar-tracking-assignments -g2 -Wp,-D_FORTIFY_SOURCE=2 -fstack-protector-strong --param=ssp-buffer-size=4 -fPIC -march=x86-64 -gdwarf-4 -fno-debug-types-section -fvar-tracking-assignments -g2 -MT libsaa_la-saa_accel.lo -MD -MP -MF .deps/libsaa_la-saa_accel.Tpo -c -o libsaa_la-saa_accel.lo `test -f 'saa_accel.c' || echo './'`saa_accel.c libtool: compile: x86_64-pld-linux-gcc -DHAVE_CONFIG_H -I. -I.. -Wall -Wpointer-arith -Wmissing-declarations -Wformat=2 -Wstrict-prototypes -Wmissing-prototypes -Wnested-externs -Wbad-function-cast -Wold-style-definition -Wdeclaration-after-statement -Wunused -Wuninitialized -Wshadow -Wmissing-noreturn -Wmissing-format-attribute -Wredundant-decls -Wlogical-op -Werror=implicit -Werror=nonnull -Werror=init-self -Werror=main -Werror=missing-braces -Werror=sequence-point -Werror=return-type -Werror=trigraphs -Werror=array-bounds -Werror=write-strings -Werror=address -Werror=int-to-pointer-cast -Werror=pointer-to-int-cast -fno-strict-aliasing -fvisibility=hidden -I/usr/include/xorg -I/usr/include/pixman-1 -I/usr/include/libdrm -I/usr/include/X11/dri -O2 -fwrapv -pipe -Wformat -Werror=format-security -gdwarf-4 -fno-debug-types-section -fvar-tracking-assignments -g2 -Wp,-D_FORTIFY_SOURCE=2 -fstack-protector-strong --param=ssp-buffer-size=4 -fPIC -march=x86-64 -gdwarf-4 -fno-debug-types-section -fvar-tracking-assignments -g2 -MT libsaa_la-saa_accel.lo -MD -MP -MF .deps/libsaa_la-saa_accel.Tpo -c saa_accel.c -fPIC -DPIC -o .libs/libsaa_la-saa_accel.o mv -f .deps/libsaa_la-saa_accel.Tpo .deps/libsaa_la-saa_accel.Plo make[2]: Leaving directory '/tmp/B.Qe8UT1/BUILD/xf86-video-vmware-13.2.1/saa' make[2]: Entering directory '/tmp/B.Qe8UT1/BUILD/xf86-video-vmware-13.2.1/saa' /bin/sh ../libtool --tag=CC --mode=compile x86_64-pld-linux-gcc -DHAVE_CONFIG_H -I. -I.. -Wall -Wpointer-arith -Wmissing-declarations -Wformat=2 -Wstrict-prototypes -Wmissing-prototypes -Wnested-externs -Wbad-function-cast -Wold-style-definition -Wdeclaration-after-statement -Wunused -Wuninitialized -Wshadow -Wmissing-noreturn -Wmissing-format-attribute -Wredundant-decls -Wlogical-op -Werror=implicit -Werror=nonnull -Werror=init-self -Werror=main -Werror=missing-braces -Werror=sequence-point -Werror=return-type -Werror=trigraphs -Werror=array-bounds -Werror=write-strings -Werror=address -Werror=int-to-pointer-cast -Werror=pointer-to-int-cast -fno-strict-aliasing -fvisibility=hidden -I/usr/include/xorg -I/usr/include/pixman-1 -I/usr/include/libdrm -I/usr/include/X11/dri -O2 -fwrapv -pipe -Wformat -Werror=format-security -gdwarf-4 -fno-debug-types-section -fvar-tracking-assignments -g2 -Wp,-D_FORTIFY_SOURCE=2 -fstack-protector-strong --param=ssp-buffer-size=4 -fPIC -march=x86-64 -gdwarf-4 -fno-debug-types-section -fvar-tracking-assignments -g2 -MT libsaa_la-saa_pixmap.lo -MD -MP -MF .deps/libsaa_la-saa_pixmap.Tpo -c -o libsaa_la-saa_pixmap.lo `test -f 'saa_pixmap.c' || echo './'`saa_pixmap.c libtool: compile: x86_64-pld-linux-gcc -DHAVE_CONFIG_H -I. -I.. -Wall -Wpointer-arith -Wmissing-declarations -Wformat=2 -Wstrict-prototypes -Wmissing-prototypes -Wnested-externs -Wbad-function-cast -Wold-style-definition -Wdeclaration-after-statement -Wunused -Wuninitialized -Wshadow -Wmissing-noreturn -Wmissing-format-attribute -Wredundant-decls -Wlogical-op -Werror=implicit -Werror=nonnull -Werror=init-self -Werror=main -Werror=missing-braces -Werror=sequence-point -Werror=return-type -Werror=trigraphs -Werror=array-bounds -Werror=write-strings -Werror=address -Werror=int-to-pointer-cast -Werror=pointer-to-int-cast -fno-strict-aliasing -fvisibility=hidden -I/usr/include/xorg -I/usr/include/pixman-1 -I/usr/include/libdrm -I/usr/include/X11/dri -O2 -fwrapv -pipe -Wformat -Werror=format-security -gdwarf-4 -fno-debug-types-section -fvar-tracking-assignments -g2 -Wp,-D_FORTIFY_SOURCE=2 -fstack-protector-strong --param=ssp-buffer-size=4 -fPIC -march=x86-64 -gdwarf-4 -fno-debug-types-section -fvar-tracking-assignments -g2 -MT libsaa_la-saa_pixmap.lo -MD -MP -MF .deps/libsaa_la-saa_pixmap.Tpo -c saa_pixmap.c -fPIC -DPIC -o .libs/libsaa_la-saa_pixmap.o mv -f .deps/libsaa_la-saa_pixmap.Tpo .deps/libsaa_la-saa_pixmap.Plo make[2]: Leaving directory '/tmp/B.Qe8UT1/BUILD/xf86-video-vmware-13.2.1/saa' make[2]: Entering directory '/tmp/B.Qe8UT1/BUILD/xf86-video-vmware-13.2.1/saa' /bin/sh ../libtool --tag=CC --mode=compile x86_64-pld-linux-gcc -DHAVE_CONFIG_H -I. -I.. -Wall -Wpointer-arith -Wmissing-declarations -Wformat=2 -Wstrict-prototypes -Wmissing-prototypes -Wnested-externs -Wbad-function-cast -Wold-style-definition -Wdeclaration-after-statement -Wunused -Wuninitialized -Wshadow -Wmissing-noreturn -Wmissing-format-attribute -Wredundant-decls -Wlogical-op -Werror=implicit -Werror=nonnull -Werror=init-self -Werror=main -Werror=missing-braces -Werror=sequence-point -Werror=return-type -Werror=trigraphs -Werror=array-bounds -Werror=write-strings -Werror=address -Werror=int-to-pointer-cast -Werror=pointer-to-int-cast -fno-strict-aliasing -fvisibility=hidden -I/usr/include/xorg -I/usr/include/pixman-1 -I/usr/include/libdrm -I/usr/include/X11/dri -O2 -fwrapv -pipe -Wformat -Werror=format-security -gdwarf-4 -fno-debug-types-section -fvar-tracking-assignments -g2 -Wp,-D_FORTIFY_SOURCE=2 -fstack-protector-strong --param=ssp-buffer-size=4 -fPIC -march=x86-64 -gdwarf-4 -fno-debug-types-section -fvar-tracking-assignments -g2 -MT libsaa_la-saa_render.lo -MD -MP -MF .deps/libsaa_la-saa_render.Tpo -c -o libsaa_la-saa_render.lo `test -f 'saa_render.c' || echo './'`saa_render.c libtool: compile: x86_64-pld-linux-gcc -DHAVE_CONFIG_H -I. -I.. -Wall -Wpointer-arith -Wmissing-declarations -Wformat=2 -Wstrict-prototypes -Wmissing-prototypes -Wnested-externs -Wbad-function-cast -Wold-style-definition -Wdeclaration-after-statement -Wunused -Wuninitialized -Wshadow -Wmissing-noreturn -Wmissing-format-attribute -Wredundant-decls -Wlogical-op -Werror=implicit -Werror=nonnull -Werror=init-self -Werror=main -Werror=missing-braces -Werror=sequence-point -Werror=return-type -Werror=trigraphs -Werror=array-bounds -Werror=write-strings -Werror=address -Werror=int-to-pointer-cast -Werror=pointer-to-int-cast -fno-strict-aliasing -fvisibility=hidden -I/usr/include/xorg -I/usr/include/pixman-1 -I/usr/include/libdrm -I/usr/include/X11/dri -O2 -fwrapv -pipe -Wformat -Werror=format-security -gdwarf-4 -fno-debug-types-section -fvar-tracking-assignments -g2 -Wp,-D_FORTIFY_SOURCE=2 -fstack-protector-strong --param=ssp-buffer-size=4 -fPIC -march=x86-64 -gdwarf-4 -fno-debug-types-section -fvar-tracking-assignments -g2 -MT libsaa_la-saa_render.lo -MD -MP -MF .deps/libsaa_la-saa_render.Tpo -c saa_render.c -fPIC -DPIC -o .libs/libsaa_la-saa_render.o mv -f .deps/libsaa_la-saa_render.Tpo .deps/libsaa_la-saa_render.Plo make[2]: Leaving directory '/tmp/B.Qe8UT1/BUILD/xf86-video-vmware-13.2.1/saa' make[2]: Entering directory '/tmp/B.Qe8UT1/BUILD/xf86-video-vmware-13.2.1/saa' /bin/sh ../libtool --tag=CC --mode=compile x86_64-pld-linux-gcc -DHAVE_CONFIG_H -I. -I.. -Wall -Wpointer-arith -Wmissing-declarations -Wformat=2 -Wstrict-prototypes -Wmissing-prototypes -Wnested-externs -Wbad-function-cast -Wold-style-definition -Wdeclaration-after-statement -Wunused -Wuninitialized -Wshadow -Wmissing-noreturn -Wmissing-format-attribute -Wredundant-decls -Wlogical-op -Werror=implicit -Werror=nonnull -Werror=init-self -Werror=main -Werror=missing-braces -Werror=sequence-point -Werror=return-type -Werror=trigraphs -Werror=array-bounds -Werror=write-strings -Werror=address -Werror=int-to-pointer-cast -Werror=pointer-to-int-cast -fno-strict-aliasing -fvisibility=hidden -I/usr/include/xorg -I/usr/include/pixman-1 -I/usr/include/libdrm -I/usr/include/X11/dri -O2 -fwrapv -pipe -Wformat -Werror=format-security -gdwarf-4 -fno-debug-types-section -fvar-tracking-assignments -g2 -Wp,-D_FORTIFY_SOURCE=2 -fstack-protector-strong --param=ssp-buffer-size=4 -fPIC -march=x86-64 -gdwarf-4 -fno-debug-types-section -fvar-tracking-assignments -g2 -MT libsaa_la-saa.lo -MD -MP -MF .deps/libsaa_la-saa.Tpo -c -o libsaa_la-saa.lo `test -f 'saa.c' || echo './'`saa.c libtool: compile: x86_64-pld-linux-gcc -DHAVE_CONFIG_H -I. -I.. -Wall -Wpointer-arith -Wmissing-declarations -Wformat=2 -Wstrict-prototypes -Wmissing-prototypes -Wnested-externs -Wbad-function-cast -Wold-style-definition -Wdeclaration-after-statement -Wunused -Wuninitialized -Wshadow -Wmissing-noreturn -Wmissing-format-attribute -Wredundant-decls -Wlogical-op -Werror=implicit -Werror=nonnull -Werror=init-self -Werror=main -Werror=missing-braces -Werror=sequence-point -Werror=return-type -Werror=trigraphs -Werror=array-bounds -Werror=write-strings -Werror=address -Werror=int-to-pointer-cast -Werror=pointer-to-int-cast -fno-strict-aliasing -fvisibility=hidden -I/usr/include/xorg -I/usr/include/pixman-1 -I/usr/include/libdrm -I/usr/include/X11/dri -O2 -fwrapv -pipe -Wformat -Werror=format-security -gdwarf-4 -fno-debug-types-section -fvar-tracking-assignments -g2 -Wp,-D_FORTIFY_SOURCE=2 -fstack-protector-strong --param=ssp-buffer-size=4 -fPIC -march=x86-64 -gdwarf-4 -fno-debug-types-section -fvar-tracking-assignments -g2 -MT libsaa_la-saa.lo -MD -MP -MF .deps/libsaa_la-saa.Tpo -c saa.c -fPIC -DPIC -o .libs/libsaa_la-saa.o saa.c: In function 'saa_validate_gc': saa.c:399:31: error: implicit declaration of function 'fbGetRotatedPixmap'; did you mean 'fbGetScreenPixmap'? [-Werror=implicit-function-declaration] PixmapPtr pRotatedTile = fbGetRotatedPixmap(pGC); ^~~~~~~~~~~~~~~~~~ fbGetScreenPixmap saa.c:399:31: warning: nested extern declaration of 'fbGetRotatedPixmap' [-Wnested-externs] saa.c:399:31: warning: initialization makes pointer from integer without a cast [-Wint-conversion] In file included from saa.c:37:0: saa_priv.h:131:22: warning: assignment discards 'const' qualifier from pointer target type [-Wdiscarded-qualifiers] (priv)->saved_##mem = (real)->mem; \ ^ saa.c:424:5: note: in expansion of macro 'saa_swap' saa_swap(sgc, pGC, funcs); ^~~~~~~~ saa_priv.h:131:22: warning: assignment discards 'const' qualifier from pointer target type [-Wdiscarded-qualifiers] (priv)->saved_##mem = (real)->mem; \ ^ saa.c:426:5: note: in expansion of macro 'saa_swap' saa_swap(sgc, pGC, funcs); ^~~~~~~~ saa.c: In function 'saa_destroy_gc': saa_priv.h:131:22: warning: assignment discards 'const' qualifier from pointer target type [-Wdiscarded-qualifiers] (priv)->saved_##mem = (real)->mem; \ ^ saa.c:444:5: note: in expansion of macro 'saa_swap' saa_swap(sgc, pGC, funcs); ^~~~~~~~ saa_priv.h:131:22: warning: assignment discards 'const' qualifier from pointer target type [-Wdiscarded-qualifiers] (priv)->saved_##mem = (real)->mem; \ ^ saa.c:446:5: note: in expansion of macro 'saa_swap' saa_swap(sgc, pGC, funcs); ^~~~~~~~ saa.c: In function 'saa_change_gc': saa_priv.h:131:22: warning: assignment discards 'const' qualifier from pointer target type [-Wdiscarded-qualifiers] (priv)->saved_##mem = (real)->mem; \ ^ saa.c:454:5: note: in expansion of macro 'saa_swap' saa_swap(sgc, pGC, funcs); ^~~~~~~~ saa_priv.h:131:22: warning: assignment discards 'const' qualifier from pointer target type [-Wdiscarded-qualifiers] (priv)->saved_##mem = (real)->mem; \ ^ saa.c:456:5: note: in expansion of macro 'saa_swap' saa_swap(sgc, pGC, funcs); ^~~~~~~~ saa.c: In function 'saa_copy_gc': saa_priv.h:131:22: warning: assignment discards 'const' qualifier from pointer target type [-Wdiscarded-qualifiers] (priv)->saved_##mem = (real)->mem; \ ^ saa.c:464:5: note: in expansion of macro 'saa_swap' saa_swap(sgc, pGCDst, funcs); ^~~~~~~~ saa_priv.h:131:22: warning: assignment discards 'const' qualifier from pointer target type [-Wdiscarded-qualifiers] (priv)->saved_##mem = (real)->mem; \ ^ saa.c:466:5: note: in expansion of macro 'saa_swap' saa_swap(sgc, pGCDst, funcs); ^~~~~~~~ saa.c: In function 'saa_change_clip': saa_priv.h:131:22: warning: assignment discards 'const' qualifier from pointer target type [-Wdiscarded-qualifiers] (priv)->saved_##mem = (real)->mem; \ ^ saa.c:474:5: note: in expansion of macro 'saa_swap' saa_swap(sgc, pGC, funcs); ^~~~~~~~ saa_priv.h:131:22: warning: assignment discards 'const' qualifier from pointer target type [-Wdiscarded-qualifiers] (priv)->saved_##mem = (real)->mem; \ ^ saa.c:476:5: note: in expansion of macro 'saa_swap' saa_swap(sgc, pGC, funcs); ^~~~~~~~ saa.c: In function 'saa_copy_clip': saa_priv.h:131:22: warning: assignment discards 'const' qualifier from pointer target type [-Wdiscarded-qualifiers] (priv)->saved_##mem = (real)->mem; \ ^ saa.c:484:5: note: in expansion of macro 'saa_swap' saa_swap(sgc, pGCDst, funcs); ^~~~~~~~ saa_priv.h:131:22: warning: assignment discards 'const' qualifier from pointer target type [-Wdiscarded-qualifiers] (priv)->saved_##mem = (real)->mem; \ ^ saa.c:486:5: note: in expansion of macro 'saa_swap' saa_swap(sgc, pGCDst, funcs); ^~~~~~~~ saa.c: In function 'saa_destroy_clip': saa_priv.h:131:22: warning: assignment discards 'const' qualifier from pointer target type [-Wdiscarded-qualifiers] (priv)->saved_##mem = (real)->mem; \ ^ saa.c:494:5: note: in expansion of macro 'saa_swap' saa_swap(sgc, pGC, funcs); ^~~~~~~~ saa_priv.h:131:22: warning: assignment discards 'const' qualifier from pointer target type [-Wdiscarded-qualifiers] (priv)->saved_##mem = (real)->mem; \ ^ saa.c:496:5: note: in expansion of macro 'saa_swap' saa_swap(sgc, pGC, funcs); ^~~~~~~~ saa.c: In function 'saa_create_gc': saa_priv.h:121:22: warning: assignment discards 'const' qualifier from pointer target type [-Wdiscarded-qualifiers] (priv)->saved_##mem = (real)->mem; \ ^ saa.c:524:2: note: in expansion of macro 'saa_wrap' saa_wrap(sgc, pGC, funcs, &saa_gc_funcs); ^~~~~~~~ saa_priv.h:121:22: warning: assignment discards 'const' qualifier from pointer target type [-Wdiscarded-qualifiers] (priv)->saved_##mem = (real)->mem; \ ^ saa.c:525:2: note: in expansion of macro 'saa_wrap' saa_wrap(sgc, pGC, ops, &saa_gc_ops); ^~~~~~~~ cc1: some warnings being treated as errors make[2]: *** [Makefile:438: libsaa_la-saa.lo] Error 1 make[2]: Leaving directory '/tmp/B.Qe8UT1/BUILD/xf86-video-vmware-13.2.1/saa' make[2]: *** Waiting for unfinished jobs.... make[2]: Entering directory '/tmp/B.Qe8UT1/BUILD/xf86-video-vmware-13.2.1/saa' /bin/sh ../libtool --tag=CC --mode=compile x86_64-pld-linux-gcc -DHAVE_CONFIG_H -I. -I.. -Wall -Wpointer-arith -Wmissing-declarations -Wformat=2 -Wstrict-prototypes -Wmissing-prototypes -Wnested-externs -Wbad-function-cast -Wold-style-definition -Wdeclaration-after-statement -Wunused -Wuninitialized -Wshadow -Wmissing-noreturn -Wmissing-format-attribute -Wredundant-decls -Wlogical-op -Werror=implicit -Werror=nonnull -Werror=init-self -Werror=main -Werror=missing-braces -Werror=sequence-point -Werror=return-type -Werror=trigraphs -Werror=array-bounds -Werror=write-strings -Werror=address -Werror=int-to-pointer-cast -Werror=pointer-to-int-cast -fno-strict-aliasing -fvisibility=hidden -I/usr/include/xorg -I/usr/include/pixman-1 -I/usr/include/libdrm -I/usr/include/X11/dri -O2 -fwrapv -pipe -Wformat -Werror=format-security -gdwarf-4 -fno-debug-types-section -fvar-tracking-assignments -g2 -Wp,-D_FORTIFY_SOURCE=2 -fstack-protector-strong --param=ssp-buffer-size=4 -fPIC -march=x86-64 -gdwarf-4 -fno-debug-types-section -fvar-tracking-assignments -g2 -MT libsaa_la-saa_unaccel.lo -MD -MP -MF .deps/libsaa_la-saa_unaccel.Tpo -c -o libsaa_la-saa_unaccel.lo `test -f 'saa_unaccel.c' || echo './'`saa_unaccel.c libtool: compile: x86_64-pld-linux-gcc -DHAVE_CONFIG_H -I. -I.. -Wall -Wpointer-arith -Wmissing-declarations -Wformat=2 -Wstrict-prototypes -Wmissing-prototypes -Wnested-externs -Wbad-function-cast -Wold-style-definition -Wdeclaration-after-statement -Wunused -Wuninitialized -Wshadow -Wmissing-noreturn -Wmissing-format-attribute -Wredundant-decls -Wlogical-op -Werror=implicit -Werror=nonnull -Werror=init-self -Werror=main -Werror=missing-braces -Werror=sequence-point -Werror=return-type -Werror=trigraphs -Werror=array-bounds -Werror=write-strings -Werror=address -Werror=int-to-pointer-cast -Werror=pointer-to-int-cast -fno-strict-aliasing -fvisibility=hidden -I/usr/include/xorg -I/usr/include/pixman-1 -I/usr/include/libdrm -I/usr/include/X11/dri -O2 -fwrapv -pipe -Wformat -Werror=format-security -gdwarf-4 -fno-debug-types-section -fvar-tracking-assignments -g2 -Wp,-D_FORTIFY_SOURCE=2 -fstack-protector-strong --param=ssp-buffer-size=4 -fPIC -march=x86-64 -gdwarf-4 -fno-debug-types-section -fvar-tracking-assignments -g2 -MT libsaa_la-saa_unaccel.lo -MD -MP -MF .deps/libsaa_la-saa_unaccel.Tpo -c saa_unaccel.c -fPIC -DPIC -o .libs/libsaa_la-saa_unaccel.o In file included from saa_unaccel.c:29:0: saa_unaccel.c: In function 'saa_check_fill_spans': saa_priv.h:131:22: warning: assignment discards 'const' qualifier from pointer target type [-Wdiscarded-qualifiers] (priv)->saved_##mem = (real)->mem; \ ^ saa_unaccel.c:81:6: note: in expansion of macro 'saa_swap' saa_swap(sgc, pGC, ops); ^~~~~~~~ saa_priv.h:131:22: warning: assignment discards 'const' qualifier from pointer target type [-Wdiscarded-qualifiers] (priv)->saved_##mem = (real)->mem; \ ^ saa_unaccel.c:83:6: note: in expansion of macro 'saa_swap' saa_swap(sgc, pGC, ops); ^~~~~~~~ saa_unaccel.c: In function 'saa_check_set_spans': saa_priv.h:131:22: warning: assignment discards 'const' qualifier from pointer target type [-Wdiscarded-qualifiers] (priv)->saved_##mem = (real)->mem; \ ^ saa_unaccel.c:102:2: note: in expansion of macro 'saa_swap' saa_swap(sgc, pGC, ops); ^~~~~~~~ saa_priv.h:131:22: warning: assignment discards 'const' qualifier from pointer target type [-Wdiscarded-qualifiers] (priv)->saved_##mem = (real)->mem; \ ^ saa_unaccel.c:104:2: note: in expansion of macro 'saa_swap' saa_swap(sgc, pGC, ops); ^~~~~~~~ saa_unaccel.c: In function 'saa_check_put_image': saa_priv.h:131:22: warning: assignment discards 'const' qualifier from pointer target type [-Wdiscarded-qualifiers] (priv)->saved_##mem = (real)->mem; \ ^ saa_unaccel.c:122:2: note: in expansion of macro 'saa_swap' saa_swap(sgc, pGC, ops); ^~~~~~~~ saa_priv.h:131:22: warning: assignment discards 'const' qualifier from pointer target type [-Wdiscarded-qualifiers] (priv)->saved_##mem = (real)->mem; \ ^ saa_unaccel.c:125:2: note: in expansion of macro 'saa_swap' saa_swap(sgc, pGC, ops); ^~~~~~~~ saa_unaccel.c: In function 'saa_check_copy_nton': saa_priv.h:131:22: warning: assignment discards 'const' qualifier from pointer target type [-Wdiscarded-qualifiers] (priv)->saved_##mem = (real)->mem; \ ^ saa_unaccel.c:202:5: note: in expansion of macro 'saa_swap' saa_swap(sgc, pGC, ops); ^~~~~~~~ saa_priv.h:131:22: warning: assignment discards 'const' qualifier from pointer target type [-Wdiscarded-qualifiers] (priv)->saved_##mem = (real)->mem; \ ^ saa_unaccel.c:211:5: note: in expansion of macro 'saa_swap' saa_swap(sgc, pGC, ops); ^~~~~~~~ saa_unaccel.c: In function 'saa_check_copy_area': saa_priv.h:131:22: warning: assignment discards 'const' qualifier from pointer target type [-Wdiscarded-qualifiers] (priv)->saved_##mem = (real)->mem; \ ^ saa_unaccel.c:238:5: note: in expansion of macro 'saa_swap' saa_swap(sgc, pGC, ops); ^~~~~~~~ saa_priv.h:131:22: warning: assignment discards 'const' qualifier from pointer target type [-Wdiscarded-qualifiers] (priv)->saved_##mem = (real)->mem; \ ^ saa_unaccel.c:240:5: note: in expansion of macro 'saa_swap' saa_swap(sgc, pGC, ops); ^~~~~~~~ saa_unaccel.c: In function 'saa_check_copy_plane': saa_priv.h:131:22: warning: assignment discards 'const' qualifier from pointer target type [-Wdiscarded-qualifiers] (priv)->saved_##mem = (real)->mem; \ ^ saa_unaccel.c:269:5: note: in expansion of macro 'saa_swap' saa_swap(sgc, pGC, ops); ^~~~~~~~ saa_priv.h:131:22: warning: assignment discards 'const' qualifier from pointer target type [-Wdiscarded-qualifiers] (priv)->saved_##mem = (real)->mem; \ ^ saa_unaccel.c:272:5: note: in expansion of macro 'saa_swap' saa_swap(sgc, pGC, ops); ^~~~~~~~ saa_unaccel.c: In function 'saa_check_poly_point': saa_priv.h:131:22: warning: assignment discards 'const' qualifier from pointer target type [-Wdiscarded-qualifiers] (priv)->saved_##mem = (real)->mem; \ ^ saa_unaccel.c:295:5: note: in expansion of macro 'saa_swap' saa_swap(sgc, pGC, ops); ^~~~~~~~ saa_priv.h:131:22: warning: assignment discards 'const' qualifier from pointer target type [-Wdiscarded-qualifiers] (priv)->saved_##mem = (real)->mem; \ ^ saa_unaccel.c:297:5: note: in expansion of macro 'saa_swap' saa_swap(sgc, pGC, ops); ^~~~~~~~ saa_unaccel.c: In function 'saa_check_poly_lines': saa_priv.h:131:22: warning: assignment discards 'const' qualifier from pointer target type [-Wdiscarded-qualifiers] (priv)->saved_##mem = (real)->mem; \ ^ saa_unaccel.c:321:5: note: in expansion of macro 'saa_swap' saa_swap(sgc, pGC, ops); ^~~~~~~~ saa_priv.h:131:22: warning: assignment discards 'const' qualifier from pointer target type [-Wdiscarded-qualifiers] (priv)->saved_##mem = (real)->mem; \ ^ saa_unaccel.c:323:5: note: in expansion of macro 'saa_swap' saa_swap(sgc, pGC, ops); ^~~~~~~~ saa_unaccel.c: In function 'saa_check_poly_segment': saa_priv.h:131:22: warning: assignment discards 'const' qualifier from pointer target type [-Wdiscarded-qualifiers] (priv)->saved_##mem = (real)->mem; \ ^ saa_unaccel.c:347:5: note: in expansion of macro 'saa_swap' saa_swap(sgc, pGC, ops); ^~~~~~~~ saa_priv.h:131:22: warning: assignment discards 'const' qualifier from pointer target type [-Wdiscarded-qualifiers] (priv)->saved_##mem = (real)->mem; \ ^ saa_unaccel.c:349:5: note: in expansion of macro 'saa_swap' saa_swap(sgc, pGC, ops); ^~~~~~~~ saa_unaccel.c: In function 'saa_check_poly_arc': saa_priv.h:131:22: warning: assignment discards 'const' qualifier from pointer target type [-Wdiscarded-qualifiers] (priv)->saved_##mem = (real)->mem; \ ^ saa_unaccel.c:371:5: note: in expansion of macro 'saa_swap' saa_swap(sgc, pGC, ops); ^~~~~~~~ saa_priv.h:131:22: warning: assignment discards 'const' qualifier from pointer target type [-Wdiscarded-qualifiers] (priv)->saved_##mem = (real)->mem; \ ^ saa_unaccel.c:373:5: note: in expansion of macro 'saa_swap' saa_swap(sgc, pGC, ops); ^~~~~~~~ saa_unaccel.c: In function 'saa_check_poly_fill_rect_noreadback': saa_priv.h:131:22: warning: assignment discards 'const' qualifier from pointer target type [-Wdiscarded-qualifiers] (priv)->saved_##mem = (real)->mem; \ ^ saa_unaccel.c:449:5: note: in expansion of macro 'saa_swap' saa_swap(sgc, pGC, ops); ^~~~~~~~ saa_priv.h:131:22: warning: assignment discards 'const' qualifier from pointer target type [-Wdiscarded-qualifiers] (priv)->saved_##mem = (real)->mem; \ ^ saa_unaccel.c:451:5: note: in expansion of macro 'saa_swap' saa_swap(sgc, pGC, ops); ^~~~~~~~ saa_unaccel.c: In function 'saa_check_poly_fill_rect': saa_priv.h:131:22: warning: assignment discards 'const' qualifier from pointer target type [-Wdiscarded-qualifiers] (priv)->saved_##mem = (real)->mem; \ ^ saa_unaccel.c:502:5: note: in expansion of macro 'saa_swap' saa_swap(sgc, pGC, ops); ^~~~~~~~ saa_priv.h:131:22: warning: assignment discards 'const' qualifier from pointer target type [-Wdiscarded-qualifiers] (priv)->saved_##mem = (real)->mem; \ ^ saa_unaccel.c:504:5: note: in expansion of macro 'saa_swap' saa_swap(sgc, pGC, ops); ^~~~~~~~ saa_unaccel.c: In function 'saa_check_image_glyph_blt': saa_priv.h:131:22: warning: assignment discards 'const' qualifier from pointer target type [-Wdiscarded-qualifiers] (priv)->saved_##mem = (real)->mem; \ ^ saa_unaccel.c:528:5: note: in expansion of macro 'saa_swap' saa_swap(sgc, pGC, ops); ^~~~~~~~ saa_priv.h:131:22: warning: assignment discards 'const' qualifier from pointer target type [-Wdiscarded-qualifiers] (priv)->saved_##mem = (real)->mem; \ ^ saa_unaccel.c:530:5: note: in expansion of macro 'saa_swap' saa_swap(sgc, pGC, ops); ^~~~~~~~ saa_unaccel.c: In function 'saa_check_poly_glyph_blt': saa_priv.h:131:22: warning: assignment discards 'const' qualifier from pointer target type [-Wdiscarded-qualifiers] (priv)->saved_##mem = (real)->mem; \ ^ saa_unaccel.c:555:5: note: in expansion of macro 'saa_swap' saa_swap(sgc, pGC, ops); ^~~~~~~~ saa_priv.h:131:22: warning: assignment discards 'const' qualifier from pointer target type [-Wdiscarded-qualifiers] (priv)->saved_##mem = (real)->mem; \ ^ saa_unaccel.c:557:5: note: in expansion of macro 'saa_swap' saa_swap(sgc, pGC, ops); ^~~~~~~~ saa_unaccel.c: In function 'saa_check_push_pixels': saa_priv.h:131:22: warning: assignment discards 'const' qualifier from pointer target type [-Wdiscarded-qualifiers] (priv)->saved_##mem = (real)->mem; \ ^ saa_unaccel.c:584:5: note: in expansion of macro 'saa_swap' saa_swap(sgc, pGC, ops); ^~~~~~~~ saa_priv.h:131:22: warning: assignment discards 'const' qualifier from pointer target type [-Wdiscarded-qualifiers] (priv)->saved_##mem = (real)->mem; \ ^ saa_unaccel.c:586:5: note: in expansion of macro 'saa_swap' saa_swap(sgc, pGC, ops); ^~~~~~~~ mv -f .deps/libsaa_la-saa_unaccel.Tpo .deps/libsaa_la-saa_unaccel.Plo make[2]: Leaving directory '/tmp/B.Qe8UT1/BUILD/xf86-video-vmware-13.2.1/saa' make[1]: *** [Makefile:450: all-recursive] Error 1 make: *** [Makefile:382: all] Error 2 error: Bad exit status from /tmp/B.Qe8UT1/BUILD/tmp/rpm-tmp.97225 (%build) RPM build errors: Bad exit status from /tmp/B.Qe8UT1/BUILD/tmp/rpm-tmp.97225 (%build) ended at: Mon May 14 04:30:57 2018, done in 0:00:11.087490 error: No files produced. mesg: ttyname failed: Inappropriate ioctl for device + chmod -R u+rwX /tmp/B.Qe8UT1/BUILD + rm -rf /tmp/B.Qe8UT1/tmp /tmp/B.Qe8UT1/BUILD mesg: ttyname failed: Inappropriate ioctl for device + rm -rf /tmp/B.Qe8UT1 Begin-PLD-Builder-Info Build-Time: user:17.01s sys:2.48s real:26.11s (faults io:0 non-io:1071697) End-PLD-Builder-Info
[Back to list of logs] [View rpm -qa of builder]