FailedOk

th/SRPMS[OK]
th/x32[OK]
th/i686[OK]
th/x86_64[OK]

ac/SRPMS[OK]
ac/i386[OK]
ac/i586[OK]
ac/i686[OK]
ac/alpha[OK]
ac/amd64[OK]
ac/athlon[OK]
ac/ppc[OK]
ac/sparc[OK]
ac/sparc64[OK]

Advanced Search
main()
Powered by PLD Linux
(c) 2002-2018 PLD Team
$Revision: 1.37 $
Powered by bogon.
Your IP: 54.198.158.24

yubico-piv-tool ce99318d-e07d-416a-b95a-4ae29c4982d1

Status:Failed
Source URL:ftp://buildlogs.pld-linux.org/th/x86_64/FAIL/yubico-piv-tool,ce99318d-e07d-416a-b95a-4ae29c4982d1.bz2
text/plain URL:View!
full text:View!
rpm -qa of builder:View!
Date:2018/05/25 22:55:22
Runtime:0:00:11.715242

Toc:

Content:

mv -f .deps/utils.Tpo .deps/utils.Plo
make[2]: Leaving directory '/tmp/B.EHjcCI/BUILD/yubico-piv-tool-1.5.0/ykcs11'
make[2]: Entering directory '/tmp/B.EHjcCI/BUILD/yubico-piv-tool-1.5.0/ykcs11'
/bin/sh ../libtool  --tag=CC   --mode=compile x86_64-pld-linux-gcc -DPACKAGE_NAME=\"yubico-piv-tool\" -DPACKAGE_TARNAME=\"yubico-piv-tool\" -DPACKAGE_VERSION=\"1.5.0\" -DPACKAGE_STRING=\"yubico-piv-tool\ 1.5.0\" -DPACKAGE_BUGREPORT=\"\" -DPACKAGE_URL=\"\" -DPACKAGE=\"yubico-piv-tool\" -DVERSION=\"1.5.0\" -DSTDC_HEADERS=1 -DHAVE_SYS_TYPES_H=1 -DHAVE_SYS_STAT_H=1 -DHAVE_STDLIB_H=1 -DHAVE_STRING_H=1 -DHAVE_MEMORY_H=1 -DHAVE_STRINGS_H=1 -DHAVE_INTTYPES_H=1 -DHAVE_STDINT_H=1 -DHAVE_UNISTD_H=1 -DHAVE_DLFCN_H=1 -DLT_OBJDIR=\".libs/\" -DBACKEND_PCSC=1 -DYKCS11_DBG=0 -DYKCS11_DINOUT=0 -I.  -I/usr/include/openssl -pthread -I/usr/include/PCSC -I../lib -I../lib     -O2 -fwrapv -pipe -Wformat -Werror=format-security -gdwarf-4 -fno-debug-types-section -fvar-tracking-assignments -g2 -Wp,-D_FORTIFY_SOURCE=2 -fstack-protector-strong --param=ssp-buffer-size=4 -fPIC -march=x86-64 -gdwarf-4 -fno-debug-types-section -fvar-tracking-assignments -g2  -MT token_vendors.lo -MD -MP -MF .deps/token_vendors.Tpo -c -o token_vendors.lo token_vendors.c
libtool: compile:  x86_64-pld-linux-gcc -DPACKAGE_NAME=\"yubico-piv-tool\" -DPACKAGE_TARNAME=\"yubico-piv-tool\" -DPACKAGE_VERSION=\"1.5.0\" "-DPACKAGE_STRING=\"yubico-piv-tool 1.5.0\"" -DPACKAGE_BUGREPORT=\"\" -DPACKAGE_URL=\"\" -DPACKAGE=\"yubico-piv-tool\" -DVERSION=\"1.5.0\" -DSTDC_HEADERS=1 -DHAVE_SYS_TYPES_H=1 -DHAVE_SYS_STAT_H=1 -DHAVE_STDLIB_H=1 -DHAVE_STRING_H=1 -DHAVE_MEMORY_H=1 -DHAVE_STRINGS_H=1 -DHAVE_INTTYPES_H=1 -DHAVE_STDINT_H=1 -DHAVE_UNISTD_H=1 -DHAVE_DLFCN_H=1 -DLT_OBJDIR=\".libs/\" -DBACKEND_PCSC=1 -DYKCS11_DBG=0 -DYKCS11_DINOUT=0 -I. -I/usr/include/openssl -pthread -I/usr/include/PCSC -I../lib -I../lib -O2 -fwrapv -pipe -Wformat -Werror=format-security -gdwarf-4 -fno-debug-types-section -fvar-tracking-assignments -g2 -Wp,-D_FORTIFY_SOURCE=2 -fstack-protector-strong --param=ssp-buffer-size=4 -fPIC -march=x86-64 -gdwarf-4 -fno-debug-types-section -fvar-tracking-assignments -g2 -MT token_vendors.lo -MD -MP -MF .deps/token_vendors.Tpo -c token_vendors.c  -fPIC -DPIC -o .libs/token_vendors.o
libtool: compile:  x86_64-pld-linux-gcc -DPACKAGE_NAME=\"yubico-piv-tool\" -DPACKAGE_TARNAME=\"yubico-piv-tool\" -DPACKAGE_VERSION=\"1.5.0\" "-DPACKAGE_STRING=\"yubico-piv-tool 1.5.0\"" -DPACKAGE_BUGREPORT=\"\" -DPACKAGE_URL=\"\" -DPACKAGE=\"yubico-piv-tool\" -DVERSION=\"1.5.0\" -DSTDC_HEADERS=1 -DHAVE_SYS_TYPES_H=1 -DHAVE_SYS_STAT_H=1 -DHAVE_STDLIB_H=1 -DHAVE_STRING_H=1 -DHAVE_MEMORY_H=1 -DHAVE_STRINGS_H=1 -DHAVE_INTTYPES_H=1 -DHAVE_STDINT_H=1 -DHAVE_UNISTD_H=1 -DHAVE_DLFCN_H=1 -DLT_OBJDIR=\".libs/\" -DBACKEND_PCSC=1 -DYKCS11_DBG=0 -DYKCS11_DINOUT=0 -I. -I/usr/include/openssl -pthread -I/usr/include/PCSC -I../lib -I../lib -O2 -fwrapv -pipe -Wformat -Werror=format-security -gdwarf-4 -fno-debug-types-section -fvar-tracking-assignments -g2 -Wp,-D_FORTIFY_SOURCE=2 -fstack-protector-strong --param=ssp-buffer-size=4 -fPIC -march=x86-64 -gdwarf-4 -fno-debug-types-section -fvar-tracking-assignments -g2 -MT token_vendors.lo -MD -MP -MF .deps/token_vendors.Tpo -c token_vendors.c -o token_vendors.o >/dev/null 2>&1
mv -f .deps/token_vendors.Tpo .deps/token_vendors.Plo
make[2]: Leaving directory '/tmp/B.EHjcCI/BUILD/yubico-piv-tool-1.5.0/ykcs11'
make[2]: Entering directory '/tmp/B.EHjcCI/BUILD/yubico-piv-tool-1.5.0/ykcs11'
/bin/sh ../libtool  --tag=CC   --mode=compile x86_64-pld-linux-gcc -DPACKAGE_NAME=\"yubico-piv-tool\" -DPACKAGE_TARNAME=\"yubico-piv-tool\" -DPACKAGE_VERSION=\"1.5.0\" -DPACKAGE_STRING=\"yubico-piv-tool\ 1.5.0\" -DPACKAGE_BUGREPORT=\"\" -DPACKAGE_URL=\"\" -DPACKAGE=\"yubico-piv-tool\" -DVERSION=\"1.5.0\" -DSTDC_HEADERS=1 -DHAVE_SYS_TYPES_H=1 -DHAVE_SYS_STAT_H=1 -DHAVE_STDLIB_H=1 -DHAVE_STRING_H=1 -DHAVE_MEMORY_H=1 -DHAVE_STRINGS_H=1 -DHAVE_INTTYPES_H=1 -DHAVE_STDINT_H=1 -DHAVE_UNISTD_H=1 -DHAVE_DLFCN_H=1 -DLT_OBJDIR=\".libs/\" -DBACKEND_PCSC=1 -DYKCS11_DBG=0 -DYKCS11_DINOUT=0 -I.  -I/usr/include/openssl -pthread -I/usr/include/PCSC -I../lib -I../lib     -O2 -fwrapv -pipe -Wformat -Werror=format-security -gdwarf-4 -fno-debug-types-section -fvar-tracking-assignments -g2 -Wp,-D_FORTIFY_SOURCE=2 -fstack-protector-strong --param=ssp-buffer-size=4 -fPIC -march=x86-64 -gdwarf-4 -fno-debug-types-section -fvar-tracking-assignments -g2  -MT yubico_token.lo -MD -MP -MF .deps/yubico_token.Tpo -c -o yubico_token.lo yubico_token.c
libtool: compile:  x86_64-pld-linux-gcc -DPACKAGE_NAME=\"yubico-piv-tool\" -DPACKAGE_TARNAME=\"yubico-piv-tool\" -DPACKAGE_VERSION=\"1.5.0\" "-DPACKAGE_STRING=\"yubico-piv-tool 1.5.0\"" -DPACKAGE_BUGREPORT=\"\" -DPACKAGE_URL=\"\" -DPACKAGE=\"yubico-piv-tool\" -DVERSION=\"1.5.0\" -DSTDC_HEADERS=1 -DHAVE_SYS_TYPES_H=1 -DHAVE_SYS_STAT_H=1 -DHAVE_STDLIB_H=1 -DHAVE_STRING_H=1 -DHAVE_MEMORY_H=1 -DHAVE_STRINGS_H=1 -DHAVE_INTTYPES_H=1 -DHAVE_STDINT_H=1 -DHAVE_UNISTD_H=1 -DHAVE_DLFCN_H=1 -DLT_OBJDIR=\".libs/\" -DBACKEND_PCSC=1 -DYKCS11_DBG=0 -DYKCS11_DINOUT=0 -I. -I/usr/include/openssl -pthread -I/usr/include/PCSC -I../lib -I../lib -O2 -fwrapv -pipe -Wformat -Werror=format-security -gdwarf-4 -fno-debug-types-section -fvar-tracking-assignments -g2 -Wp,-D_FORTIFY_SOURCE=2 -fstack-protector-strong --param=ssp-buffer-size=4 -fPIC -march=x86-64 -gdwarf-4 -fno-debug-types-section -fvar-tracking-assignments -g2 -MT yubico_token.lo -MD -MP -MF .deps/yubico_token.Tpo -c yubico_token.c  -fPIC -DPIC -o .libs/yubico_token.o
libtool: compile:  x86_64-pld-linux-gcc -DPACKAGE_NAME=\"yubico-piv-tool\" -DPACKAGE_TARNAME=\"yubico-piv-tool\" -DPACKAGE_VERSION=\"1.5.0\" "-DPACKAGE_STRING=\"yubico-piv-tool 1.5.0\"" -DPACKAGE_BUGREPORT=\"\" -DPACKAGE_URL=\"\" -DPACKAGE=\"yubico-piv-tool\" -DVERSION=\"1.5.0\" -DSTDC_HEADERS=1 -DHAVE_SYS_TYPES_H=1 -DHAVE_SYS_STAT_H=1 -DHAVE_STDLIB_H=1 -DHAVE_STRING_H=1 -DHAVE_MEMORY_H=1 -DHAVE_STRINGS_H=1 -DHAVE_INTTYPES_H=1 -DHAVE_STDINT_H=1 -DHAVE_UNISTD_H=1 -DHAVE_DLFCN_H=1 -DLT_OBJDIR=\".libs/\" -DBACKEND_PCSC=1 -DYKCS11_DBG=0 -DYKCS11_DINOUT=0 -I. -I/usr/include/openssl -pthread -I/usr/include/PCSC -I../lib -I../lib -O2 -fwrapv -pipe -Wformat -Werror=format-security -gdwarf-4 -fno-debug-types-section -fvar-tracking-assignments -g2 -Wp,-D_FORTIFY_SOURCE=2 -fstack-protector-strong --param=ssp-buffer-size=4 -fPIC -march=x86-64 -gdwarf-4 -fno-debug-types-section -fvar-tracking-assignments -g2 -MT yubico_token.lo -MD -MP -MF .deps/yubico_token.Tpo -c yubico_token.c -o yubico_token.o >/dev/null 2>&1
mv -f .deps/yubico_token.Tpo .deps/yubico_token.Plo
make[2]: Leaving directory '/tmp/B.EHjcCI/BUILD/yubico-piv-tool-1.5.0/ykcs11'
make[2]: Entering directory '/tmp/B.EHjcCI/BUILD/yubico-piv-tool-1.5.0/ykcs11'
/bin/sh ../libtool  --tag=CC   --mode=compile x86_64-pld-linux-gcc -DPACKAGE_NAME=\"yubico-piv-tool\" -DPACKAGE_TARNAME=\"yubico-piv-tool\" -DPACKAGE_VERSION=\"1.5.0\" -DPACKAGE_STRING=\"yubico-piv-tool\ 1.5.0\" -DPACKAGE_BUGREPORT=\"\" -DPACKAGE_URL=\"\" -DPACKAGE=\"yubico-piv-tool\" -DVERSION=\"1.5.0\" -DSTDC_HEADERS=1 -DHAVE_SYS_TYPES_H=1 -DHAVE_SYS_STAT_H=1 -DHAVE_STDLIB_H=1 -DHAVE_STRING_H=1 -DHAVE_MEMORY_H=1 -DHAVE_STRINGS_H=1 -DHAVE_INTTYPES_H=1 -DHAVE_STDINT_H=1 -DHAVE_UNISTD_H=1 -DHAVE_DLFCN_H=1 -DLT_OBJDIR=\".libs/\" -DBACKEND_PCSC=1 -DYKCS11_DBG=0 -DYKCS11_DINOUT=0 -I.  -I/usr/include/openssl -pthread -I/usr/include/PCSC -I../lib -I../lib     -O2 -fwrapv -pipe -Wformat -Werror=format-security -gdwarf-4 -fno-debug-types-section -fvar-tracking-assignments -g2 -Wp,-D_FORTIFY_SOURCE=2 -fstack-protector-strong --param=ssp-buffer-size=4 -fPIC -march=x86-64 -gdwarf-4 -fno-debug-types-section -fvar-tracking-assignments -g2  -MT mechanisms.lo -MD -MP -MF .deps/mechanisms.Tpo -c -o mechanisms.lo mechanisms.c
libtool: compile:  x86_64-pld-linux-gcc -DPACKAGE_NAME=\"yubico-piv-tool\" -DPACKAGE_TARNAME=\"yubico-piv-tool\" -DPACKAGE_VERSION=\"1.5.0\" "-DPACKAGE_STRING=\"yubico-piv-tool 1.5.0\"" -DPACKAGE_BUGREPORT=\"\" -DPACKAGE_URL=\"\" -DPACKAGE=\"yubico-piv-tool\" -DVERSION=\"1.5.0\" -DSTDC_HEADERS=1 -DHAVE_SYS_TYPES_H=1 -DHAVE_SYS_STAT_H=1 -DHAVE_STDLIB_H=1 -DHAVE_STRING_H=1 -DHAVE_MEMORY_H=1 -DHAVE_STRINGS_H=1 -DHAVE_INTTYPES_H=1 -DHAVE_STDINT_H=1 -DHAVE_UNISTD_H=1 -DHAVE_DLFCN_H=1 -DLT_OBJDIR=\".libs/\" -DBACKEND_PCSC=1 -DYKCS11_DBG=0 -DYKCS11_DINOUT=0 -I. -I/usr/include/openssl -pthread -I/usr/include/PCSC -I../lib -I../lib -O2 -fwrapv -pipe -Wformat -Werror=format-security -gdwarf-4 -fno-debug-types-section -fvar-tracking-assignments -g2 -Wp,-D_FORTIFY_SOURCE=2 -fstack-protector-strong --param=ssp-buffer-size=4 -fPIC -march=x86-64 -gdwarf-4 -fno-debug-types-section -fvar-tracking-assignments -g2 -MT mechanisms.lo -MD -MP -MF .deps/mechanisms.Tpo -c mechanisms.c  -fPIC -DPIC -o .libs/mechanisms.o
libtool: compile:  x86_64-pld-linux-gcc -DPACKAGE_NAME=\"yubico-piv-tool\" -DPACKAGE_TARNAME=\"yubico-piv-tool\" -DPACKAGE_VERSION=\"1.5.0\" "-DPACKAGE_STRING=\"yubico-piv-tool 1.5.0\"" -DPACKAGE_BUGREPORT=\"\" -DPACKAGE_URL=\"\" -DPACKAGE=\"yubico-piv-tool\" -DVERSION=\"1.5.0\" -DSTDC_HEADERS=1 -DHAVE_SYS_TYPES_H=1 -DHAVE_SYS_STAT_H=1 -DHAVE_STDLIB_H=1 -DHAVE_STRING_H=1 -DHAVE_MEMORY_H=1 -DHAVE_STRINGS_H=1 -DHAVE_INTTYPES_H=1 -DHAVE_STDINT_H=1 -DHAVE_UNISTD_H=1 -DHAVE_DLFCN_H=1 -DLT_OBJDIR=\".libs/\" -DBACKEND_PCSC=1 -DYKCS11_DBG=0 -DYKCS11_DINOUT=0 -I. -I/usr/include/openssl -pthread -I/usr/include/PCSC -I../lib -I../lib -O2 -fwrapv -pipe -Wformat -Werror=format-security -gdwarf-4 -fno-debug-types-section -fvar-tracking-assignments -g2 -Wp,-D_FORTIFY_SOURCE=2 -fstack-protector-strong --param=ssp-buffer-size=4 -fPIC -march=x86-64 -gdwarf-4 -fno-debug-types-section -fvar-tracking-assignments -g2 -MT mechanisms.lo -MD -MP -MF .deps/mechanisms.Tpo -c mechanisms.c -o mechanisms.o >/dev/null 2>&1
mv -f .deps/mechanisms.Tpo .deps/mechanisms.Plo
make[2]: Leaving directory '/tmp/B.EHjcCI/BUILD/yubico-piv-tool-1.5.0/ykcs11'
make[2]: Entering directory '/tmp/B.EHjcCI/BUILD/yubico-piv-tool-1.5.0/ykcs11'
/bin/sh ../libtool  --tag=CC   --mode=compile x86_64-pld-linux-gcc -DPACKAGE_NAME=\"yubico-piv-tool\" -DPACKAGE_TARNAME=\"yubico-piv-tool\" -DPACKAGE_VERSION=\"1.5.0\" -DPACKAGE_STRING=\"yubico-piv-tool\ 1.5.0\" -DPACKAGE_BUGREPORT=\"\" -DPACKAGE_URL=\"\" -DPACKAGE=\"yubico-piv-tool\" -DVERSION=\"1.5.0\" -DSTDC_HEADERS=1 -DHAVE_SYS_TYPES_H=1 -DHAVE_SYS_STAT_H=1 -DHAVE_STDLIB_H=1 -DHAVE_STRING_H=1 -DHAVE_MEMORY_H=1 -DHAVE_STRINGS_H=1 -DHAVE_INTTYPES_H=1 -DHAVE_STDINT_H=1 -DHAVE_UNISTD_H=1 -DHAVE_DLFCN_H=1 -DLT_OBJDIR=\".libs/\" -DBACKEND_PCSC=1 -DYKCS11_DBG=0 -DYKCS11_DINOUT=0 -I.  -I/usr/include/openssl -pthread -I/usr/include/PCSC -I../lib -I../lib     -O2 -fwrapv -pipe -Wformat -Werror=format-security -gdwarf-4 -fno-debug-types-section -fvar-tracking-assignments -g2 -Wp,-D_FORTIFY_SOURCE=2 -fstack-protector-strong --param=ssp-buffer-size=4 -fPIC -march=x86-64 -gdwarf-4 -fno-debug-types-section -fvar-tracking-assignments -g2  -MT openssl_utils.lo -MD -MP -MF .deps/openssl_utils.Tpo -c -o openssl_utils.lo openssl_utils.c
libtool: compile:  x86_64-pld-linux-gcc -DPACKAGE_NAME=\"yubico-piv-tool\" -DPACKAGE_TARNAME=\"yubico-piv-tool\" -DPACKAGE_VERSION=\"1.5.0\" "-DPACKAGE_STRING=\"yubico-piv-tool 1.5.0\"" -DPACKAGE_BUGREPORT=\"\" -DPACKAGE_URL=\"\" -DPACKAGE=\"yubico-piv-tool\" -DVERSION=\"1.5.0\" -DSTDC_HEADERS=1 -DHAVE_SYS_TYPES_H=1 -DHAVE_SYS_STAT_H=1 -DHAVE_STDLIB_H=1 -DHAVE_STRING_H=1 -DHAVE_MEMORY_H=1 -DHAVE_STRINGS_H=1 -DHAVE_INTTYPES_H=1 -DHAVE_STDINT_H=1 -DHAVE_UNISTD_H=1 -DHAVE_DLFCN_H=1 -DLT_OBJDIR=\".libs/\" -DBACKEND_PCSC=1 -DYKCS11_DBG=0 -DYKCS11_DINOUT=0 -I. -I/usr/include/openssl -pthread -I/usr/include/PCSC -I../lib -I../lib -O2 -fwrapv -pipe -Wformat -Werror=format-security -gdwarf-4 -fno-debug-types-section -fvar-tracking-assignments -g2 -Wp,-D_FORTIFY_SOURCE=2 -fstack-protector-strong --param=ssp-buffer-size=4 -fPIC -march=x86-64 -gdwarf-4 -fno-debug-types-section -fvar-tracking-assignments -g2 -MT openssl_utils.lo -MD -MP -MF .deps/openssl_utils.Tpo -c openssl_utils.c  -fPIC -DPIC -o .libs/openssl_utils.o
libtool: compile:  x86_64-pld-linux-gcc -DPACKAGE_NAME=\"yubico-piv-tool\" -DPACKAGE_TARNAME=\"yubico-piv-tool\" -DPACKAGE_VERSION=\"1.5.0\" "-DPACKAGE_STRING=\"yubico-piv-tool 1.5.0\"" -DPACKAGE_BUGREPORT=\"\" -DPACKAGE_URL=\"\" -DPACKAGE=\"yubico-piv-tool\" -DVERSION=\"1.5.0\" -DSTDC_HEADERS=1 -DHAVE_SYS_TYPES_H=1 -DHAVE_SYS_STAT_H=1 -DHAVE_STDLIB_H=1 -DHAVE_STRING_H=1 -DHAVE_MEMORY_H=1 -DHAVE_STRINGS_H=1 -DHAVE_INTTYPES_H=1 -DHAVE_STDINT_H=1 -DHAVE_UNISTD_H=1 -DHAVE_DLFCN_H=1 -DLT_OBJDIR=\".libs/\" -DBACKEND_PCSC=1 -DYKCS11_DBG=0 -DYKCS11_DINOUT=0 -I. -I/usr/include/openssl -pthread -I/usr/include/PCSC -I../lib -I../lib -O2 -fwrapv -pipe -Wformat -Werror=format-security -gdwarf-4 -fno-debug-types-section -fvar-tracking-assignments -g2 -Wp,-D_FORTIFY_SOURCE=2 -fstack-protector-strong --param=ssp-buffer-size=4 -fPIC -march=x86-64 -gdwarf-4 -fno-debug-types-section -fvar-tracking-assignments -g2 -MT openssl_utils.lo -MD -MP -MF .deps/openssl_utils.Tpo -c openssl_utils.c -o openssl_utils.o >/dev/null 2>&1
mv -f .deps/openssl_utils.Tpo .deps/openssl_utils.Plo
make[2]: Leaving directory '/tmp/B.EHjcCI/BUILD/yubico-piv-tool-1.5.0/ykcs11'
make[2]: Entering directory '/tmp/B.EHjcCI/BUILD/yubico-piv-tool-1.5.0/ykcs11'
/bin/sh ../libtool  --tag=CC   --mode=compile x86_64-pld-linux-gcc -DPACKAGE_NAME=\"yubico-piv-tool\" -DPACKAGE_TARNAME=\"yubico-piv-tool\" -DPACKAGE_VERSION=\"1.5.0\" -DPACKAGE_STRING=\"yubico-piv-tool\ 1.5.0\" -DPACKAGE_BUGREPORT=\"\" -DPACKAGE_URL=\"\" -DPACKAGE=\"yubico-piv-tool\" -DVERSION=\"1.5.0\" -DSTDC_HEADERS=1 -DHAVE_SYS_TYPES_H=1 -DHAVE_SYS_STAT_H=1 -DHAVE_STDLIB_H=1 -DHAVE_STRING_H=1 -DHAVE_MEMORY_H=1 -DHAVE_STRINGS_H=1 -DHAVE_INTTYPES_H=1 -DHAVE_STDINT_H=1 -DHAVE_UNISTD_H=1 -DHAVE_DLFCN_H=1 -DLT_OBJDIR=\".libs/\" -DBACKEND_PCSC=1 -DYKCS11_DBG=0 -DYKCS11_DINOUT=0 -I.  -I/usr/include/openssl -pthread -I/usr/include/PCSC -I../lib -I../lib     -O2 -fwrapv -pipe -Wformat -Werror=format-security -gdwarf-4 -fno-debug-types-section -fvar-tracking-assignments -g2 -Wp,-D_FORTIFY_SOURCE=2 -fstack-protector-strong --param=ssp-buffer-size=4 -fPIC -march=x86-64 -gdwarf-4 -fno-debug-types-section -fvar-tracking-assignments -g2  -MT ykcs11.lo -MD -MP -MF .deps/ykcs11.Tpo -c -o ykcs11.lo ykcs11.c
libtool: compile:  x86_64-pld-linux-gcc -DPACKAGE_NAME=\"yubico-piv-tool\" -DPACKAGE_TARNAME=\"yubico-piv-tool\" -DPACKAGE_VERSION=\"1.5.0\" "-DPACKAGE_STRING=\"yubico-piv-tool 1.5.0\"" -DPACKAGE_BUGREPORT=\"\" -DPACKAGE_URL=\"\" -DPACKAGE=\"yubico-piv-tool\" -DVERSION=\"1.5.0\" -DSTDC_HEADERS=1 -DHAVE_SYS_TYPES_H=1 -DHAVE_SYS_STAT_H=1 -DHAVE_STDLIB_H=1 -DHAVE_STRING_H=1 -DHAVE_MEMORY_H=1 -DHAVE_STRINGS_H=1 -DHAVE_INTTYPES_H=1 -DHAVE_STDINT_H=1 -DHAVE_UNISTD_H=1 -DHAVE_DLFCN_H=1 -DLT_OBJDIR=\".libs/\" -DBACKEND_PCSC=1 -DYKCS11_DBG=0 -DYKCS11_DINOUT=0 -I. -I/usr/include/openssl -pthread -I/usr/include/PCSC -I../lib -I../lib -O2 -fwrapv -pipe -Wformat -Werror=format-security -gdwarf-4 -fno-debug-types-section -fvar-tracking-assignments -g2 -Wp,-D_FORTIFY_SOURCE=2 -fstack-protector-strong --param=ssp-buffer-size=4 -fPIC -march=x86-64 -gdwarf-4 -fno-debug-types-section -fvar-tracking-assignments -g2 -MT ykcs11.lo -MD -MP -MF .deps/ykcs11.Tpo -c ykcs11.c  -fPIC -DPIC -o .libs/ykcs11.o
libtool: compile:  x86_64-pld-linux-gcc -DPACKAGE_NAME=\"yubico-piv-tool\" -DPACKAGE_TARNAME=\"yubico-piv-tool\" -DPACKAGE_VERSION=\"1.5.0\" "-DPACKAGE_STRING=\"yubico-piv-tool 1.5.0\"" -DPACKAGE_BUGREPORT=\"\" -DPACKAGE_URL=\"\" -DPACKAGE=\"yubico-piv-tool\" -DVERSION=\"1.5.0\" -DSTDC_HEADERS=1 -DHAVE_SYS_TYPES_H=1 -DHAVE_SYS_STAT_H=1 -DHAVE_STDLIB_H=1 -DHAVE_STRING_H=1 -DHAVE_MEMORY_H=1 -DHAVE_STRINGS_H=1 -DHAVE_INTTYPES_H=1 -DHAVE_STDINT_H=1 -DHAVE_UNISTD_H=1 -DHAVE_DLFCN_H=1 -DLT_OBJDIR=\".libs/\" -DBACKEND_PCSC=1 -DYKCS11_DBG=0 -DYKCS11_DINOUT=0 -I. -I/usr/include/openssl -pthread -I/usr/include/PCSC -I../lib -I../lib -O2 -fwrapv -pipe -Wformat -Werror=format-security -gdwarf-4 -fno-debug-types-section -fvar-tracking-assignments -g2 -Wp,-D_FORTIFY_SOURCE=2 -fstack-protector-strong --param=ssp-buffer-size=4 -fPIC -march=x86-64 -gdwarf-4 -fno-debug-types-section -fvar-tracking-assignments -g2 -MT ykcs11.lo -MD -MP -MF .deps/ykcs11.Tpo -c ykcs11.c -o ykcs11.o >/dev/null 2>&1
mv -f .deps/ykcs11.Tpo .deps/ykcs11.Plo
make[2]: Leaving directory '/tmp/B.EHjcCI/BUILD/yubico-piv-tool-1.5.0/ykcs11'
make[2]: Entering directory '/tmp/B.EHjcCI/BUILD/yubico-piv-tool-1.5.0/ykcs11'
/bin/sh ../libtool  --tag=CC   --mode=compile x86_64-pld-linux-gcc -DPACKAGE_NAME=\"yubico-piv-tool\" -DPACKAGE_TARNAME=\"yubico-piv-tool\" -DPACKAGE_VERSION=\"1.5.0\" -DPACKAGE_STRING=\"yubico-piv-tool\ 1.5.0\" -DPACKAGE_BUGREPORT=\"\" -DPACKAGE_URL=\"\" -DPACKAGE=\"yubico-piv-tool\" -DVERSION=\"1.5.0\" -DSTDC_HEADERS=1 -DHAVE_SYS_TYPES_H=1 -DHAVE_SYS_STAT_H=1 -DHAVE_STDLIB_H=1 -DHAVE_STRING_H=1 -DHAVE_MEMORY_H=1 -DHAVE_STRINGS_H=1 -DHAVE_INTTYPES_H=1 -DHAVE_STDINT_H=1 -DHAVE_UNISTD_H=1 -DHAVE_DLFCN_H=1 -DLT_OBJDIR=\".libs/\" -DBACKEND_PCSC=1 -DYKCS11_DBG=0 -DYKCS11_DINOUT=0 -I.  -I/usr/include/openssl -pthread -I/usr/include/PCSC -I../lib -I../lib     -O2 -fwrapv -pipe -Wformat -Werror=format-security -gdwarf-4 -fno-debug-types-section -fvar-tracking-assignments -g2 -Wp,-D_FORTIFY_SOURCE=2 -fstack-protector-strong --param=ssp-buffer-size=4 -fPIC -march=x86-64 -gdwarf-4 -fno-debug-types-section -fvar-tracking-assignments -g2  -MT objects.lo -MD -MP -MF .deps/objects.Tpo -c -o objects.lo objects.c
libtool: compile:  x86_64-pld-linux-gcc -DPACKAGE_NAME=\"yubico-piv-tool\" -DPACKAGE_TARNAME=\"yubico-piv-tool\" -DPACKAGE_VERSION=\"1.5.0\" "-DPACKAGE_STRING=\"yubico-piv-tool 1.5.0\"" -DPACKAGE_BUGREPORT=\"\" -DPACKAGE_URL=\"\" -DPACKAGE=\"yubico-piv-tool\" -DVERSION=\"1.5.0\" -DSTDC_HEADERS=1 -DHAVE_SYS_TYPES_H=1 -DHAVE_SYS_STAT_H=1 -DHAVE_STDLIB_H=1 -DHAVE_STRING_H=1 -DHAVE_MEMORY_H=1 -DHAVE_STRINGS_H=1 -DHAVE_INTTYPES_H=1 -DHAVE_STDINT_H=1 -DHAVE_UNISTD_H=1 -DHAVE_DLFCN_H=1 -DLT_OBJDIR=\".libs/\" -DBACKEND_PCSC=1 -DYKCS11_DBG=0 -DYKCS11_DINOUT=0 -I. -I/usr/include/openssl -pthread -I/usr/include/PCSC -I../lib -I../lib -O2 -fwrapv -pipe -Wformat -Werror=format-security -gdwarf-4 -fno-debug-types-section -fvar-tracking-assignments -g2 -Wp,-D_FORTIFY_SOURCE=2 -fstack-protector-strong --param=ssp-buffer-size=4 -fPIC -march=x86-64 -gdwarf-4 -fno-debug-types-section -fvar-tracking-assignments -g2 -MT objects.lo -MD -MP -MF .deps/objects.Tpo -c objects.c  -fPIC -DPIC -o .libs/objects.o
libtool: compile:  x86_64-pld-linux-gcc -DPACKAGE_NAME=\"yubico-piv-tool\" -DPACKAGE_TARNAME=\"yubico-piv-tool\" -DPACKAGE_VERSION=\"1.5.0\" "-DPACKAGE_STRING=\"yubico-piv-tool 1.5.0\"" -DPACKAGE_BUGREPORT=\"\" -DPACKAGE_URL=\"\" -DPACKAGE=\"yubico-piv-tool\" -DVERSION=\"1.5.0\" -DSTDC_HEADERS=1 -DHAVE_SYS_TYPES_H=1 -DHAVE_SYS_STAT_H=1 -DHAVE_STDLIB_H=1 -DHAVE_STRING_H=1 -DHAVE_MEMORY_H=1 -DHAVE_STRINGS_H=1 -DHAVE_INTTYPES_H=1 -DHAVE_STDINT_H=1 -DHAVE_UNISTD_H=1 -DHAVE_DLFCN_H=1 -DLT_OBJDIR=\".libs/\" -DBACKEND_PCSC=1 -DYKCS11_DBG=0 -DYKCS11_DINOUT=0 -I. -I/usr/include/openssl -pthread -I/usr/include/PCSC -I../lib -I../lib -O2 -fwrapv -pipe -Wformat -Werror=format-security -gdwarf-4 -fno-debug-types-section -fvar-tracking-assignments -g2 -Wp,-D_FORTIFY_SOURCE=2 -fstack-protector-strong --param=ssp-buffer-size=4 -fPIC -march=x86-64 -gdwarf-4 -fno-debug-types-section -fvar-tracking-assignments -g2 -MT objects.lo -MD -MP -MF .deps/objects.Tpo -c objects.c -o objects.o >/dev/null 2>&1
mv -f .deps/objects.Tpo .deps/objects.Plo
make[2]: Leaving directory '/tmp/B.EHjcCI/BUILD/yubico-piv-tool-1.5.0/ykcs11'
make[2]: Entering directory '/tmp/B.EHjcCI/BUILD/yubico-piv-tool-1.5.0/ykcs11'
/bin/sh ../libtool  --tag=CC   --mode=link x86_64-pld-linux-gcc    -O2 -fwrapv -pipe -Wformat -Werror=format-security -gdwarf-4 -fno-debug-types-section -fvar-tracking-assignments -g2 -Wp,-D_FORTIFY_SOURCE=2 -fstack-protector-strong --param=ssp-buffer-size=4 -fPIC -march=x86-64 -gdwarf-4 -fno-debug-types-section -fvar-tracking-assignments -g2  -no-undefined -version-info 5:0:4 -Wl,--version-script=./ykcs11.map  -Wl,--as-needed -Wl,--no-copy-dt-needed-entries -Wl,-z,relro -Wl,-z,combreloc  -o libykcs11.la -rpath /usr/lib64 ykcs11.lo vendors.lo slot_vendors.lo token_vendors.lo mechanisms.lo yubico_slot.lo yubico_token.lo utils.lo openssl_utils.lo objects.lo ../lib/libykpiv.la ../tool/libpiv_util.la 
libtool: link: x86_64-pld-linux-gcc -shared  -fPIC -DPIC  .libs/ykcs11.o .libs/vendors.o .libs/slot_vendors.o .libs/token_vendors.o .libs/mechanisms.o .libs/yubico_slot.o .libs/yubico_token.o .libs/utils.o .libs/openssl_utils.o .libs/objects.o  -Wl,--whole-archive ../tool/.libs/libpiv_util.a -Wl,--no-whole-archive  -Wl,-rpath -Wl,/tmp/B.EHjcCI/BUILD/yubico-piv-tool-1.5.0/lib/.libs -Wl,-rpath -Wl,/usr/lib64 -Wl,-rpath -Wl,/usr/lib64 ../lib/.libs/libykpiv.so /tmp/B.EHjcCI/BUILD/yubico-piv-tool-1.5.0/lib/.libs/libykpiv.so /usr/lib64/libpcsclite.so -ldl -lrt -lcrypto  -O2 -gdwarf-4 -g2 -fstack-protector-strong -march=x86-64 -gdwarf-4 -g2 -Wl,--version-script=./ykcs11.map -Wl,--as-needed -Wl,--no-copy-dt-needed-entries -Wl,-z -Wl,relro -Wl,-z -Wl,combreloc   -pthread -Wl,-soname -Wl,libykcs11.so.1 -o .libs/libykcs11.so.1.4.0
libtool: link: (cd ".libs" && rm -f "libykcs11.so.1" && ln -s "libykcs11.so.1.4.0" "libykcs11.so.1")
libtool: link: (cd ".libs" && rm -f "libykcs11.so" && ln -s "libykcs11.so.1.4.0" "libykcs11.so")
libtool: link: (cd .libs/libykcs11.lax/libpiv_util.a && ar x "/tmp/B.EHjcCI/BUILD/yubico-piv-tool-1.5.0/ykcs11/../tool/.libs/libpiv_util.a")
libtool: link: ar cru .libs/libykcs11.a  ykcs11.o vendors.o slot_vendors.o token_vendors.o mechanisms.o yubico_slot.o yubico_token.o utils.o openssl_utils.o objects.o  .libs/libykcs11.lax/libpiv_util.a/openssl-compat.o .libs/libykcs11.lax/libpiv_util.a/util.o 
libtool: link: ranlib .libs/libykcs11.a
libtool: link: rm -fr .libs/libykcs11.lax
libtool: link: ( cd ".libs" && rm -f "libykcs11.la" && ln -s "../libykcs11.la" "libykcs11.la" )
make[2]: Leaving directory '/tmp/B.EHjcCI/BUILD/yubico-piv-tool-1.5.0/ykcs11'
Making all in tests
make[2]: Nothing to be done for 'all'.
make[1]: Nothing to be done for 'all-am'.
+ /usr/bin/make -Otarget -j9 check
Making check in lib
Making check in .
make[2]: Nothing to be done for 'check-am'.
Making check in tests
/usr/bin/make  basic parse_key api
make[3]: Entering directory '/tmp/B.EHjcCI/BUILD/yubico-piv-tool-1.5.0/lib/tests'
x86_64-pld-linux-gcc -DPACKAGE_NAME=\"yubico-piv-tool\" -DPACKAGE_TARNAME=\"yubico-piv-tool\" -DPACKAGE_VERSION=\"1.5.0\" -DPACKAGE_STRING=\"yubico-piv-tool\ 1.5.0\" -DPACKAGE_BUGREPORT=\"\" -DPACKAGE_URL=\"\" -DPACKAGE=\"yubico-piv-tool\" -DVERSION=\"1.5.0\" -DSTDC_HEADERS=1 -DHAVE_SYS_TYPES_H=1 -DHAVE_SYS_STAT_H=1 -DHAVE_STDLIB_H=1 -DHAVE_STRING_H=1 -DHAVE_MEMORY_H=1 -DHAVE_STRINGS_H=1 -DHAVE_INTTYPES_H=1 -DHAVE_STDINT_H=1 -DHAVE_UNISTD_H=1 -DHAVE_DLFCN_H=1 -DLT_OBJDIR=\".libs/\" -DBACKEND_PCSC=1 -DYKCS11_DBG=0 -DYKCS11_DINOUT=0 -I.  -I../../lib -I../../lib -I/usr/include/openssl -pthread -I/usr/include/PCSC   -pthread -I/usr/include/openssl -O2 -fwrapv -pipe -Wformat -Werror=format-security -gdwarf-4 -fno-debug-types-section -fvar-tracking-assignments -g2 -Wp,-D_FORTIFY_SOURCE=2 -fstack-protector-strong --param=ssp-buffer-size=4 -fPIC -march=x86-64 -gdwarf-4 -fno-debug-types-section -fvar-tracking-assignments -g2  -MT basic.o -MD -MP -MF .deps/basic.Tpo -c -o basic.o basic.c
mv -f .deps/basic.Tpo .deps/basic.Po
make[3]: Leaving directory '/tmp/B.EHjcCI/BUILD/yubico-piv-tool-1.5.0/lib/tests'
make[3]: Entering directory '/tmp/B.EHjcCI/BUILD/yubico-piv-tool-1.5.0/lib/tests'
x86_64-pld-linux-gcc -DPACKAGE_NAME=\"yubico-piv-tool\" -DPACKAGE_TARNAME=\"yubico-piv-tool\" -DPACKAGE_VERSION=\"1.5.0\" -DPACKAGE_STRING=\"yubico-piv-tool\ 1.5.0\" -DPACKAGE_BUGREPORT=\"\" -DPACKAGE_URL=\"\" -DPACKAGE=\"yubico-piv-tool\" -DVERSION=\"1.5.0\" -DSTDC_HEADERS=1 -DHAVE_SYS_TYPES_H=1 -DHAVE_SYS_STAT_H=1 -DHAVE_STDLIB_H=1 -DHAVE_STRING_H=1 -DHAVE_MEMORY_H=1 -DHAVE_STRINGS_H=1 -DHAVE_INTTYPES_H=1 -DHAVE_STDINT_H=1 -DHAVE_UNISTD_H=1 -DHAVE_DLFCN_H=1 -DLT_OBJDIR=\".libs/\" -DBACKEND_PCSC=1 -DYKCS11_DBG=0 -DYKCS11_DINOUT=0 -I.  -I../../lib -I../../lib -I/usr/include/openssl -pthread -I/usr/include/PCSC   -pthread -I/usr/include/openssl -O2 -fwrapv -pipe -Wformat -Werror=format-security -gdwarf-4 -fno-debug-types-section -fvar-tracking-assignments -g2 -Wp,-D_FORTIFY_SOURCE=2 -fstack-protector-strong --param=ssp-buffer-size=4 -fPIC -march=x86-64 -gdwarf-4 -fno-debug-types-section -fvar-tracking-assignments -g2  -MT parse_key.o -MD -MP -MF .deps/parse_key.Tpo -c -o parse_key.o parse_key.c
mv -f .deps/parse_key.Tpo .deps/parse_key.Po
make[3]: Leaving directory '/tmp/B.EHjcCI/BUILD/yubico-piv-tool-1.5.0/lib/tests'
make[3]: Entering directory '/tmp/B.EHjcCI/BUILD/yubico-piv-tool-1.5.0/lib/tests'
x86_64-pld-linux-gcc -DPACKAGE_NAME=\"yubico-piv-tool\" -DPACKAGE_TARNAME=\"yubico-piv-tool\" -DPACKAGE_VERSION=\"1.5.0\" -DPACKAGE_STRING=\"yubico-piv-tool\ 1.5.0\" -DPACKAGE_BUGREPORT=\"\" -DPACKAGE_URL=\"\" -DPACKAGE=\"yubico-piv-tool\" -DVERSION=\"1.5.0\" -DSTDC_HEADERS=1 -DHAVE_SYS_TYPES_H=1 -DHAVE_SYS_STAT_H=1 -DHAVE_STDLIB_H=1 -DHAVE_STRING_H=1 -DHAVE_MEMORY_H=1 -DHAVE_STRINGS_H=1 -DHAVE_INTTYPES_H=1 -DHAVE_STDINT_H=1 -DHAVE_UNISTD_H=1 -DHAVE_DLFCN_H=1 -DLT_OBJDIR=\".libs/\" -DBACKEND_PCSC=1 -DYKCS11_DBG=0 -DYKCS11_DINOUT=0 -I.  -I../../lib -I../../lib -I/usr/include/openssl -pthread -I/usr/include/PCSC   -pthread -I/usr/include/openssl -O2 -fwrapv -pipe -Wformat -Werror=format-security -gdwarf-4 -fno-debug-types-section -fvar-tracking-assignments -g2 -Wp,-D_FORTIFY_SOURCE=2 -fstack-protector-strong --param=ssp-buffer-size=4 -fPIC -march=x86-64 -gdwarf-4 -fno-debug-types-section -fvar-tracking-assignments -g2  -MT api.o -MD -MP -MF .deps/api.Tpo -c -o api.o api.c
mv -f .deps/api.Tpo .deps/api.Po
make[3]: Leaving directory '/tmp/B.EHjcCI/BUILD/yubico-piv-tool-1.5.0/lib/tests'
make[3]: Entering directory '/tmp/B.EHjcCI/BUILD/yubico-piv-tool-1.5.0/lib/tests'
/bin/sh ../../libtool  --tag=CC   --mode=link x86_64-pld-linux-gcc  -pthread -I/usr/include/openssl -O2 -fwrapv -pipe -Wformat -Werror=format-security -gdwarf-4 -fno-debug-types-section -fvar-tracking-assignments -g2 -Wp,-D_FORTIFY_SOURCE=2 -fstack-protector-strong --param=ssp-buffer-size=4 -fPIC -march=x86-64 -gdwarf-4 -fno-debug-types-section -fvar-tracking-assignments -g2  -lcheck  -no-install -Wl,--as-needed -Wl,--no-copy-dt-needed-entries -Wl,-z,relro -Wl,-z,combreloc  -o basic basic.o ../libykpiv.la -lcrypto 
libtool: link: x86_64-pld-linux-gcc -pthread -I/usr/include/openssl -O2 -fwrapv -pipe -Wformat -Werror=format-security -gdwarf-4 -fno-debug-types-section -fvar-tracking-assignments -g2 -Wp,-D_FORTIFY_SOURCE=2 -fstack-protector-strong --param=ssp-buffer-size=4 -fPIC -march=x86-64 -gdwarf-4 -fno-debug-types-section -fvar-tracking-assignments -g2 -Wl,--as-needed -Wl,--no-copy-dt-needed-entries -Wl,-z -Wl,relro -Wl,-z -Wl,combreloc -o basic basic.o  -lcheck ../.libs/libykpiv.so -lcrypto -pthread -Wl,-rpath -Wl,/tmp/B.EHjcCI/BUILD/yubico-piv-tool-1.5.0/lib/.libs -Wl,-rpath -Wl,/usr/lib64
make[3]: Leaving directory '/tmp/B.EHjcCI/BUILD/yubico-piv-tool-1.5.0/lib/tests'
make[3]: Entering directory '/tmp/B.EHjcCI/BUILD/yubico-piv-tool-1.5.0/lib/tests'
/bin/sh ../../libtool  --tag=CC   --mode=link x86_64-pld-linux-gcc  -pthread -I/usr/include/openssl -O2 -fwrapv -pipe -Wformat -Werror=format-security -gdwarf-4 -fno-debug-types-section -fvar-tracking-assignments -g2 -Wp,-D_FORTIFY_SOURCE=2 -fstack-protector-strong --param=ssp-buffer-size=4 -fPIC -march=x86-64 -gdwarf-4 -fno-debug-types-section -fvar-tracking-assignments -g2  -lcheck  -no-install -Wl,--as-needed -Wl,--no-copy-dt-needed-entries -Wl,-z,relro -Wl,-z,combreloc  -o parse_key parse_key.o ../libykpiv.la -lcrypto 
libtool: link: x86_64-pld-linux-gcc -pthread -I/usr/include/openssl -O2 -fwrapv -pipe -Wformat -Werror=format-security -gdwarf-4 -fno-debug-types-section -fvar-tracking-assignments -g2 -Wp,-D_FORTIFY_SOURCE=2 -fstack-protector-strong --param=ssp-buffer-size=4 -fPIC -march=x86-64 -gdwarf-4 -fno-debug-types-section -fvar-tracking-assignments -g2 -Wl,--as-needed -Wl,--no-copy-dt-needed-entries -Wl,-z -Wl,relro -Wl,-z -Wl,combreloc -o parse_key parse_key.o  -lcheck ../.libs/libykpiv.so -lcrypto -pthread -Wl,-rpath -Wl,/tmp/B.EHjcCI/BUILD/yubico-piv-tool-1.5.0/lib/.libs -Wl,-rpath -Wl,/usr/lib64
make[3]: Leaving directory '/tmp/B.EHjcCI/BUILD/yubico-piv-tool-1.5.0/lib/tests'
make[3]: Entering directory '/tmp/B.EHjcCI/BUILD/yubico-piv-tool-1.5.0/lib/tests'
/bin/sh ../../libtool  --tag=CC   --mode=link x86_64-pld-linux-gcc  -pthread -I/usr/include/openssl -O2 -fwrapv -pipe -Wformat -Werror=format-security -gdwarf-4 -fno-debug-types-section -fvar-tracking-assignments -g2 -Wp,-D_FORTIFY_SOURCE=2 -fstack-protector-strong --param=ssp-buffer-size=4 -fPIC -march=x86-64 -gdwarf-4 -fno-debug-types-section -fvar-tracking-assignments -g2  -lcheck  -no-install -Wl,--as-needed -Wl,--no-copy-dt-needed-entries -Wl,-z,relro -Wl,-z,combreloc  -o api api.o ../../tool/libpiv_util.la 
libtool: link: x86_64-pld-linux-gcc -pthread -I/usr/include/openssl -O2 -fwrapv -pipe -Wformat -Werror=format-security -gdwarf-4 -fno-debug-types-section -fvar-tracking-assignments -g2 -Wp,-D_FORTIFY_SOURCE=2 -fstack-protector-strong --param=ssp-buffer-size=4 -fPIC -march=x86-64 -gdwarf-4 -fno-debug-types-section -fvar-tracking-assignments -g2 -Wl,--as-needed -Wl,--no-copy-dt-needed-entries -Wl,-z -Wl,relro -Wl,-z -Wl,combreloc -o api api.o  -lcheck ../../tool/.libs/libpiv_util.a /tmp/B.EHjcCI/BUILD/yubico-piv-tool-1.5.0/lib/.libs/libykpiv.so /usr/lib64/libpcsclite.so -ldl -lrt -lcrypto -pthread -Wl,-rpath -Wl,/tmp/B.EHjcCI/BUILD/yubico-piv-tool-1.5.0/lib/.libs -Wl,-rpath -Wl,/usr/lib64 -Wl,-rpath -Wl,/usr/lib64
make[3]: Leaving directory '/tmp/B.EHjcCI/BUILD/yubico-piv-tool-1.5.0/lib/tests'
/usr/bin/make  check-TESTS
make[4]: Entering directory '/tmp/B.EHjcCI/BUILD/yubico-piv-tool-1.5.0/lib/tests'
PASS: api
make[4]: Leaving directory '/tmp/B.EHjcCI/BUILD/yubico-piv-tool-1.5.0/lib/tests'
make[4]: Entering directory '/tmp/B.EHjcCI/BUILD/yubico-piv-tool-1.5.0/lib/tests'
PASS: basic
make[4]: Leaving directory '/tmp/B.EHjcCI/BUILD/yubico-piv-tool-1.5.0/lib/tests'
make[4]: Entering directory '/tmp/B.EHjcCI/BUILD/yubico-piv-tool-1.5.0/lib/tests'
PASS: parse_key
make[4]: Leaving directory '/tmp/B.EHjcCI/BUILD/yubico-piv-tool-1.5.0/lib/tests'
make[4]: Entering directory '/tmp/B.EHjcCI/BUILD/yubico-piv-tool-1.5.0/lib/tests'
============================================================================
Testsuite summary for yubico-piv-tool 1.5.0
============================================================================
# TOTAL: 3
# PASS:  3
# SKIP:  0
# XFAIL: 0
# FAIL:  0
# XPASS: 0
# ERROR: 0
============================================================================
make[4]: Leaving directory '/tmp/B.EHjcCI/BUILD/yubico-piv-tool-1.5.0/lib/tests'
Making check in tool
/usr/bin/make  check-recursive
Making check in .
make[3]: Nothing to be done for 'check-am'.
Making check in tests
/usr/bin/make  parse_name test_inout
make[4]: Entering directory '/tmp/B.EHjcCI/BUILD/yubico-piv-tool-1.5.0/tool/tests'
x86_64-pld-linux-gcc -DPACKAGE_NAME=\"yubico-piv-tool\" -DPACKAGE_TARNAME=\"yubico-piv-tool\" -DPACKAGE_VERSION=\"1.5.0\" -DPACKAGE_STRING=\"yubico-piv-tool\ 1.5.0\" -DPACKAGE_BUGREPORT=\"\" -DPACKAGE_URL=\"\" -DPACKAGE=\"yubico-piv-tool\" -DVERSION=\"1.5.0\" -DSTDC_HEADERS=1 -DHAVE_SYS_TYPES_H=1 -DHAVE_SYS_STAT_H=1 -DHAVE_STDLIB_H=1 -DHAVE_STRING_H=1 -DHAVE_MEMORY_H=1 -DHAVE_STRINGS_H=1 -DHAVE_INTTYPES_H=1 -DHAVE_STDINT_H=1 -DHAVE_UNISTD_H=1 -DHAVE_DLFCN_H=1 -DLT_OBJDIR=\".libs/\" -DBACKEND_PCSC=1 -DYKCS11_DBG=0 -DYKCS11_DINOUT=0 -I.  -I../../lib -I../../lib -I../../tool -I../../tool -I/usr/include/openssl   -pthread -O2 -fwrapv -pipe -Wformat -Werror=format-security -gdwarf-4 -fno-debug-types-section -fvar-tracking-assignments -g2 -Wp,-D_FORTIFY_SOURCE=2 -fstack-protector-strong --param=ssp-buffer-size=4 -fPIC -march=x86-64 -gdwarf-4 -fno-debug-types-section -fvar-tracking-assignments -g2  -MT parse_name.o -MD -MP -MF .deps/parse_name.Tpo -c -o parse_name.o parse_name.c
mv -f .deps/parse_name.Tpo .deps/parse_name.Po
make[4]: Leaving directory '/tmp/B.EHjcCI/BUILD/yubico-piv-tool-1.5.0/tool/tests'
make[4]: Entering directory '/tmp/B.EHjcCI/BUILD/yubico-piv-tool-1.5.0/tool/tests'
x86_64-pld-linux-gcc -DPACKAGE_NAME=\"yubico-piv-tool\" -DPACKAGE_TARNAME=\"yubico-piv-tool\" -DPACKAGE_VERSION=\"1.5.0\" -DPACKAGE_STRING=\"yubico-piv-tool\ 1.5.0\" -DPACKAGE_BUGREPORT=\"\" -DPACKAGE_URL=\"\" -DPACKAGE=\"yubico-piv-tool\" -DVERSION=\"1.5.0\" -DSTDC_HEADERS=1 -DHAVE_SYS_TYPES_H=1 -DHAVE_SYS_STAT_H=1 -DHAVE_STDLIB_H=1 -DHAVE_STRING_H=1 -DHAVE_MEMORY_H=1 -DHAVE_STRINGS_H=1 -DHAVE_INTTYPES_H=1 -DHAVE_STDINT_H=1 -DHAVE_UNISTD_H=1 -DHAVE_DLFCN_H=1 -DLT_OBJDIR=\".libs/\" -DBACKEND_PCSC=1 -DYKCS11_DBG=0 -DYKCS11_DINOUT=0 -I.  -I../../lib -I../../lib -I../../tool -I../../tool -I/usr/include/openssl   -pthread -O2 -fwrapv -pipe -Wformat -Werror=format-security -gdwarf-4 -fno-debug-types-section -fvar-tracking-assignments -g2 -Wp,-D_FORTIFY_SOURCE=2 -fstack-protector-strong --param=ssp-buffer-size=4 -fPIC -march=x86-64 -gdwarf-4 -fno-debug-types-section -fvar-tracking-assignments -g2  -MT test_inout.o -MD -MP -MF .deps/test_inout.Tpo -c -o test_inout.o test_inout.c
mv -f .deps/test_inout.Tpo .deps/test_inout.Po
make[4]: Leaving directory '/tmp/B.EHjcCI/BUILD/yubico-piv-tool-1.5.0/tool/tests'
make[4]: Entering directory '/tmp/B.EHjcCI/BUILD/yubico-piv-tool-1.5.0/tool/tests'
/bin/sh ../../libtool  --tag=CC   --mode=link x86_64-pld-linux-gcc  -pthread -O2 -fwrapv -pipe -Wformat -Werror=format-security -gdwarf-4 -fno-debug-types-section -fvar-tracking-assignments -g2 -Wp,-D_FORTIFY_SOURCE=2 -fstack-protector-strong --param=ssp-buffer-size=4 -fPIC -march=x86-64 -gdwarf-4 -fno-debug-types-section -fvar-tracking-assignments -g2  -lcheck  -no-install  -Wl,--as-needed -Wl,--no-copy-dt-needed-entries -Wl,-z,relro -Wl,-z,combreloc  -o parse_name parse_name.o ../libpiv_util.la -lcrypto 
libtool: link: x86_64-pld-linux-gcc -pthread -O2 -fwrapv -pipe -Wformat -Werror=format-security -gdwarf-4 -fno-debug-types-section -fvar-tracking-assignments -g2 -Wp,-D_FORTIFY_SOURCE=2 -fstack-protector-strong --param=ssp-buffer-size=4 -fPIC -march=x86-64 -gdwarf-4 -fno-debug-types-section -fvar-tracking-assignments -g2 -Wl,--as-needed -Wl,--no-copy-dt-needed-entries -Wl,-z -Wl,relro -Wl,-z -Wl,combreloc -o parse_name parse_name.o  -lcheck ../.libs/libpiv_util.a /tmp/B.EHjcCI/BUILD/yubico-piv-tool-1.5.0/lib/.libs/libykpiv.so /usr/lib64/libpcsclite.so -ldl -lrt -lcrypto -pthread -Wl,-rpath -Wl,/tmp/B.EHjcCI/BUILD/yubico-piv-tool-1.5.0/lib/.libs -Wl,-rpath -Wl,/usr/lib64 -Wl,-rpath -Wl,/usr/lib64
make[4]: Leaving directory '/tmp/B.EHjcCI/BUILD/yubico-piv-tool-1.5.0/tool/tests'
make[4]: Entering directory '/tmp/B.EHjcCI/BUILD/yubico-piv-tool-1.5.0/tool/tests'
/bin/sh ../../libtool  --tag=CC   --mode=link x86_64-pld-linux-gcc  -pthread -O2 -fwrapv -pipe -Wformat -Werror=format-security -gdwarf-4 -fno-debug-types-section -fvar-tracking-assignments -g2 -Wp,-D_FORTIFY_SOURCE=2 -fstack-protector-strong --param=ssp-buffer-size=4 -fPIC -march=x86-64 -gdwarf-4 -fno-debug-types-section -fvar-tracking-assignments -g2  -lcheck  -no-install  -Wl,--as-needed -Wl,--no-copy-dt-needed-entries -Wl,-z,relro -Wl,-z,combreloc  -o test_inout test_inout.o ../libpiv_util.la 
libtool: link: x86_64-pld-linux-gcc -pthread -O2 -fwrapv -pipe -Wformat -Werror=format-security -gdwarf-4 -fno-debug-types-section -fvar-tracking-assignments -g2 -Wp,-D_FORTIFY_SOURCE=2 -fstack-protector-strong --param=ssp-buffer-size=4 -fPIC -march=x86-64 -gdwarf-4 -fno-debug-types-section -fvar-tracking-assignments -g2 -Wl,--as-needed -Wl,--no-copy-dt-needed-entries -Wl,-z -Wl,relro -Wl,-z -Wl,combreloc -o test_inout test_inout.o  -lcheck ../.libs/libpiv_util.a /tmp/B.EHjcCI/BUILD/yubico-piv-tool-1.5.0/lib/.libs/libykpiv.so /usr/lib64/libpcsclite.so -ldl -lrt -lcrypto -pthread -Wl,-rpath -Wl,/tmp/B.EHjcCI/BUILD/yubico-piv-tool-1.5.0/lib/.libs -Wl,-rpath -Wl,/usr/lib64 -Wl,-rpath -Wl,/usr/lib64
make[4]: Leaving directory '/tmp/B.EHjcCI/BUILD/yubico-piv-tool-1.5.0/tool/tests'
/usr/bin/make  check-TESTS
make[5]: Entering directory '/tmp/B.EHjcCI/BUILD/yubico-piv-tool-1.5.0/tool/tests'
PASS: test_inout
make[5]: Leaving directory '/tmp/B.EHjcCI/BUILD/yubico-piv-tool-1.5.0/tool/tests'
make[5]: Entering directory '/tmp/B.EHjcCI/BUILD/yubico-piv-tool-1.5.0/tool/tests'
FAIL: basic.sh
make[5]: Leaving directory '/tmp/B.EHjcCI/BUILD/yubico-piv-tool-1.5.0/tool/tests'
make[5]: Entering directory '/tmp/B.EHjcCI/BUILD/yubico-piv-tool-1.5.0/tool/tests'
PASS: parse_name
make[5]: Leaving directory '/tmp/B.EHjcCI/BUILD/yubico-piv-tool-1.5.0/tool/tests'
make[5]: Entering directory '/tmp/B.EHjcCI/BUILD/yubico-piv-tool-1.5.0/tool/tests'
============================================================================
Testsuite summary for yubico-piv-tool 1.5.0
============================================================================
# TOTAL: 3
# PASS:  2
# SKIP:  0
# XFAIL: 0
# FAIL:  1
# XPASS: 0
# ERROR: 0
============================================================================
See tool/tests/test-suite.log
============================================================================
make[5]: *** [Makefile:748: test-suite.log] Error 1
make[5]: Leaving directory '/tmp/B.EHjcCI/BUILD/yubico-piv-tool-1.5.0/tool/tests'
make[4]: *** [Makefile:856: check-TESTS] Error 2
make[3]: *** [Makefile:941: check-am] Error 2
make[2]: *** [Makefile:681: check-recursive] Error 1
make[1]: *** [Makefile:830: check] Error 2
make: *** [Makefile:470: check-recursive] Error 1
error: Bad exit status from /tmp/B.EHjcCI/BUILD/tmp/rpm-tmp.77720 (%build)


RPM build errors:
    Bad exit status from /tmp/B.EHjcCI/BUILD/tmp/rpm-tmp.77720 (%build)
ended at: Fri May 25 22:55:21 2018, done in 0:00:11.715242
error: No files produced.
mesg: ttyname failed: Inappropriate ioctl for device
+ chmod -R u+rwX /tmp/B.EHjcCI/BUILD
+ rm -rf /tmp/B.EHjcCI/tmp /tmp/B.EHjcCI/BUILD
mesg: ttyname failed: Inappropriate ioctl for device
+ rm -rf /tmp/B.EHjcCI
Begin-PLD-Builder-Info
Build-Time: user:16.87s sys:3.50s real:14.91s (faults io:2 non-io:2017651)

End-PLD-Builder-Info
[Back to list of logs] [View rpm -qa of builder]