FailedOk

th/SRPMS[OK]
th/x32[OK]
th/i686[OK]
th/x86_64[OK]

ac/SRPMS[OK]
ac/i386[OK]
ac/i586[OK]
ac/i686[OK]
ac/alpha[OK]
ac/amd64[OK]
ac/athlon[OK]
ac/ppc[OK]
ac/sparc[OK]
ac/sparc64[OK]

Advanced Search
main()
Powered by PLD Linux
(c) 2002-2018 PLD Team
$Revision: 1.37 $
Powered by KDE.
Your IP: 54.235.48.106

zfs 1ea0ad41-3acf-4d72-b666-e72181e76eea

Status:Failed
Source URL:ftp://buildlogs.pld-linux.org/th/x86_64/FAIL/zfs,1ea0ad41-3acf-4d72-b666-e72181e76eea.bz2
text/plain URL:View!
full text:View!
rpm -qa of builder:View!
Date:2018/10/26 01:02:53
Runtime:0:06:19.750339

Toc:

  • error 1
  • ./include/linux/blk-cgroup.h:402:15: error: passing argument 1 of 'refcount_inc' from incompatible pointer type [-Werror=incompatible-pointer-types]
  • error 2
  • ./include/linux/blk-cgroup.h:417:28: error: passing argument 1 of 'refcount_dec_and_test' from incompatible pointer type [-Werror=incompatible-pointer-types]
  • error 3
  • make[5]: *** [scripts/Makefile.build:305: /tmp/B.OMWNgN/BUILD/zfs-0.7.9/module/zfs/abd.o] Error 1
  • error 4
  • ./include/linux/blk-cgroup.h:402:15: error: passing argument 1 of 'refcount_inc' from incompatible pointer type [-Werror=incompatible-pointer-types]
  • error 5
  • ./include/linux/blk-cgroup.h:417:28: error: passing argument 1 of 'refcount_dec_and_test' from incompatible pointer type [-Werror=incompatible-pointer-types]
  • error 6
  • make[5]: *** [scripts/Makefile.build:305: /tmp/B.OMWNgN/BUILD/zfs-0.7.9/module/zcommon/zfs_deleg.o] Error 1
  • error 7
  • make[4]: *** [scripts/Makefile.build:546: /tmp/B.OMWNgN/BUILD/zfs-0.7.9/module/zcommon] Error 2
  • error 8
  • ./include/linux/blk-cgroup.h:402:15: error: passing argument 1 of 'refcount_inc' from incompatible pointer type [-Werror=incompatible-pointer-types]
  • error 9
  • ./include/linux/blk-cgroup.h:417:28: error: passing argument 1 of 'refcount_dec_and_test' from incompatible pointer type [-Werror=incompatible-pointer-types]
  • error 10
  • make[5]: *** [scripts/Makefile.build:305: /tmp/B.OMWNgN/BUILD/zfs-0.7.9/module/zfs/arc.o] Error 1
  • error 11
  • make[4]: *** [scripts/Makefile.build:546: /tmp/B.OMWNgN/BUILD/zfs-0.7.9/module/zfs] Error 2
  • error 12
  • make[3]: *** [Makefile:1517: _module_/tmp/B.OMWNgN/BUILD/zfs-0.7.9/module] Error 2
  • error 13
  • make[2]: *** [Makefile:30: modules] Error 2
  • error 14
  • make[1]: *** [Makefile:782: all-recursive] Error 1
  • error 15
  • error: Bad exit status from /tmp/B.OMWNgN/BUILD/tmp/rpm-tmp.33040 (%build)
  • error 16
  • RPM build errors:
  • error 17
  • error: No files produced.

Content:

make[2]: Entering directory '/tmp/B.OMWNgN/BUILD/zfs-0.7.9/rpm/redhat'
rm -f *.lo
make[2]: Leaving directory '/tmp/B.OMWNgN/BUILD/zfs-0.7.9/rpm/redhat'
make[2]: Entering directory '/tmp/B.OMWNgN/BUILD/zfs-0.7.9/rpm'
rm -rf .libs _libs
make[2]: Leaving directory '/tmp/B.OMWNgN/BUILD/zfs-0.7.9/rpm'
make[2]: Entering directory '/tmp/B.OMWNgN/BUILD/zfs-0.7.9/rpm'
rm -f *.lo
make[2]: Leaving directory '/tmp/B.OMWNgN/BUILD/zfs-0.7.9/rpm'
Making clean in scripts
make[1]: Entering directory '/tmp/B.OMWNgN/BUILD/zfs-0.7.9/scripts'
rm -rf .libs _libs
make[1]: Leaving directory '/tmp/B.OMWNgN/BUILD/zfs-0.7.9/scripts'
make[1]: Entering directory '/tmp/B.OMWNgN/BUILD/zfs-0.7.9/scripts'
rm -f common.sh
make[1]: Leaving directory '/tmp/B.OMWNgN/BUILD/zfs-0.7.9/scripts'
make[1]: Entering directory '/tmp/B.OMWNgN/BUILD/zfs-0.7.9/scripts'
rm -f *.lo
make[1]: Leaving directory '/tmp/B.OMWNgN/BUILD/zfs-0.7.9/scripts'
Making clean in module
/usr/bin/make -C /usr/src/linux SUBDIRS=`pwd`  clean
make[1]: Entering directory '/tmp/B.OMWNgN/BUILD/zfs-0.7.9/module'
if [ -f Module.symvers ]; then rm -f Module.symvers; fi
if [ -f Module.markers ]; then rm -f Module.markers; fi
find . -name '*.ur-safe' -type f -print | xargs rm -f
make[1]: Leaving directory '/tmp/B.OMWNgN/BUILD/zfs-0.7.9/module'
make[1]: Entering directory '/tmp/B.OMWNgN/BUILD/zfs-0.7.9'
rm -rf .libs _libs
make[1]: Leaving directory '/tmp/B.OMWNgN/BUILD/zfs-0.7.9'
make[1]: Entering directory '/tmp/B.OMWNgN/BUILD/zfs-0.7.9'
rm -f *.lo
make[1]: Leaving directory '/tmp/B.OMWNgN/BUILD/zfs-0.7.9'
+ /usr/bin/make -Otarget -j9
/usr/bin/make  all-recursive
Making all in include
Making all in linux
make[3]: Nothing to be done for 'all'.
Making all in spl
Making all in rpc
make[4]: Nothing to be done for 'all'.
Making all in sys
make[4]: Nothing to be done for 'all'.
make[4]: Nothing to be done for 'all-am'.
Making all in sys
Making all in fm
Making all in fs
make[5]: Nothing to be done for 'all'.
make[5]: Nothing to be done for 'all-am'.
Making all in fs
make[4]: Nothing to be done for 'all'.
Making all in crypto
make[4]: Nothing to be done for 'all'.
Making all in lua
make[4]: Nothing to be done for 'all'.
Making all in sysevent
make[4]: Nothing to be done for 'all'.
make[4]: Nothing to be done for 'all-am'.
make[3]: Nothing to be done for 'all-am'.
Making all in rpm
Making all in generic
make[3]: Nothing to be done for 'all'.
Making all in redhat
make[3]: Nothing to be done for 'all'.
make[3]: Nothing to be done for 'all-am'.
Making all in scripts
make[2]: Entering directory '/tmp/B.OMWNgN/BUILD/zfs-0.7.9/scripts'
/bin/sed -e '\|^export BIN_DIR=|s|$|/tmp/B.OMWNgN/BUILD/zfs-0.7.9/bin|' \
	-e '\|^export SBIN_DIR=|s|$|/tmp/B.OMWNgN/BUILD/zfs-0.7.9/bin|' \
	-e '\|^export ZTS_DIR=|s|$|/tmp/B.OMWNgN/BUILD/zfs-0.7.9/tests|' \
	-e '\|^export SCRIPT_DIR=|s|$|/tmp/B.OMWNgN/BUILD/zfs-0.7.9/scripts|' \
	common.sh.in >common.sh
echo "$EXTRA_ENVIRONMENT" >>common.sh
make[2]: Leaving directory '/tmp/B.OMWNgN/BUILD/zfs-0.7.9/scripts'
Making all in module
list='icp lua'; for targetdir in $list; do \
	/usr/bin/make -C $targetdir; \
done
make[3]: Entering directory '/tmp/B.OMWNgN/BUILD/zfs-0.7.9/module/icp'
mkdir -p api core spi io os algs algs/aes algs/edonr algs/modes algs/sha1 algs/sha2 algs/skein asm-x86_64 asm-x86_64/aes asm-x86_64/modes asm-x86_64/sha1 asm-x86_64/sha2 asm-i386 asm-generic
make[3]: Leaving directory '/tmp/B.OMWNgN/BUILD/zfs-0.7.9/module/icp'
make[3]: Entering directory '/tmp/B.OMWNgN/BUILD/zfs-0.7.9/module/lua'
mkdir -p setjmp
make[3]: Leaving directory '/tmp/B.OMWNgN/BUILD/zfs-0.7.9/module/lua'
/usr/bin/make -C /usr/src/linux SUBDIRS=`pwd`  CONFIG_ZFS=m modules
  CC [M]  /tmp/B.OMWNgN/BUILD/zfs-0.7.9/module/spl/spl-atomic.o
  CC [M]  /tmp/B.OMWNgN/BUILD/zfs-0.7.9/module/zcommon/zfeature_common.o
  CC [M]  /tmp/B.OMWNgN/BUILD/zfs-0.7.9/module/avl/avl.o
  LD [M]  /tmp/B.OMWNgN/BUILD/zfs-0.7.9/module/avl/zavl.o
  CC [M]  /tmp/B.OMWNgN/BUILD/zfs-0.7.9/module/icp/illumos-crypto.o
  CC [M]  /tmp/B.OMWNgN/BUILD/zfs-0.7.9/module/zfs/aggsum.o
  CC [M]  /tmp/B.OMWNgN/BUILD/zfs-0.7.9/module/spl/spl-condvar.o
  CC [M]  /tmp/B.OMWNgN/BUILD/zfs-0.7.9/module/zfs/abd.o
In file included from ./include/linux/backing-dev.h:17,
                 from /tmp/B.OMWNgN/BUILD/zfs-0.7.9/include/linux/blkdev_compat.h:34,
                 from /tmp/B.OMWNgN/BUILD/zfs-0.7.9/include/sys/dmu.h:829,
                 from /tmp/B.OMWNgN/BUILD/zfs-0.7.9/include/sys/spa.h:43,
                 from /tmp/B.OMWNgN/BUILD/zfs-0.7.9/include/sys/zio.h:36,
                 from /tmp/B.OMWNgN/BUILD/zfs-0.7.9/module/zfs/abd.c:119:
./include/linux/blk-cgroup.h: In function 'blkcg_cgwb_get':
./include/linux/blk-cgroup.h:402:15: error: passing argument 1 of 'refcount_inc' from incompatible pointer type [-Werror=incompatible-pointer-types]
  refcount_inc(&blkcg->cgwb_refcnt);
               ^~~~~~~~~~~~~~~~~~~
In file included from ./include/linux/refcount.h:72,
                 from ./include/linux/kref.h:19,
                 from ./include/linux/kobject.h:23,
                 from ./include/linux/module.h:17,
                 from /tmp/B.OMWNgN/BUILD/zfs-0.7.9/include/spl/sys/atomic.h:28,
                 from /tmp/B.OMWNgN/BUILD/zfs-0.7.9/include/sys/zfs_context.h:35,
                 from /tmp/B.OMWNgN/BUILD/zfs-0.7.9/include/sys/refcount.h:31,
                 from /tmp/B.OMWNgN/BUILD/zfs-0.7.9/include/sys/abd.h:31,
                 from /tmp/B.OMWNgN/BUILD/zfs-0.7.9/module/zfs/abd.c:117:
./arch/x86/include/asm/refcount.h:51:54: note: expected 'refcount_t *' {aka 'struct refcount_struct *'} but argument is of type 'zfs_refcount_t *' {aka 'struct refcount *'}
 static __always_inline void refcount_inc(refcount_t *r)
                                          ~~~~~~~~~~~~^
In file included from ./include/linux/backing-dev.h:17,
                 from /tmp/B.OMWNgN/BUILD/zfs-0.7.9/include/linux/blkdev_compat.h:34,
                 from /tmp/B.OMWNgN/BUILD/zfs-0.7.9/include/sys/dmu.h:829,
                 from /tmp/B.OMWNgN/BUILD/zfs-0.7.9/include/sys/spa.h:43,
                 from /tmp/B.OMWNgN/BUILD/zfs-0.7.9/include/sys/zio.h:36,
                 from /tmp/B.OMWNgN/BUILD/zfs-0.7.9/module/zfs/abd.c:119:
./include/linux/blk-cgroup.h: In function 'blkcg_cgwb_put':
./include/linux/blk-cgroup.h:417:28: error: passing argument 1 of 'refcount_dec_and_test' from incompatible pointer type [-Werror=incompatible-pointer-types]
  if (refcount_dec_and_test(&blkcg->cgwb_refcnt))
                            ^~~~~~~~~~~~~~~~~~~
In file included from ./include/linux/refcount.h:72,
                 from ./include/linux/kref.h:19,
                 from ./include/linux/kobject.h:23,
                 from ./include/linux/module.h:17,
                 from /tmp/B.OMWNgN/BUILD/zfs-0.7.9/include/spl/sys/atomic.h:28,
                 from /tmp/B.OMWNgN/BUILD/zfs-0.7.9/include/sys/zfs_context.h:35,
                 from /tmp/B.OMWNgN/BUILD/zfs-0.7.9/include/sys/refcount.h:31,
                 from /tmp/B.OMWNgN/BUILD/zfs-0.7.9/include/sys/abd.h:31,
                 from /tmp/B.OMWNgN/BUILD/zfs-0.7.9/module/zfs/abd.c:117:
./arch/x86/include/asm/refcount.h:74:76: note: expected 'refcount_t *' {aka 'struct refcount_struct *'} but argument is of type 'zfs_refcount_t *' {aka 'struct refcount *'}
 static __always_inline __must_check bool refcount_dec_and_test(refcount_t *r)
                                                                ~~~~~~~~~~~~^
cc1: some warnings being treated as errors
make[5]: *** [scripts/Makefile.build:305: /tmp/B.OMWNgN/BUILD/zfs-0.7.9/module/zfs/abd.o] Error 1
make[5]: *** Waiting for unfinished jobs....
  CC [M]  /tmp/B.OMWNgN/BUILD/zfs-0.7.9/module/zcommon/zfs_deleg.o
In file included from ./include/linux/backing-dev.h:17,
                 from /tmp/B.OMWNgN/BUILD/zfs-0.7.9/include/linux/blkdev_compat.h:34,
                 from /tmp/B.OMWNgN/BUILD/zfs-0.7.9/include/sys/dmu.h:829,
                 from /tmp/B.OMWNgN/BUILD/zfs-0.7.9/include/sys/dsl_deleg.h:29,
                 from /tmp/B.OMWNgN/BUILD/zfs-0.7.9/module/zcommon/zfs_deleg.c:40:
./include/linux/blk-cgroup.h: In function 'blkcg_cgwb_get':
./include/linux/blk-cgroup.h:402:15: error: passing argument 1 of 'refcount_inc' from incompatible pointer type [-Werror=incompatible-pointer-types]
  refcount_inc(&blkcg->cgwb_refcnt);
               ^~~~~~~~~~~~~~~~~~~
In file included from ./include/linux/refcount.h:72,
                 from ./include/linux/kref.h:19,
                 from ./include/linux/kobject.h:23,
                 from ./include/linux/module.h:17,
                 from /tmp/B.OMWNgN/BUILD/zfs-0.7.9/include/spl/sys/atomic.h:28,
                 from /tmp/B.OMWNgN/BUILD/zfs-0.7.9/include/sys/zfs_context.h:35,
                 from /tmp/B.OMWNgN/BUILD/zfs-0.7.9/module/zcommon/zfs_deleg.c:28:
./arch/x86/include/asm/refcount.h:51:54: note: expected 'refcount_t *' {aka 'struct refcount_struct *'} but argument is of type 'zfs_refcount_t *' {aka 'struct refcount *'}
 static __always_inline void refcount_inc(refcount_t *r)
                                          ~~~~~~~~~~~~^
In file included from ./include/linux/backing-dev.h:17,
                 from /tmp/B.OMWNgN/BUILD/zfs-0.7.9/include/linux/blkdev_compat.h:34,
                 from /tmp/B.OMWNgN/BUILD/zfs-0.7.9/include/sys/dmu.h:829,
                 from /tmp/B.OMWNgN/BUILD/zfs-0.7.9/include/sys/dsl_deleg.h:29,
                 from /tmp/B.OMWNgN/BUILD/zfs-0.7.9/module/zcommon/zfs_deleg.c:40:
./include/linux/blk-cgroup.h: In function 'blkcg_cgwb_put':
./include/linux/blk-cgroup.h:417:28: error: passing argument 1 of 'refcount_dec_and_test' from incompatible pointer type [-Werror=incompatible-pointer-types]
  if (refcount_dec_and_test(&blkcg->cgwb_refcnt))
                            ^~~~~~~~~~~~~~~~~~~
In file included from ./include/linux/refcount.h:72,
                 from ./include/linux/kref.h:19,
                 from ./include/linux/kobject.h:23,
                 from ./include/linux/module.h:17,
                 from /tmp/B.OMWNgN/BUILD/zfs-0.7.9/include/spl/sys/atomic.h:28,
                 from /tmp/B.OMWNgN/BUILD/zfs-0.7.9/include/sys/zfs_context.h:35,
                 from /tmp/B.OMWNgN/BUILD/zfs-0.7.9/module/zcommon/zfs_deleg.c:28:
./arch/x86/include/asm/refcount.h:74:76: note: expected 'refcount_t *' {aka 'struct refcount_struct *'} but argument is of type 'zfs_refcount_t *' {aka 'struct refcount *'}
 static __always_inline __must_check bool refcount_dec_and_test(refcount_t *r)
                                                                ~~~~~~~~~~~~^
cc1: some warnings being treated as errors
make[5]: *** [scripts/Makefile.build:305: /tmp/B.OMWNgN/BUILD/zfs-0.7.9/module/zcommon/zfs_deleg.o] Error 1
make[5]: *** Waiting for unfinished jobs....
  CC [M]  /tmp/B.OMWNgN/BUILD/zfs-0.7.9/module/lua/lapi.o
  CC [M]  /tmp/B.OMWNgN/BUILD/zfs-0.7.9/module/zcommon/zfs_comutil.o
make[4]: *** [scripts/Makefile.build:546: /tmp/B.OMWNgN/BUILD/zfs-0.7.9/module/zcommon] Error 2
make[4]: *** Waiting for unfinished jobs....
  CC [M]  /tmp/B.OMWNgN/BUILD/zfs-0.7.9/module/spl/spl-cred.o
  CC [M]  /tmp/B.OMWNgN/BUILD/zfs-0.7.9/module/nvpair/nvpair.o
  CC [M]  /tmp/B.OMWNgN/BUILD/zfs-0.7.9/module/icp/api/kcf_cipher.o
  CC [M]  /tmp/B.OMWNgN/BUILD/zfs-0.7.9/module/unicode/u8_textprep.o
  CC [M]  /tmp/B.OMWNgN/BUILD/zfs-0.7.9/module/spl/spl-err.o
  CC [M]  /tmp/B.OMWNgN/BUILD/zfs-0.7.9/module/lua/lauxlib.o
  CC [M]  /tmp/B.OMWNgN/BUILD/zfs-0.7.9/module/lua/lbaselib.o
  CC [M]  /tmp/B.OMWNgN/BUILD/zfs-0.7.9/module/nvpair/fnvpair.o
  CC [M]  /tmp/B.OMWNgN/BUILD/zfs-0.7.9/module/spl/spl-generic.o
  CC [M]  /tmp/B.OMWNgN/BUILD/zfs-0.7.9/module/icp/api/kcf_digest.o
  CC [M]  /tmp/B.OMWNgN/BUILD/zfs-0.7.9/module/icp/api/kcf_mac.o
  CC [M]  /tmp/B.OMWNgN/BUILD/zfs-0.7.9/module/unicode/uconv.o
  LD [M]  /tmp/B.OMWNgN/BUILD/zfs-0.7.9/module/unicode/zunicode.o
  CC [M]  /tmp/B.OMWNgN/BUILD/zfs-0.7.9/module/nvpair/nvpair_alloc_spl.o
  CC [M]  /tmp/B.OMWNgN/BUILD/zfs-0.7.9/module/spl/spl-kmem.o
  CC [M]  /tmp/B.OMWNgN/BUILD/zfs-0.7.9/module/lua/lcode.o
  CC [M]  /tmp/B.OMWNgN/BUILD/zfs-0.7.9/module/lua/lcompat.o
  CC [M]  /tmp/B.OMWNgN/BUILD/zfs-0.7.9/module/zfs/arc.o
In file included from ./include/linux/backing-dev.h:17,
                 from /tmp/B.OMWNgN/BUILD/zfs-0.7.9/include/linux/blkdev_compat.h:34,
                 from /tmp/B.OMWNgN/BUILD/zfs-0.7.9/include/sys/dmu.h:829,
                 from /tmp/B.OMWNgN/BUILD/zfs-0.7.9/include/sys/spa.h:43,
                 from /tmp/B.OMWNgN/BUILD/zfs-0.7.9/module/zfs/arc.c:278:
./include/linux/blk-cgroup.h: In function 'blkcg_cgwb_get':
./include/linux/blk-cgroup.h:402:15: error: passing argument 1 of 'refcount_inc' from incompatible pointer type [-Werror=incompatible-pointer-types]
  refcount_inc(&blkcg->cgwb_refcnt);
               ^~~~~~~~~~~~~~~~~~~
In file included from ./include/linux/refcount.h:72,
                 from ./include/linux/kref.h:19,
                 from ./include/linux/kobject.h:23,
                 from ./include/linux/module.h:17,
                 from /tmp/B.OMWNgN/BUILD/zfs-0.7.9/include/spl/sys/atomic.h:28,
                 from /tmp/B.OMWNgN/BUILD/zfs-0.7.9/include/sys/zfs_context.h:35,
                 from /tmp/B.OMWNgN/BUILD/zfs-0.7.9/include/sys/spa.h:36,
                 from /tmp/B.OMWNgN/BUILD/zfs-0.7.9/module/zfs/arc.c:278:
./arch/x86/include/asm/refcount.h:51:54: note: expected 'refcount_t *' {aka 'struct refcount_struct *'} but argument is of type 'zfs_refcount_t *' {aka 'struct refcount *'}
 static __always_inline void refcount_inc(refcount_t *r)
                                          ~~~~~~~~~~~~^
In file included from ./include/linux/backing-dev.h:17,
                 from /tmp/B.OMWNgN/BUILD/zfs-0.7.9/include/linux/blkdev_compat.h:34,
                 from /tmp/B.OMWNgN/BUILD/zfs-0.7.9/include/sys/dmu.h:829,
                 from /tmp/B.OMWNgN/BUILD/zfs-0.7.9/include/sys/spa.h:43,
                 from /tmp/B.OMWNgN/BUILD/zfs-0.7.9/module/zfs/arc.c:278:
./include/linux/blk-cgroup.h: In function 'blkcg_cgwb_put':
./include/linux/blk-cgroup.h:417:28: error: passing argument 1 of 'refcount_dec_and_test' from incompatible pointer type [-Werror=incompatible-pointer-types]
  if (refcount_dec_and_test(&blkcg->cgwb_refcnt))
                            ^~~~~~~~~~~~~~~~~~~
In file included from ./include/linux/refcount.h:72,
                 from ./include/linux/kref.h:19,
                 from ./include/linux/kobject.h:23,
                 from ./include/linux/module.h:17,
                 from /tmp/B.OMWNgN/BUILD/zfs-0.7.9/include/spl/sys/atomic.h:28,
                 from /tmp/B.OMWNgN/BUILD/zfs-0.7.9/include/sys/zfs_context.h:35,
                 from /tmp/B.OMWNgN/BUILD/zfs-0.7.9/include/sys/spa.h:36,
                 from /tmp/B.OMWNgN/BUILD/zfs-0.7.9/module/zfs/arc.c:278:
./arch/x86/include/asm/refcount.h:74:76: note: expected 'refcount_t *' {aka 'struct refcount_struct *'} but argument is of type 'zfs_refcount_t *' {aka 'struct refcount *'}
 static __always_inline __must_check bool refcount_dec_and_test(refcount_t *r)
                                                                ~~~~~~~~~~~~^
cc1: some warnings being treated as errors
make[5]: *** [scripts/Makefile.build:305: /tmp/B.OMWNgN/BUILD/zfs-0.7.9/module/zfs/arc.o] Error 1
make[4]: *** [scripts/Makefile.build:546: /tmp/B.OMWNgN/BUILD/zfs-0.7.9/module/zfs] Error 2
  CC [M]  /tmp/B.OMWNgN/BUILD/zfs-0.7.9/module/nvpair/nvpair_alloc_fixed.o
  LD [M]  /tmp/B.OMWNgN/BUILD/zfs-0.7.9/module/nvpair/znvpair.o
  CC [M]  /tmp/B.OMWNgN/BUILD/zfs-0.7.9/module/icp/api/kcf_miscapi.o
  CC [M]  /tmp/B.OMWNgN/BUILD/zfs-0.7.9/module/spl/spl-kobj.o
  CC [M]  /tmp/B.OMWNgN/BUILD/zfs-0.7.9/module/spl/spl-kmem-cache.o
  CC [M]  /tmp/B.OMWNgN/BUILD/zfs-0.7.9/module/spl/spl-mutex.o
  CC [M]  /tmp/B.OMWNgN/BUILD/zfs-0.7.9/module/lua/lctype.o
  CC [M]  /tmp/B.OMWNgN/BUILD/zfs-0.7.9/module/spl/spl-kstat.o
  CC [M]  /tmp/B.OMWNgN/BUILD/zfs-0.7.9/module/spl/spl-proc.o
  CC [M]  /tmp/B.OMWNgN/BUILD/zfs-0.7.9/module/icp/api/kcf_ctxops.o
  CC [M]  /tmp/B.OMWNgN/BUILD/zfs-0.7.9/module/icp/core/kcf_prov_tabs.o
  CC [M]  /tmp/B.OMWNgN/BUILD/zfs-0.7.9/module/lua/lcorolib.o
  CC [M]  /tmp/B.OMWNgN/BUILD/zfs-0.7.9/module/lua/ldebug.o
  CC [M]  /tmp/B.OMWNgN/BUILD/zfs-0.7.9/module/lua/ldo.o
  CC [M]  /tmp/B.OMWNgN/BUILD/zfs-0.7.9/module/lua/lfunc.o
  CC [M]  /tmp/B.OMWNgN/BUILD/zfs-0.7.9/module/spl/spl-rwlock.o
  CC [M]  /tmp/B.OMWNgN/BUILD/zfs-0.7.9/module/icp/core/kcf_callprov.o
  CC [M]  /tmp/B.OMWNgN/BUILD/zfs-0.7.9/module/icp/core/kcf_sched.o
  CC [M]  /tmp/B.OMWNgN/BUILD/zfs-0.7.9/module/icp/core/kcf_prov_lib.o
  CC [M]  /tmp/B.OMWNgN/BUILD/zfs-0.7.9/module/icp/core/kcf_mech_tabs.o
  CC [M]  /tmp/B.OMWNgN/BUILD/zfs-0.7.9/module/lua/llex.o
  CC [M]  /tmp/B.OMWNgN/BUILD/zfs-0.7.9/module/spl/spl-thread.o
  CC [M]  /tmp/B.OMWNgN/BUILD/zfs-0.7.9/module/spl/spl-taskq.o
  CC [M]  /tmp/B.OMWNgN/BUILD/zfs-0.7.9/module/lua/lgc.o
  CC [M]  /tmp/B.OMWNgN/BUILD/zfs-0.7.9/module/icp/spi/kcf_spi.o
  CC [M]  /tmp/B.OMWNgN/BUILD/zfs-0.7.9/module/icp/io/aes.o
  CC [M]  /tmp/B.OMWNgN/BUILD/zfs-0.7.9/module/icp/io/edonr_mod.o
  CC [M]  /tmp/B.OMWNgN/BUILD/zfs-0.7.9/module/icp/io/sha1_mod.o
  CC [M]  /tmp/B.OMWNgN/BUILD/zfs-0.7.9/module/lua/lmem.o
  CC [M]  /tmp/B.OMWNgN/BUILD/zfs-0.7.9/module/lua/lobject.o
  CC [M]  /tmp/B.OMWNgN/BUILD/zfs-0.7.9/module/lua/lopcodes.o
  CC [M]  /tmp/B.OMWNgN/BUILD/zfs-0.7.9/module/spl/spl-tsd.o
  CC [M]  /tmp/B.OMWNgN/BUILD/zfs-0.7.9/module/spl/spl-vmem.o
  CC [M]  /tmp/B.OMWNgN/BUILD/zfs-0.7.9/module/icp/io/sha2_mod.o
  CC [M]  /tmp/B.OMWNgN/BUILD/zfs-0.7.9/module/icp/io/skein_mod.o
  CC [M]  /tmp/B.OMWNgN/BUILD/zfs-0.7.9/module/icp/os/modhash.o
  CC [M]  /tmp/B.OMWNgN/BUILD/zfs-0.7.9/module/icp/os/modconf.o
  CC [M]  /tmp/B.OMWNgN/BUILD/zfs-0.7.9/module/lua/lstate.o
  CC [M]  /tmp/B.OMWNgN/BUILD/zfs-0.7.9/module/lua/lstring.o
  CC [M]  /tmp/B.OMWNgN/BUILD/zfs-0.7.9/module/spl/spl-xdr.o
  CC [M]  /tmp/B.OMWNgN/BUILD/zfs-0.7.9/module/lua/lparser.o
  CC [M]  /tmp/B.OMWNgN/BUILD/zfs-0.7.9/module/spl/spl-vnode.o
  CC [M]  /tmp/B.OMWNgN/BUILD/zfs-0.7.9/module/icp/algs/modes/cbc.o
  CC [M]  /tmp/B.OMWNgN/BUILD/zfs-0.7.9/module/icp/algs/modes/ccm.o
  CC [M]  /tmp/B.OMWNgN/BUILD/zfs-0.7.9/module/icp/algs/modes/ctr.o
  CC [M]  /tmp/B.OMWNgN/BUILD/zfs-0.7.9/module/icp/algs/modes/ecb.o
  CC [M]  /tmp/B.OMWNgN/BUILD/zfs-0.7.9/module/spl/spl-zlib.o
  LD [M]  /tmp/B.OMWNgN/BUILD/zfs-0.7.9/module/spl/spl.o
  CC [M]  /tmp/B.OMWNgN/BUILD/zfs-0.7.9/module/lua/ltable.o
  AS [M]  /tmp/B.OMWNgN/BUILD/zfs-0.7.9/module/lua/setjmp/setjmp.o
  CC [M]  /tmp/B.OMWNgN/BUILD/zfs-0.7.9/module/icp/algs/modes/gcm_generic.o
  CC [M]  /tmp/B.OMWNgN/BUILD/zfs-0.7.9/module/lua/ltm.o
  CC [M]  /tmp/B.OMWNgN/BUILD/zfs-0.7.9/module/icp/algs/modes/modes.o
  CC [M]  /tmp/B.OMWNgN/BUILD/zfs-0.7.9/module/lua/lstrlib.o
  CC [M]  /tmp/B.OMWNgN/BUILD/zfs-0.7.9/module/icp/algs/modes/gcm.o
  CC [M]  /tmp/B.OMWNgN/BUILD/zfs-0.7.9/module/lua/lzio.o
  CC [M]  /tmp/B.OMWNgN/BUILD/zfs-0.7.9/module/lua/ltablib.o
  CC [M]  /tmp/B.OMWNgN/BUILD/zfs-0.7.9/module/lua/lvm.o
  CC [M]  /tmp/B.OMWNgN/BUILD/zfs-0.7.9/module/icp/algs/aes/aes_impl_generic.o
  CC [M]  /tmp/B.OMWNgN/BUILD/zfs-0.7.9/module/icp/algs/skein/skein_iv.o
  LD [M]  /tmp/B.OMWNgN/BUILD/zfs-0.7.9/module/lua/zlua.o
  CC [M]  /tmp/B.OMWNgN/BUILD/zfs-0.7.9/module/icp/algs/aes/aes_modes.o
  AS [M]  /tmp/B.OMWNgN/BUILD/zfs-0.7.9/module/icp/asm-x86_64/aes/aes_aesni.o
  CC [M]  /tmp/B.OMWNgN/BUILD/zfs-0.7.9/module/icp/algs/sha1/sha1.o
  AS [M]  /tmp/B.OMWNgN/BUILD/zfs-0.7.9/module/icp/asm-x86_64/aes/aes_amd64.o
  AS [M]  /tmp/B.OMWNgN/BUILD/zfs-0.7.9/module/icp/asm-x86_64/modes/gcm_pclmulqdq.o
  CC [M]  /tmp/B.OMWNgN/BUILD/zfs-0.7.9/module/icp/algs/aes/aes_impl.o
  AS [M]  /tmp/B.OMWNgN/BUILD/zfs-0.7.9/module/icp/asm-x86_64/sha1/sha1-x86_64.o
/tmp/B.OMWNgN/BUILD/zfs-0.7.9/module/icp/asm-x86_64/sha1/.tmp_sha1-x86_64.o: warning: objtool: sha1_block_data_order()+0x11: unsupported stack pointer realignment
  AS [M]  /tmp/B.OMWNgN/BUILD/zfs-0.7.9/module/icp/asm-x86_64/sha2/sha256_impl.o
/tmp/B.OMWNgN/BUILD/zfs-0.7.9/module/icp/asm-x86_64/sha2/.tmp_sha256_impl.o: warning: objtool: SHA256TransformBlocks()+0x19: unsupported stack pointer realignment
  AS [M]  /tmp/B.OMWNgN/BUILD/zfs-0.7.9/module/icp/asm-x86_64/sha2/sha512_impl.o
/tmp/B.OMWNgN/BUILD/zfs-0.7.9/module/icp/asm-x86_64/sha2/.tmp_sha512_impl.o: warning: objtool: SHA512TransformBlocks()+0x1c: unsupported stack pointer realignment
  CC [M]  /tmp/B.OMWNgN/BUILD/zfs-0.7.9/module/icp/algs/skein/skein_block.o
  CC [M]  /tmp/B.OMWNgN/BUILD/zfs-0.7.9/module/icp/algs/edonr/edonr.o
  CC [M]  /tmp/B.OMWNgN/BUILD/zfs-0.7.9/module/icp/algs/skein/skein.o
  CC [M]  /tmp/B.OMWNgN/BUILD/zfs-0.7.9/module/icp/algs/sha2/sha2.o
  CC [M]  /tmp/B.OMWNgN/BUILD/zfs-0.7.9/module/icp/algs/modes/gcm_pclmulqdq.o
  CC [M]  /tmp/B.OMWNgN/BUILD/zfs-0.7.9/module/icp/algs/aes/aes_impl_aesni.o
  CC [M]  /tmp/B.OMWNgN/BUILD/zfs-0.7.9/module/icp/algs/aes/aes_impl_x86-64.o
  CC [M]  /tmp/B.OMWNgN/BUILD/zfs-0.7.9/module/icp/asm-x86_64/aes/aeskey.o
  LD [M]  /tmp/B.OMWNgN/BUILD/zfs-0.7.9/module/icp/icp.o
make[3]: *** [Makefile:1517: _module_/tmp/B.OMWNgN/BUILD/zfs-0.7.9/module] Error 2
make[2]: *** [Makefile:30: modules] Error 2
make[1]: *** [Makefile:782: all-recursive] Error 1
make: *** [Makefile:651: all] Error 2
error: Bad exit status from /tmp/B.OMWNgN/BUILD/tmp/rpm-tmp.33040 (%build)


RPM build errors:
    Bad exit status from /tmp/B.OMWNgN/BUILD/tmp/rpm-tmp.33040 (%build)
ended at: Fri Oct 26 01:02:52 2018, done in 0:06:19.750339
error: No files produced.
mesg: ttyname failed: Inappropriate ioctl for device
+ chmod -R u+rwX /tmp/B.OMWNgN/BUILD
+ rm -rf /tmp/B.OMWNgN/tmp /tmp/B.OMWNgN/BUILD
mesg: ttyname failed: Inappropriate ioctl for device
+ rm -rf /tmp/B.OMWNgN
Begin-PLD-Builder-Info
Build-Time: user:259.69s sys:81.52s real:386.87s (faults io:0 non-io:42735606)

End-PLD-Builder-Info
[Back to list of logs] [View rpm -qa of builder]