FailedOk

th/SRPMS[OK]
th/x32[OK]
th/i686[OK]
th/x86_64[OK]

ac/SRPMS[OK]
ac/i386[OK]
ac/i586[OK]
ac/i686[OK]
ac/alpha[OK]
ac/amd64[OK]
ac/athlon[OK]
ac/ppc[OK]
ac/sparc[OK]
ac/sparc64[OK]

Advanced Search
main()
Powered by PLD Linux
(c) 2002-2017 PLD Team
$Revision: 1.37 $
Powered by VAX.
Your IP: 54.196.5.163

zxing-cpp 4efeb5e1-8ba0-43bd-9f3f-382d2a22adda

Status:Failed
Source URL:ftp://buildlogs.pld-linux.org/th/x86_64/FAIL/zxing-cpp,4efeb5e1-8ba0-43bd-9f3f-382d2a22adda.bz2
text/plain URL:View!
full text:View!
rpm -qa of builder:View!
Date:2017/04/17 10:01:07
Runtime:0:00:28.679909

Toc:

  • error 1
  • libzxing.so.0: undefined reference to `cv::fastFree(void*)'
  • error 2
  • libzxing.so.0: undefined reference to `cv::Mat::copyTo(cv::_OutputArray const&) const'
  • error 3
  • libzxing.so.0: undefined reference to `cv::Mat::deallocate()'
  • error 4
  • collect2: error: ld returned 1 exit status
  • error 5
  • libzxing.so.0: undefined reference to `cv::fastFree(void*)'
  • error 6
  • libzxing.so.0: undefined reference to `cv::Mat::copyTo(cv::_OutputArray const&) const'
  • error 7
  • libzxing.so.0: undefined reference to `cv::Mat::deallocate()'
  • error 8
  • collect2: error: ld returned 1 exit status
  • error 9
  • error: Bad exit status from /tmp/B.trsy4O/BUILD/tmp/rpm-tmp.73460 (%build)
  • error 10
  • RPM build errors:
  • error 11
  • error: No files produced.

Content:

make[1]: Leaving directory '/tmp/B.trsy4O/BUILD/zxing-cpp-6b3cbe02a332bff0f5ba0416f221d3d3876afdc2/build'
/usr/bin/make -f CMakeFiles/zxing.dir/build.make CMakeFiles/zxing.dir/depend
/usr/bin/make -f CMakeFiles/zxing-cv.dir/build.make CMakeFiles/zxing-cv.dir/depend
/usr/bin/make -f CMakeFiles/testrunner.dir/build.make CMakeFiles/testrunner.dir/depend
make[2]: Entering directory '/tmp/B.trsy4O/BUILD/zxing-cpp-6b3cbe02a332bff0f5ba0416f221d3d3876afdc2/build'
cd /tmp/B.trsy4O/BUILD/zxing-cpp-6b3cbe02a332bff0f5ba0416f221d3d3876afdc2/build && /usr/bin/cmake -E cmake_depends "Unix Makefiles" /tmp/B.trsy4O/BUILD/zxing-cpp-6b3cbe02a332bff0f5ba0416f221d3d3876afdc2 /tmp/B.trsy4O/BUILD/zxing-cpp-6b3cbe02a332bff0f5ba0416f221d3d3876afdc2 /tmp/B.trsy4O/BUILD/zxing-cpp-6b3cbe02a332bff0f5ba0416f221d3d3876afdc2/build /tmp/B.trsy4O/BUILD/zxing-cpp-6b3cbe02a332bff0f5ba0416f221d3d3876afdc2/build /tmp/B.trsy4O/BUILD/zxing-cpp-6b3cbe02a332bff0f5ba0416f221d3d3876afdc2/build/CMakeFiles/zxing-cv.dir/DependInfo.cmake --color=
Scanning dependencies of target zxing-cv
make[2]: Leaving directory '/tmp/B.trsy4O/BUILD/zxing-cpp-6b3cbe02a332bff0f5ba0416f221d3d3876afdc2/build'
/usr/bin/make -f CMakeFiles/zxing-cv.dir/build.make CMakeFiles/zxing-cv.dir/build
make[2]: Entering directory '/tmp/B.trsy4O/BUILD/zxing-cpp-6b3cbe02a332bff0f5ba0416f221d3d3876afdc2/build'
cd /tmp/B.trsy4O/BUILD/zxing-cpp-6b3cbe02a332bff0f5ba0416f221d3d3876afdc2/build && /usr/bin/cmake -E cmake_depends "Unix Makefiles" /tmp/B.trsy4O/BUILD/zxing-cpp-6b3cbe02a332bff0f5ba0416f221d3d3876afdc2 /tmp/B.trsy4O/BUILD/zxing-cpp-6b3cbe02a332bff0f5ba0416f221d3d3876afdc2 /tmp/B.trsy4O/BUILD/zxing-cpp-6b3cbe02a332bff0f5ba0416f221d3d3876afdc2/build /tmp/B.trsy4O/BUILD/zxing-cpp-6b3cbe02a332bff0f5ba0416f221d3d3876afdc2/build /tmp/B.trsy4O/BUILD/zxing-cpp-6b3cbe02a332bff0f5ba0416f221d3d3876afdc2/build/CMakeFiles/testrunner.dir/DependInfo.cmake --color=
Scanning dependencies of target testrunner
make[2]: Leaving directory '/tmp/B.trsy4O/BUILD/zxing-cpp-6b3cbe02a332bff0f5ba0416f221d3d3876afdc2/build'
make[2]: Entering directory '/tmp/B.trsy4O/BUILD/zxing-cpp-6b3cbe02a332bff0f5ba0416f221d3d3876afdc2/build'
cd /tmp/B.trsy4O/BUILD/zxing-cpp-6b3cbe02a332bff0f5ba0416f221d3d3876afdc2/build && /usr/bin/cmake -E cmake_depends "Unix Makefiles" /tmp/B.trsy4O/BUILD/zxing-cpp-6b3cbe02a332bff0f5ba0416f221d3d3876afdc2 /tmp/B.trsy4O/BUILD/zxing-cpp-6b3cbe02a332bff0f5ba0416f221d3d3876afdc2 /tmp/B.trsy4O/BUILD/zxing-cpp-6b3cbe02a332bff0f5ba0416f221d3d3876afdc2/build /tmp/B.trsy4O/BUILD/zxing-cpp-6b3cbe02a332bff0f5ba0416f221d3d3876afdc2/build /tmp/B.trsy4O/BUILD/zxing-cpp-6b3cbe02a332bff0f5ba0416f221d3d3876afdc2/build/CMakeFiles/zxing.dir/DependInfo.cmake --color=
Scanning dependencies of target zxing
make[2]: Leaving directory '/tmp/B.trsy4O/BUILD/zxing-cpp-6b3cbe02a332bff0f5ba0416f221d3d3876afdc2/build'
/usr/bin/make -f CMakeFiles/zxing.dir/build.make CMakeFiles/zxing.dir/build
/usr/bin/make -f CMakeFiles/testrunner.dir/build.make CMakeFiles/testrunner.dir/build
make[2]: Entering directory '/tmp/B.trsy4O/BUILD/zxing-cpp-6b3cbe02a332bff0f5ba0416f221d3d3876afdc2/build'
[ 87%] Building CXX object CMakeFiles/testrunner.dir/core/tests/src/TestRunner.cpp.o
/usr/bin/x86_64-pld-linux-g++    -I/usr/include/opencv -I/tmp/B.trsy4O/BUILD/zxing-cpp-6b3cbe02a332bff0f5ba0416f221d3d3876afdc2/./opencv/src -I/tmp/B.trsy4O/BUILD/zxing-cpp-6b3cbe02a332bff0f5ba0416f221d3d3876afdc2/./core/src  -O2 -fwrapv -pipe -Wformat -Werror=format-security -gdwarf-4 -fno-debug-types-section -fvar-tracking-assignments -g2 -Wp,-D_FORTIFY_SOURCE=2 -fstack-protector-strong --param=ssp-buffer-size=4 -fPIC -march=x86-64 -gdwarf-4 -fno-debug-types-section -fvar-tracking-assignments -g2  -DNDEBUG -DQT_NO_DEBUG   -o CMakeFiles/testrunner.dir/core/tests/src/TestRunner.cpp.o -c /tmp/B.trsy4O/BUILD/zxing-cpp-6b3cbe02a332bff0f5ba0416f221d3d3876afdc2/core/tests/src/TestRunner.cpp
make[2]: Leaving directory '/tmp/B.trsy4O/BUILD/zxing-cpp-6b3cbe02a332bff0f5ba0416f221d3d3876afdc2/build'
make[2]: Entering directory '/tmp/B.trsy4O/BUILD/zxing-cpp-6b3cbe02a332bff0f5ba0416f221d3d3876afdc2/build'
[ 85%] Building CXX object CMakeFiles/zxing.dir/cli/src/ImageReaderSource.cpp.o
/usr/bin/x86_64-pld-linux-g++    -I/usr/include/opencv -I/tmp/B.trsy4O/BUILD/zxing-cpp-6b3cbe02a332bff0f5ba0416f221d3d3876afdc2/./opencv/src -I/tmp/B.trsy4O/BUILD/zxing-cpp-6b3cbe02a332bff0f5ba0416f221d3d3876afdc2/./core/src  -O2 -fwrapv -pipe -Wformat -Werror=format-security -gdwarf-4 -fno-debug-types-section -fvar-tracking-assignments -g2 -Wp,-D_FORTIFY_SOURCE=2 -fstack-protector-strong --param=ssp-buffer-size=4 -fPIC -march=x86-64 -gdwarf-4 -fno-debug-types-section -fvar-tracking-assignments -g2  -DNDEBUG -DQT_NO_DEBUG   -o CMakeFiles/zxing.dir/cli/src/ImageReaderSource.cpp.o -c /tmp/B.trsy4O/BUILD/zxing-cpp-6b3cbe02a332bff0f5ba0416f221d3d3876afdc2/cli/src/ImageReaderSource.cpp
make[2]: Leaving directory '/tmp/B.trsy4O/BUILD/zxing-cpp-6b3cbe02a332bff0f5ba0416f221d3d3876afdc2/build'
make[2]: Entering directory '/tmp/B.trsy4O/BUILD/zxing-cpp-6b3cbe02a332bff0f5ba0416f221d3d3876afdc2/build'
[ 84%] Building CXX object CMakeFiles/zxing-cv.dir/opencv-cli/src/main.cpp.o
/usr/bin/x86_64-pld-linux-g++    -isystem /usr/include/opencv -I/tmp/B.trsy4O/BUILD/zxing-cpp-6b3cbe02a332bff0f5ba0416f221d3d3876afdc2/./opencv/src -I/tmp/B.trsy4O/BUILD/zxing-cpp-6b3cbe02a332bff0f5ba0416f221d3d3876afdc2/./core/src  -O2 -fwrapv -pipe -Wformat -Werror=format-security -gdwarf-4 -fno-debug-types-section -fvar-tracking-assignments -g2 -Wp,-D_FORTIFY_SOURCE=2 -fstack-protector-strong --param=ssp-buffer-size=4 -fPIC -march=x86-64 -gdwarf-4 -fno-debug-types-section -fvar-tracking-assignments -g2  -DNDEBUG -DQT_NO_DEBUG   -o CMakeFiles/zxing-cv.dir/opencv-cli/src/main.cpp.o -c /tmp/B.trsy4O/BUILD/zxing-cpp-6b3cbe02a332bff0f5ba0416f221d3d3876afdc2/opencv-cli/src/main.cpp
make[2]: Leaving directory '/tmp/B.trsy4O/BUILD/zxing-cpp-6b3cbe02a332bff0f5ba0416f221d3d3876afdc2/build'
make[2]: Entering directory '/tmp/B.trsy4O/BUILD/zxing-cpp-6b3cbe02a332bff0f5ba0416f221d3d3876afdc2/build'
[ 86%] Building CXX object CMakeFiles/testrunner.dir/core/tests/src/common/BitArrayTest.cpp.o
/usr/bin/x86_64-pld-linux-g++    -I/usr/include/opencv -I/tmp/B.trsy4O/BUILD/zxing-cpp-6b3cbe02a332bff0f5ba0416f221d3d3876afdc2/./opencv/src -I/tmp/B.trsy4O/BUILD/zxing-cpp-6b3cbe02a332bff0f5ba0416f221d3d3876afdc2/./core/src  -O2 -fwrapv -pipe -Wformat -Werror=format-security -gdwarf-4 -fno-debug-types-section -fvar-tracking-assignments -g2 -Wp,-D_FORTIFY_SOURCE=2 -fstack-protector-strong --param=ssp-buffer-size=4 -fPIC -march=x86-64 -gdwarf-4 -fno-debug-types-section -fvar-tracking-assignments -g2  -DNDEBUG -DQT_NO_DEBUG   -o CMakeFiles/testrunner.dir/core/tests/src/common/BitArrayTest.cpp.o -c /tmp/B.trsy4O/BUILD/zxing-cpp-6b3cbe02a332bff0f5ba0416f221d3d3876afdc2/core/tests/src/common/BitArrayTest.cpp
make[2]: Leaving directory '/tmp/B.trsy4O/BUILD/zxing-cpp-6b3cbe02a332bff0f5ba0416f221d3d3876afdc2/build'
make[2]: Entering directory '/tmp/B.trsy4O/BUILD/zxing-cpp-6b3cbe02a332bff0f5ba0416f221d3d3876afdc2/build'
[ 88%] Building CXX object CMakeFiles/testrunner.dir/core/tests/src/common/BitMatrixTest.cpp.o
/usr/bin/x86_64-pld-linux-g++    -I/usr/include/opencv -I/tmp/B.trsy4O/BUILD/zxing-cpp-6b3cbe02a332bff0f5ba0416f221d3d3876afdc2/./opencv/src -I/tmp/B.trsy4O/BUILD/zxing-cpp-6b3cbe02a332bff0f5ba0416f221d3d3876afdc2/./core/src  -O2 -fwrapv -pipe -Wformat -Werror=format-security -gdwarf-4 -fno-debug-types-section -fvar-tracking-assignments -g2 -Wp,-D_FORTIFY_SOURCE=2 -fstack-protector-strong --param=ssp-buffer-size=4 -fPIC -march=x86-64 -gdwarf-4 -fno-debug-types-section -fvar-tracking-assignments -g2  -DNDEBUG -DQT_NO_DEBUG   -o CMakeFiles/testrunner.dir/core/tests/src/common/BitMatrixTest.cpp.o -c /tmp/B.trsy4O/BUILD/zxing-cpp-6b3cbe02a332bff0f5ba0416f221d3d3876afdc2/core/tests/src/common/BitMatrixTest.cpp
make[2]: Leaving directory '/tmp/B.trsy4O/BUILD/zxing-cpp-6b3cbe02a332bff0f5ba0416f221d3d3876afdc2/build'
make[2]: Entering directory '/tmp/B.trsy4O/BUILD/zxing-cpp-6b3cbe02a332bff0f5ba0416f221d3d3876afdc2/build'
[ 90%] Linking CXX executable zxing-cv
/usr/bin/cmake -E cmake_link_script CMakeFiles/zxing-cv.dir/link.txt --verbose=1
/usr/bin/x86_64-pld-linux-g++   -O2 -fwrapv -pipe -Wformat -Werror=format-security -gdwarf-4 -fno-debug-types-section -fvar-tracking-assignments -g2 -Wp,-D_FORTIFY_SOURCE=2 -fstack-protector-strong --param=ssp-buffer-size=4 -fPIC -march=x86-64 -gdwarf-4 -fno-debug-types-section -fvar-tracking-assignments -g2  -DNDEBUG -DQT_NO_DEBUG  -Wl,--as-needed -Wl,--no-copy-dt-needed-entries -Wl,-z,relro -Wl,-z,combreloc CMakeFiles/zxing-cv.dir/opencv-cli/src/main.cpp.o  -o zxing-cv -Wl,-rpath,/tmp/B.trsy4O/BUILD/zxing-cpp-6b3cbe02a332bff0f5ba0416f221d3d3876afdc2/build -rdynamic libzxing.so.0 /usr/lib64/libopencv_xphoto.so.3.1.0 /usr/lib64/libopencv_xobjdetect.so.3.1.0 /usr/lib64/libopencv_tracking.so.3.1.0 /usr/lib64/libopencv_surface_matching.so.3.1.0 /usr/lib64/libopencv_structured_light.so.3.1.0 /usr/lib64/libopencv_stereo.so.3.1.0 /usr/lib64/libopencv_sfm.so.3.1.0 /usr/lib64/libopencv_saliency.so.3.1.0 /usr/lib64/libopencv_rgbd.so.3.1.0 /usr/lib64/libopencv_reg.so.3.1.0 /usr/lib64/libopencv_plot.so.3.1.0 /usr/lib64/libopencv_optflow.so.3.1.0 /usr/lib64/libopencv_line_descriptor.so.3.1.0 /usr/lib64/libopencv_hdf.so.3.1.0 /usr/lib64/libopencv_fuzzy.so.3.1.0 /usr/lib64/libopencv_dpm.so.3.1.0 /usr/lib64/libopencv_dnn.so.3.1.0 /usr/lib64/libopencv_datasets.so.3.1.0 /usr/lib64/libopencv_ccalib.so.3.1.0 /usr/lib64/libopencv_bioinspired.so.3.1.0 /usr/lib64/libopencv_bgsegm.so.3.1.0 /usr/lib64/libopencv_aruco.so.3.1.0 /usr/lib64/libopencv_viz.so.3.1.0 /usr/lib64/libopencv_videostab.so.3.1.0 /usr/lib64/libopencv_superres.so.3.1.0 /usr/lib64/libopencv_stitching.so.3.1.0 /usr/lib64/libopencv_photo.so.3.1.0 -lc /usr/lib64/libopencv_text.so.3.1.0 /usr/lib64/libopencv_face.so.3.1.0 /usr/lib64/libopencv_ximgproc.so.3.1.0 /usr/lib64/libopencv_xfeatures2d.so.3.1.0 /usr/lib64/libopencv_shape.so.3.1.0 /usr/lib64/libopencv_video.so.3.1.0 /usr/lib64/libopencv_objdetect.so.3.1.0 /usr/lib64/libopencv_calib3d.so.3.1.0 /usr/lib64/libopencv_features2d.so.3.1.0 /usr/lib64/libopencv_ml.so.3.1.0 /usr/lib64/libopencv_highgui.so.3.1.0 /usr/lib64/libopencv_videoio.so.3.1.0 /usr/lib64/libopencv_imgcodecs.so.3.1.0 /usr/lib64/libopencv_imgproc.so.3.1.0 /usr/lib64/libopencv_flann.so.3.1.0 /usr/lib64/libopencv_core.so.3.1.0 
make[2]: Leaving directory '/tmp/B.trsy4O/BUILD/zxing-cpp-6b3cbe02a332bff0f5ba0416f221d3d3876afdc2/build'
make[1]: Entering directory '/tmp/B.trsy4O/BUILD/zxing-cpp-6b3cbe02a332bff0f5ba0416f221d3d3876afdc2/build'
[ 91%] Built target zxing-cv
make[1]: Leaving directory '/tmp/B.trsy4O/BUILD/zxing-cpp-6b3cbe02a332bff0f5ba0416f221d3d3876afdc2/build'
make[2]: Entering directory '/tmp/B.trsy4O/BUILD/zxing-cpp-6b3cbe02a332bff0f5ba0416f221d3d3876afdc2/build'
[ 91%] Building CXX object CMakeFiles/testrunner.dir/core/tests/src/common/CountedTest.cpp.o
/usr/bin/x86_64-pld-linux-g++    -I/usr/include/opencv -I/tmp/B.trsy4O/BUILD/zxing-cpp-6b3cbe02a332bff0f5ba0416f221d3d3876afdc2/./opencv/src -I/tmp/B.trsy4O/BUILD/zxing-cpp-6b3cbe02a332bff0f5ba0416f221d3d3876afdc2/./core/src  -O2 -fwrapv -pipe -Wformat -Werror=format-security -gdwarf-4 -fno-debug-types-section -fvar-tracking-assignments -g2 -Wp,-D_FORTIFY_SOURCE=2 -fstack-protector-strong --param=ssp-buffer-size=4 -fPIC -march=x86-64 -gdwarf-4 -fno-debug-types-section -fvar-tracking-assignments -g2  -DNDEBUG -DQT_NO_DEBUG   -o CMakeFiles/testrunner.dir/core/tests/src/common/CountedTest.cpp.o -c /tmp/B.trsy4O/BUILD/zxing-cpp-6b3cbe02a332bff0f5ba0416f221d3d3876afdc2/core/tests/src/common/CountedTest.cpp
make[2]: Leaving directory '/tmp/B.trsy4O/BUILD/zxing-cpp-6b3cbe02a332bff0f5ba0416f221d3d3876afdc2/build'
make[2]: Entering directory '/tmp/B.trsy4O/BUILD/zxing-cpp-6b3cbe02a332bff0f5ba0416f221d3d3876afdc2/build'
[ 90%] Building CXX object CMakeFiles/testrunner.dir/core/tests/src/common/BitSourceTest.cpp.o
/usr/bin/x86_64-pld-linux-g++    -I/usr/include/opencv -I/tmp/B.trsy4O/BUILD/zxing-cpp-6b3cbe02a332bff0f5ba0416f221d3d3876afdc2/./opencv/src -I/tmp/B.trsy4O/BUILD/zxing-cpp-6b3cbe02a332bff0f5ba0416f221d3d3876afdc2/./core/src  -O2 -fwrapv -pipe -Wformat -Werror=format-security -gdwarf-4 -fno-debug-types-section -fvar-tracking-assignments -g2 -Wp,-D_FORTIFY_SOURCE=2 -fstack-protector-strong --param=ssp-buffer-size=4 -fPIC -march=x86-64 -gdwarf-4 -fno-debug-types-section -fvar-tracking-assignments -g2  -DNDEBUG -DQT_NO_DEBUG   -o CMakeFiles/testrunner.dir/core/tests/src/common/BitSourceTest.cpp.o -c /tmp/B.trsy4O/BUILD/zxing-cpp-6b3cbe02a332bff0f5ba0416f221d3d3876afdc2/core/tests/src/common/BitSourceTest.cpp
make[2]: Leaving directory '/tmp/B.trsy4O/BUILD/zxing-cpp-6b3cbe02a332bff0f5ba0416f221d3d3876afdc2/build'
make[2]: Entering directory '/tmp/B.trsy4O/BUILD/zxing-cpp-6b3cbe02a332bff0f5ba0416f221d3d3876afdc2/build'
[ 92%] Building CXX object CMakeFiles/testrunner.dir/core/tests/src/common/PerspectiveTransformTest.cpp.o
/usr/bin/x86_64-pld-linux-g++    -I/usr/include/opencv -I/tmp/B.trsy4O/BUILD/zxing-cpp-6b3cbe02a332bff0f5ba0416f221d3d3876afdc2/./opencv/src -I/tmp/B.trsy4O/BUILD/zxing-cpp-6b3cbe02a332bff0f5ba0416f221d3d3876afdc2/./core/src  -O2 -fwrapv -pipe -Wformat -Werror=format-security -gdwarf-4 -fno-debug-types-section -fvar-tracking-assignments -g2 -Wp,-D_FORTIFY_SOURCE=2 -fstack-protector-strong --param=ssp-buffer-size=4 -fPIC -march=x86-64 -gdwarf-4 -fno-debug-types-section -fvar-tracking-assignments -g2  -DNDEBUG -DQT_NO_DEBUG   -o CMakeFiles/testrunner.dir/core/tests/src/common/PerspectiveTransformTest.cpp.o -c /tmp/B.trsy4O/BUILD/zxing-cpp-6b3cbe02a332bff0f5ba0416f221d3d3876afdc2/core/tests/src/common/PerspectiveTransformTest.cpp
make[2]: Leaving directory '/tmp/B.trsy4O/BUILD/zxing-cpp-6b3cbe02a332bff0f5ba0416f221d3d3876afdc2/build'
make[2]: Entering directory '/tmp/B.trsy4O/BUILD/zxing-cpp-6b3cbe02a332bff0f5ba0416f221d3d3876afdc2/build'
[ 94%] Building CXX object CMakeFiles/testrunner.dir/core/tests/src/qrcode/ErrorCorrectionLevelTest.cpp.o
/usr/bin/x86_64-pld-linux-g++    -I/usr/include/opencv -I/tmp/B.trsy4O/BUILD/zxing-cpp-6b3cbe02a332bff0f5ba0416f221d3d3876afdc2/./opencv/src -I/tmp/B.trsy4O/BUILD/zxing-cpp-6b3cbe02a332bff0f5ba0416f221d3d3876afdc2/./core/src  -O2 -fwrapv -pipe -Wformat -Werror=format-security -gdwarf-4 -fno-debug-types-section -fvar-tracking-assignments -g2 -Wp,-D_FORTIFY_SOURCE=2 -fstack-protector-strong --param=ssp-buffer-size=4 -fPIC -march=x86-64 -gdwarf-4 -fno-debug-types-section -fvar-tracking-assignments -g2  -DNDEBUG -DQT_NO_DEBUG   -o CMakeFiles/testrunner.dir/core/tests/src/qrcode/ErrorCorrectionLevelTest.cpp.o -c /tmp/B.trsy4O/BUILD/zxing-cpp-6b3cbe02a332bff0f5ba0416f221d3d3876afdc2/core/tests/src/qrcode/ErrorCorrectionLevelTest.cpp
make[2]: Leaving directory '/tmp/B.trsy4O/BUILD/zxing-cpp-6b3cbe02a332bff0f5ba0416f221d3d3876afdc2/build'
make[2]: Entering directory '/tmp/B.trsy4O/BUILD/zxing-cpp-6b3cbe02a332bff0f5ba0416f221d3d3876afdc2/build'
[ 85%] Building CXX object CMakeFiles/zxing.dir/cli/src/jpgd.cpp.o
/usr/bin/x86_64-pld-linux-g++    -I/usr/include/opencv -I/tmp/B.trsy4O/BUILD/zxing-cpp-6b3cbe02a332bff0f5ba0416f221d3d3876afdc2/./opencv/src -I/tmp/B.trsy4O/BUILD/zxing-cpp-6b3cbe02a332bff0f5ba0416f221d3d3876afdc2/./core/src  -O2 -fwrapv -pipe -Wformat -Werror=format-security -gdwarf-4 -fno-debug-types-section -fvar-tracking-assignments -g2 -Wp,-D_FORTIFY_SOURCE=2 -fstack-protector-strong --param=ssp-buffer-size=4 -fPIC -march=x86-64 -gdwarf-4 -fno-debug-types-section -fvar-tracking-assignments -g2  -DNDEBUG -DQT_NO_DEBUG   -o CMakeFiles/zxing.dir/cli/src/jpgd.cpp.o -c /tmp/B.trsy4O/BUILD/zxing-cpp-6b3cbe02a332bff0f5ba0416f221d3d3876afdc2/cli/src/jpgd.cpp
make[2]: Leaving directory '/tmp/B.trsy4O/BUILD/zxing-cpp-6b3cbe02a332bff0f5ba0416f221d3d3876afdc2/build'
make[2]: Entering directory '/tmp/B.trsy4O/BUILD/zxing-cpp-6b3cbe02a332bff0f5ba0416f221d3d3876afdc2/build'
[ 89%] Building CXX object CMakeFiles/zxing.dir/cli/src/lodepng.cpp.o
/usr/bin/x86_64-pld-linux-g++    -I/usr/include/opencv -I/tmp/B.trsy4O/BUILD/zxing-cpp-6b3cbe02a332bff0f5ba0416f221d3d3876afdc2/./opencv/src -I/tmp/B.trsy4O/BUILD/zxing-cpp-6b3cbe02a332bff0f5ba0416f221d3d3876afdc2/./core/src  -O2 -fwrapv -pipe -Wformat -Werror=format-security -gdwarf-4 -fno-debug-types-section -fvar-tracking-assignments -g2 -Wp,-D_FORTIFY_SOURCE=2 -fstack-protector-strong --param=ssp-buffer-size=4 -fPIC -march=x86-64 -gdwarf-4 -fno-debug-types-section -fvar-tracking-assignments -g2  -DNDEBUG -DQT_NO_DEBUG   -o CMakeFiles/zxing.dir/cli/src/lodepng.cpp.o -c /tmp/B.trsy4O/BUILD/zxing-cpp-6b3cbe02a332bff0f5ba0416f221d3d3876afdc2/cli/src/lodepng.cpp
make[2]: Leaving directory '/tmp/B.trsy4O/BUILD/zxing-cpp-6b3cbe02a332bff0f5ba0416f221d3d3876afdc2/build'
make[2]: Entering directory '/tmp/B.trsy4O/BUILD/zxing-cpp-6b3cbe02a332bff0f5ba0416f221d3d3876afdc2/build'
[ 93%] Building CXX object CMakeFiles/testrunner.dir/core/tests/src/common/reedsolomon/ReedSolomonTest.cpp.o
/usr/bin/x86_64-pld-linux-g++    -I/usr/include/opencv -I/tmp/B.trsy4O/BUILD/zxing-cpp-6b3cbe02a332bff0f5ba0416f221d3d3876afdc2/./opencv/src -I/tmp/B.trsy4O/BUILD/zxing-cpp-6b3cbe02a332bff0f5ba0416f221d3d3876afdc2/./core/src  -O2 -fwrapv -pipe -Wformat -Werror=format-security -gdwarf-4 -fno-debug-types-section -fvar-tracking-assignments -g2 -Wp,-D_FORTIFY_SOURCE=2 -fstack-protector-strong --param=ssp-buffer-size=4 -fPIC -march=x86-64 -gdwarf-4 -fno-debug-types-section -fvar-tracking-assignments -g2  -DNDEBUG -DQT_NO_DEBUG   -o CMakeFiles/testrunner.dir/core/tests/src/common/reedsolomon/ReedSolomonTest.cpp.o -c /tmp/B.trsy4O/BUILD/zxing-cpp-6b3cbe02a332bff0f5ba0416f221d3d3876afdc2/core/tests/src/common/reedsolomon/ReedSolomonTest.cpp
make[2]: Leaving directory '/tmp/B.trsy4O/BUILD/zxing-cpp-6b3cbe02a332bff0f5ba0416f221d3d3876afdc2/build'
make[2]: Entering directory '/tmp/B.trsy4O/BUILD/zxing-cpp-6b3cbe02a332bff0f5ba0416f221d3d3876afdc2/build'
[ 94%] Building CXX object CMakeFiles/testrunner.dir/core/tests/src/qrcode/FormatInformationTest.cpp.o
/usr/bin/x86_64-pld-linux-g++    -I/usr/include/opencv -I/tmp/B.trsy4O/BUILD/zxing-cpp-6b3cbe02a332bff0f5ba0416f221d3d3876afdc2/./opencv/src -I/tmp/B.trsy4O/BUILD/zxing-cpp-6b3cbe02a332bff0f5ba0416f221d3d3876afdc2/./core/src  -O2 -fwrapv -pipe -Wformat -Werror=format-security -gdwarf-4 -fno-debug-types-section -fvar-tracking-assignments -g2 -Wp,-D_FORTIFY_SOURCE=2 -fstack-protector-strong --param=ssp-buffer-size=4 -fPIC -march=x86-64 -gdwarf-4 -fno-debug-types-section -fvar-tracking-assignments -g2  -DNDEBUG -DQT_NO_DEBUG   -o CMakeFiles/testrunner.dir/core/tests/src/qrcode/FormatInformationTest.cpp.o -c /tmp/B.trsy4O/BUILD/zxing-cpp-6b3cbe02a332bff0f5ba0416f221d3d3876afdc2/core/tests/src/qrcode/FormatInformationTest.cpp
make[2]: Leaving directory '/tmp/B.trsy4O/BUILD/zxing-cpp-6b3cbe02a332bff0f5ba0416f221d3d3876afdc2/build'
make[2]: Entering directory '/tmp/B.trsy4O/BUILD/zxing-cpp-6b3cbe02a332bff0f5ba0416f221d3d3876afdc2/build'
[ 95%] Building CXX object CMakeFiles/zxing.dir/cli/src/main.cpp.o
/usr/bin/x86_64-pld-linux-g++    -I/usr/include/opencv -I/tmp/B.trsy4O/BUILD/zxing-cpp-6b3cbe02a332bff0f5ba0416f221d3d3876afdc2/./opencv/src -I/tmp/B.trsy4O/BUILD/zxing-cpp-6b3cbe02a332bff0f5ba0416f221d3d3876afdc2/./core/src  -O2 -fwrapv -pipe -Wformat -Werror=format-security -gdwarf-4 -fno-debug-types-section -fvar-tracking-assignments -g2 -Wp,-D_FORTIFY_SOURCE=2 -fstack-protector-strong --param=ssp-buffer-size=4 -fPIC -march=x86-64 -gdwarf-4 -fno-debug-types-section -fvar-tracking-assignments -g2  -DNDEBUG -DQT_NO_DEBUG   -o CMakeFiles/zxing.dir/cli/src/main.cpp.o -c /tmp/B.trsy4O/BUILD/zxing-cpp-6b3cbe02a332bff0f5ba0416f221d3d3876afdc2/cli/src/main.cpp
make[2]: Leaving directory '/tmp/B.trsy4O/BUILD/zxing-cpp-6b3cbe02a332bff0f5ba0416f221d3d3876afdc2/build'
make[2]: Entering directory '/tmp/B.trsy4O/BUILD/zxing-cpp-6b3cbe02a332bff0f5ba0416f221d3d3876afdc2/build'
[ 97%] Building CXX object CMakeFiles/testrunner.dir/core/tests/src/qrcode/decoder/DataMaskTest.cpp.o
/usr/bin/x86_64-pld-linux-g++    -I/usr/include/opencv -I/tmp/B.trsy4O/BUILD/zxing-cpp-6b3cbe02a332bff0f5ba0416f221d3d3876afdc2/./opencv/src -I/tmp/B.trsy4O/BUILD/zxing-cpp-6b3cbe02a332bff0f5ba0416f221d3d3876afdc2/./core/src  -O2 -fwrapv -pipe -Wformat -Werror=format-security -gdwarf-4 -fno-debug-types-section -fvar-tracking-assignments -g2 -Wp,-D_FORTIFY_SOURCE=2 -fstack-protector-strong --param=ssp-buffer-size=4 -fPIC -march=x86-64 -gdwarf-4 -fno-debug-types-section -fvar-tracking-assignments -g2  -DNDEBUG -DQT_NO_DEBUG   -o CMakeFiles/testrunner.dir/core/tests/src/qrcode/decoder/DataMaskTest.cpp.o -c /tmp/B.trsy4O/BUILD/zxing-cpp-6b3cbe02a332bff0f5ba0416f221d3d3876afdc2/core/tests/src/qrcode/decoder/DataMaskTest.cpp
make[2]: Leaving directory '/tmp/B.trsy4O/BUILD/zxing-cpp-6b3cbe02a332bff0f5ba0416f221d3d3876afdc2/build'
make[2]: Entering directory '/tmp/B.trsy4O/BUILD/zxing-cpp-6b3cbe02a332bff0f5ba0416f221d3d3876afdc2/build'
[ 98%] Building CXX object CMakeFiles/testrunner.dir/core/tests/src/qrcode/decoder/ModeTest.cpp.o
/usr/bin/x86_64-pld-linux-g++    -I/usr/include/opencv -I/tmp/B.trsy4O/BUILD/zxing-cpp-6b3cbe02a332bff0f5ba0416f221d3d3876afdc2/./opencv/src -I/tmp/B.trsy4O/BUILD/zxing-cpp-6b3cbe02a332bff0f5ba0416f221d3d3876afdc2/./core/src  -O2 -fwrapv -pipe -Wformat -Werror=format-security -gdwarf-4 -fno-debug-types-section -fvar-tracking-assignments -g2 -Wp,-D_FORTIFY_SOURCE=2 -fstack-protector-strong --param=ssp-buffer-size=4 -fPIC -march=x86-64 -gdwarf-4 -fno-debug-types-section -fvar-tracking-assignments -g2  -DNDEBUG -DQT_NO_DEBUG   -o CMakeFiles/testrunner.dir/core/tests/src/qrcode/decoder/ModeTest.cpp.o -c /tmp/B.trsy4O/BUILD/zxing-cpp-6b3cbe02a332bff0f5ba0416f221d3d3876afdc2/core/tests/src/qrcode/decoder/ModeTest.cpp
make[2]: Leaving directory '/tmp/B.trsy4O/BUILD/zxing-cpp-6b3cbe02a332bff0f5ba0416f221d3d3876afdc2/build'
make[2]: Entering directory '/tmp/B.trsy4O/BUILD/zxing-cpp-6b3cbe02a332bff0f5ba0416f221d3d3876afdc2/build'
[ 96%] Building CXX object CMakeFiles/testrunner.dir/core/tests/src/qrcode/VersionTest.cpp.o
/usr/bin/x86_64-pld-linux-g++    -I/usr/include/opencv -I/tmp/B.trsy4O/BUILD/zxing-cpp-6b3cbe02a332bff0f5ba0416f221d3d3876afdc2/./opencv/src -I/tmp/B.trsy4O/BUILD/zxing-cpp-6b3cbe02a332bff0f5ba0416f221d3d3876afdc2/./core/src  -O2 -fwrapv -pipe -Wformat -Werror=format-security -gdwarf-4 -fno-debug-types-section -fvar-tracking-assignments -g2 -Wp,-D_FORTIFY_SOURCE=2 -fstack-protector-strong --param=ssp-buffer-size=4 -fPIC -march=x86-64 -gdwarf-4 -fno-debug-types-section -fvar-tracking-assignments -g2  -DNDEBUG -DQT_NO_DEBUG   -o CMakeFiles/testrunner.dir/core/tests/src/qrcode/VersionTest.cpp.o -c /tmp/B.trsy4O/BUILD/zxing-cpp-6b3cbe02a332bff0f5ba0416f221d3d3876afdc2/core/tests/src/qrcode/VersionTest.cpp
make[2]: Leaving directory '/tmp/B.trsy4O/BUILD/zxing-cpp-6b3cbe02a332bff0f5ba0416f221d3d3876afdc2/build'
make[2]: Entering directory '/tmp/B.trsy4O/BUILD/zxing-cpp-6b3cbe02a332bff0f5ba0416f221d3d3876afdc2/build'
[ 99%] Linking CXX executable zxing
/usr/bin/cmake -E cmake_link_script CMakeFiles/zxing.dir/link.txt --verbose=1
/usr/bin/x86_64-pld-linux-g++   -O2 -fwrapv -pipe -Wformat -Werror=format-security -gdwarf-4 -fno-debug-types-section -fvar-tracking-assignments -g2 -Wp,-D_FORTIFY_SOURCE=2 -fstack-protector-strong --param=ssp-buffer-size=4 -fPIC -march=x86-64 -gdwarf-4 -fno-debug-types-section -fvar-tracking-assignments -g2  -DNDEBUG -DQT_NO_DEBUG  -Wl,--as-needed -Wl,--no-copy-dt-needed-entries -Wl,-z,relro -Wl,-z,combreloc CMakeFiles/zxing.dir/cli/src/ImageReaderSource.cpp.o CMakeFiles/zxing.dir/cli/src/jpgd.cpp.o CMakeFiles/zxing.dir/cli/src/lodepng.cpp.o CMakeFiles/zxing.dir/cli/src/main.cpp.o  -o zxing -Wl,-rpath,/tmp/B.trsy4O/BUILD/zxing-cpp-6b3cbe02a332bff0f5ba0416f221d3d3876afdc2/build: -rdynamic libzxing.so.0 -lc 
libzxing.so.0: undefined reference to `cv::fastFree(void*)'
libzxing.so.0: undefined reference to `cv::Mat::copyTo(cv::_OutputArray const&) const'
libzxing.so.0: undefined reference to `cv::Mat::deallocate()'
collect2: error: ld returned 1 exit status
make[2]: *** [CMakeFiles/zxing.dir/build.make:178: zxing] Error 1
make[2]: Leaving directory '/tmp/B.trsy4O/BUILD/zxing-cpp-6b3cbe02a332bff0f5ba0416f221d3d3876afdc2/build'
make[1]: *** [CMakeFiles/Makefile2:108: CMakeFiles/zxing.dir/all] Error 2
make[1]: *** Waiting for unfinished jobs....
make[2]: Entering directory '/tmp/B.trsy4O/BUILD/zxing-cpp-6b3cbe02a332bff0f5ba0416f221d3d3876afdc2/build'
[100%] Linking CXX executable testrunner
/usr/bin/cmake -E cmake_link_script CMakeFiles/testrunner.dir/link.txt --verbose=1
/usr/bin/x86_64-pld-linux-g++   -O2 -fwrapv -pipe -Wformat -Werror=format-security -gdwarf-4 -fno-debug-types-section -fvar-tracking-assignments -g2 -Wp,-D_FORTIFY_SOURCE=2 -fstack-protector-strong --param=ssp-buffer-size=4 -fPIC -march=x86-64 -gdwarf-4 -fno-debug-types-section -fvar-tracking-assignments -g2  -DNDEBUG -DQT_NO_DEBUG  -Wl,--as-needed -Wl,--no-copy-dt-needed-entries -Wl,-z,relro -Wl,-z,combreloc CMakeFiles/testrunner.dir/core/tests/src/TestRunner.cpp.o CMakeFiles/testrunner.dir/core/tests/src/common/BitArrayTest.cpp.o CMakeFiles/testrunner.dir/core/tests/src/common/BitMatrixTest.cpp.o CMakeFiles/testrunner.dir/core/tests/src/common/BitSourceTest.cpp.o CMakeFiles/testrunner.dir/core/tests/src/common/CountedTest.cpp.o CMakeFiles/testrunner.dir/core/tests/src/common/PerspectiveTransformTest.cpp.o CMakeFiles/testrunner.dir/core/tests/src/common/reedsolomon/ReedSolomonTest.cpp.o CMakeFiles/testrunner.dir/core/tests/src/qrcode/ErrorCorrectionLevelTest.cpp.o CMakeFiles/testrunner.dir/core/tests/src/qrcode/FormatInformationTest.cpp.o CMakeFiles/testrunner.dir/core/tests/src/qrcode/VersionTest.cpp.o CMakeFiles/testrunner.dir/core/tests/src/qrcode/decoder/DataMaskTest.cpp.o CMakeFiles/testrunner.dir/core/tests/src/qrcode/decoder/ModeTest.cpp.o  -o testrunner -Wl,-rpath,/tmp/B.trsy4O/BUILD/zxing-cpp-6b3cbe02a332bff0f5ba0416f221d3d3876afdc2/build -rdynamic libzxing.so.0 -lcppunit -ldl -lc 
libzxing.so.0: undefined reference to `cv::fastFree(void*)'
libzxing.so.0: undefined reference to `cv::Mat::copyTo(cv::_OutputArray const&) const'
libzxing.so.0: undefined reference to `cv::Mat::deallocate()'
collect2: error: ld returned 1 exit status
make[2]: *** [CMakeFiles/testrunner.dir/build.make:387: testrunner] Error 1
make[2]: Leaving directory '/tmp/B.trsy4O/BUILD/zxing-cpp-6b3cbe02a332bff0f5ba0416f221d3d3876afdc2/build'
make[1]: *** [CMakeFiles/Makefile2:182: CMakeFiles/testrunner.dir/all] Error 2
make: *** [Makefile:131: all] Error 2
error: Bad exit status from /tmp/B.trsy4O/BUILD/tmp/rpm-tmp.73460 (%build)


RPM build errors:
    Bad exit status from /tmp/B.trsy4O/BUILD/tmp/rpm-tmp.73460 (%build)
ended at: Mon Apr 17 10:01:07 2017, done in 0:00:28.679909
error: No files produced.
mesg: ttyname failed: Inappropriate ioctl for device
+ chmod -R u+rwX /tmp/B.trsy4O/BUILD
+ rm -rf /tmp/B.trsy4O/tmp /tmp/B.trsy4O/BUILD
mesg: ttyname failed: Inappropriate ioctl for device
+ rm -rf /tmp/B.trsy4O
Begin-PLD-Builder-Info
Build-Time: user:92.01s sys:7.44s real:31.45s (faults io:0 non-io:2413034)

End-PLD-Builder-Info
[Back to list of logs] [View rpm -qa of builder]