FailedOk

th/SRPMS[OK]
th/x32[OK]
th/i686[OK]
th/x86_64[OK]

ac/SRPMS[OK]
ac/i386[OK]
ac/i586[OK]
ac/i686[OK]
ac/alpha[OK]
ac/amd64[OK]
ac/athlon[OK]
ac/ppc[OK]
ac/sparc[OK]
ac/sparc64[OK]

Advanced Search
main()
Powered by PLD Linux
(c) 2002-2020 PLD Team
$Revision: 1.37 $
Powered by nasi tu byli.
Your IP: 3.237.254.197

lms 4ddcbcc7-d3c0-415a-8bb2-fa1660bd6702

Status:OK
Source URL:https://buildlogs.pld-linux.org/pld/th/x86_64/OK/lms,4ddcbcc7-d3c0-415a-8bb2-fa1660bd6702.bz2
text/plain URL:View!
full text:View!
rpm -qa of builder:View!
Date:2020/10/16 17:11:29
Runtime:0:00:38.682332

Toc:

  • error 1
  • make[2]: *** No rule to make target 'lib/libtscript.a', needed by 'parser.so'. Stop.
  • error 2
  • make[3]: *** [<builtin>: tscript_parser.c] Error 1
  • error 3
  • tscript_exec.h:4:10: fatal error: tscript_context.h: No such file or directory
  • error 4
  • compilation terminated.
  • error 5
  • make[3]: *** [Makefile:14: tscript_exec.o] Error 1
  • error 6
  • tscript_sysinfo.h:4:10: fatal error: tscript_context.h: No such file or directory
  • error 7
  • compilation terminated.
  • error 8
  • make[3]: *** [Makefile:14: tscript_sysinfo.o] Error 1
  • error 9
  • tscript_string.h:4:10: fatal error: tscript_context.h: No such file or directory
  • error 10
  • compilation terminated.
  • error 11
  • make[3]: *** [Makefile:14: tscript_string.o] Error 1
  • error 12
  • tscript_file.h:4:10: fatal error: tscript_context.h: No such file or directory
  • error 13
  • compilation terminated.
  • error 14
  • make[3]: *** [Makefile:14: tscript_file.o] Error 1
  • error 15
  • parser.c:32:10: fatal error: tscript_context.h: No such file or directory
  • error 16
  • compilation terminated.
  • error 17
  • make[2]: *** [<builtin>: parser.o] Error 1
  • error 18
  • net.h:4:10: fatal error: tscript_context.h: No such file or directory
  • error 19
  • compilation terminated.
  • error 20
  • make[3]: *** [Makefile:14: net.o] Error 1
  • error 21
  • sql.h:4:10: fatal error: tscript_context.h: No such file or directory
  • error 22
  • compilation terminated.
  • error 23
  • make[3]: *** [Makefile:14: sql.o] Error 1
  • error 24
  • make[2]: *** [Makefile:20: ext] Error 2
  • error 25
  • make[2]: *** [Makefile:17: libs] Error 2
  • install
  • Executing(%install): /bin/sh -e /tmp/B.BHJf8e/BUILD/tmp/rpm-tmp.9426
  • files lms
  • Processing files: lms-1.11.13-12.x86_64
  • doc
  • Executing(%doc): /bin/sh -e /tmp/B.BHJf8e/BUILD/tmp/rpm-tmp.69335
  • error 26
  • error: Couldn't exec /usr/lib/rpm/php.prov: No such file or directory
  • error 27
  • error: Couldn't exec /usr/lib/rpm/php.prov: No such file or directory
  • error 28
  • error: Couldn't exec /usr/lib/rpm/php.prov: No such file or directory
  • error 29
  • error: Couldn't exec /usr/lib/rpm/php.prov: No such file or directory
  • error 30
  • error: Couldn't exec /usr/lib/rpm/php.prov: No such file or directory
  • error 31
  • error: Couldn't exec /usr/lib/rpm/php.prov: No such file or directory
  • error 32
  • error: Couldn't exec /usr/lib/rpm/php.prov: No such file or directory
  • error 33
  • error: Couldn't exec /usr/lib/rpm/php.prov: No such file or directory
  • error 34
  • error: Couldn't exec /usr/lib/rpm/php.prov: No such file or directory
  • error 35
  • error: Couldn't exec /usr/lib/rpm/php.prov: No such file or directory
  • error 36
  • error: Couldn't exec /usr/lib/rpm/php.prov: No such file or directory
  • error 37
  • error: Couldn't exec /usr/lib/rpm/php.prov: No such file or directory
  • error 38
  • error: Couldn't exec /usr/lib/rpm/php.prov: No such file or directory
  • error 39
  • error: Couldn't exec /usr/lib/rpm/php.prov: No such file or directory
  • error 40
  • error: Couldn't exec /usr/lib/rpm/php.prov: No such file or directory
  • error 41
  • error: Couldn't exec /usr/lib/rpm/php.prov: No such file or directory
  • error 42
  • error: Couldn't exec /usr/lib/rpm/php.prov: No such file or directory
  • error 43
  • error: Couldn't exec /usr/lib/rpm/php.prov: No such file or directory
  • error 44
  • error: Couldn't exec /usr/lib/rpm/php.prov: No such file or directory
  • error 45
  • error: Couldn't exec /usr/lib/rpm/php.prov: No such file or directory
  • error 46
  • error: Couldn't exec /usr/lib/rpm/php.prov: No such file or directory
  • error 47
  • error: Couldn't exec /usr/lib/rpm/php.prov: No such file or directory
  • error 48
  • error: Couldn't exec /usr/lib/rpm/php.prov: No such file or directory
  • error 49
  • error: Couldn't exec /usr/lib/rpm/php.prov: No such file or directory
  • error 50
  • error: Couldn't exec /usr/lib/rpm/php.prov: No such file or directory
  • error 51
  • error: Couldn't exec /usr/lib/rpm/php.prov: No such file or directory
  • error 52
  • error: Couldn't exec /usr/lib/rpm/php.prov: No such file or directory
  • error 53
  • error: Couldn't exec /usr/lib/rpm/php.prov: No such file or directory
  • error 54
  • error: Couldn't exec /usr/lib/rpm/php.prov: No such file or directory
  • error 55
  • error: Couldn't exec /usr/lib/rpm/php.prov: No such file or directory
  • error 56
  • error: Couldn't exec /usr/lib/rpm/php.prov: No such file or directory
  • error 57
  • error: Couldn't exec /usr/lib/rpm/php.prov: No such file or directory
  • error 58
  • error: Couldn't exec /usr/lib/rpm/php.prov: No such file or directory
  • error 59
  • error: Couldn't exec /usr/lib/rpm/php.prov: No such file or directory
  • error 60
  • error: Couldn't exec /usr/lib/rpm/php.prov: No such file or directory
  • error 61
  • error: Couldn't exec /usr/lib/rpm/php.prov: No such file or directory
  • error 62
  • error: Couldn't exec /usr/lib/rpm/php.prov: No such file or directory
  • error 63
  • error: Couldn't exec /usr/lib/rpm/php.prov: No such file or directory
  • error 64
  • error: Couldn't exec /usr/lib/rpm/php.prov: No such file or directory
  • error 65
  • error: Couldn't exec /usr/lib/rpm/php.prov: No such file or directory
  • error 66
  • error: Couldn't exec /usr/lib/rpm/php.prov: No such file or directory
  • error 67
  • error: Couldn't exec /usr/lib/rpm/php.prov: No such file or directory
  • error 68
  • error: Couldn't exec /usr/lib/rpm/php.prov: No such file or directory
  • error 69
  • error: Couldn't exec /usr/lib/rpm/php.prov: No such file or directory
  • error 70
  • error: Couldn't exec /usr/lib/rpm/php.prov: No such file or directory
  • error 71
  • error: Couldn't exec /usr/lib/rpm/php.prov: No such file or directory
  • error 72
  • error: Couldn't exec /usr/lib/rpm/php.prov: No such file or directory
  • error 73
  • error: Couldn't exec /usr/lib/rpm/php.prov: No such file or directory
  • error 74
  • error: Couldn't exec /usr/lib/rpm/php.prov: No such file or directory
  • error 75
  • error: Couldn't exec /usr/lib/rpm/php.prov: No such file or directory
  • error 76
  • error: Couldn't exec /usr/lib/rpm/php.prov: No such file or directory
  • error 77
  • error: Couldn't exec /usr/lib/rpm/php.prov: No such file or directory
  • error 78
  • error: Couldn't exec /usr/lib/rpm/php.prov: No such file or directory
  • error 79
  • error: Couldn't exec /usr/lib/rpm/php.prov: No such file or directory
  • error 80
  • error: Couldn't exec /usr/lib/rpm/php.prov: No such file or directory
  • error 81
  • error: Couldn't exec /usr/lib/rpm/php.prov: No such file or directory
  • error 82
  • error: Couldn't exec /usr/lib/rpm/php.prov: No such file or directory
  • error 83
  • error: Couldn't exec /usr/lib/rpm/php.prov: No such file or directory
  • error 84
  • error: Couldn't exec /usr/lib/rpm/php.prov: No such file or directory
  • error 85
  • error: Couldn't exec /usr/lib/rpm/php.prov: No such file or directory
  • error 86
  • error: Couldn't exec /usr/lib/rpm/php.prov: No such file or directory
  • error 87
  • error: Couldn't exec /usr/lib/rpm/php.prov: No such file or directory
  • error 88
  • error: Couldn't exec /usr/lib/rpm/php.prov: No such file or directory
  • error 89
  • error: Couldn't exec /usr/lib/rpm/php.prov: No such file or directory
  • error 90
  • error: Couldn't exec /usr/lib/rpm/php.prov: No such file or directory
  • error 91
  • error: Couldn't exec /usr/lib/rpm/php.prov: No such file or directory
  • error 92
  • error: Couldn't exec /usr/lib/rpm/php.prov: No such file or directory
  • error 93
  • error: Couldn't exec /usr/lib/rpm/php.prov: No such file or directory
  • error 94
  • error: Couldn't exec /usr/lib/rpm/php.prov: No such file or directory
  • error 95
  • error: Couldn't exec /usr/lib/rpm/php.prov: No such file or directory
  • error 96
  • error: Couldn't exec /usr/lib/rpm/php.prov: No such file or directory
  • error 97
  • error: Couldn't exec /usr/lib/rpm/php.prov: No such file or directory
  • error 98
  • error: Couldn't exec /usr/lib/rpm/php.prov: No such file or directory
  • error 99
  • error: Couldn't exec /usr/lib/rpm/php.prov: No such file or directory
  • error 100
  • error: Couldn't exec /usr/lib/rpm/php.prov: No such file or directory
  • error 101
  • error: Couldn't exec /usr/lib/rpm/php.prov: No such file or directory
  • error 102
  • error: Couldn't exec /usr/lib/rpm/php.prov: No such file or directory
  • error 103
  • error: Couldn't exec /usr/lib/rpm/php.prov: No such file or directory
  • error 104
  • error: Couldn't exec /usr/lib/rpm/php.prov: No such file or directory
  • error 105
  • error: Couldn't exec /usr/lib/rpm/php.prov: No such file or directory
  • error 106
  • error: Couldn't exec /usr/lib/rpm/php.prov: No such file or directory
  • error 107
  • error: Couldn't exec /usr/lib/rpm/php.prov: No such file or directory
  • error 108
  • error: Couldn't exec /usr/lib/rpm/php.prov: No such file or directory
  • error 109
  • error: Couldn't exec /usr/lib/rpm/php.prov: No such file or directory
  • error 110
  • error: Couldn't exec /usr/lib/rpm/php.prov: No such file or directory
  • error 111
  • error: Couldn't exec /usr/lib/rpm/php.prov: No such file or directory
  • error 112
  • error: Couldn't exec /usr/lib/rpm/php.prov: No such file or directory
  • error 113
  • error: Couldn't exec /usr/lib/rpm/php.prov: No such file or directory
  • error 114
  • error: Couldn't exec /usr/lib/rpm/php.prov: No such file or directory
  • error 115
  • error: Couldn't exec /usr/lib/rpm/php.prov: No such file or directory
  • error 116
  • error: Couldn't exec /usr/lib/rpm/php.prov: No such file or directory
  • error 117
  • error: Couldn't exec /usr/lib/rpm/php.prov: No such file or directory
  • error 118
  • error: Couldn't exec /usr/lib/rpm/php.prov: No such file or directory
  • error 119
  • error: Couldn't exec /usr/lib/rpm/php.prov: No such file or directory
  • error 120
  • error: Couldn't exec /usr/lib/rpm/php.prov: No such file or directory
  • error 121
  • error: Couldn't exec /usr/lib/rpm/php.prov: No such file or directory
  • error 122
  • error: Couldn't exec /usr/lib/rpm/php.prov: No such file or directory
  • error 123
  • error: Couldn't exec /usr/lib/rpm/php.prov: No such file or directory
  • error 124
  • error: Couldn't exec /usr/lib/rpm/php.prov: No such file or directory
  • error 125
  • error: Couldn't exec /usr/lib/rpm/php.prov: No such file or directory
  • error 126
  • error: Couldn't exec /usr/lib/rpm/php.prov: No such file or directory
  • error 127
  • error: Couldn't exec /usr/lib/rpm/php.prov: No such file or directory
  • error 128
  • error: Couldn't exec /usr/lib/rpm/php.prov: No such file or directory
  • error 129
  • error: Couldn't exec /usr/lib/rpm/php.prov: No such file or directory
  • error 130
  • error: Couldn't exec /usr/lib/rpm/php.prov: No such file or directory
  • error 131
  • error: Couldn't exec /usr/lib/rpm/php.prov: No such file or directory
  • error 132
  • error: Couldn't exec /usr/lib/rpm/php.prov: No such file or directory
  • error 133
  • error: Couldn't exec /usr/lib/rpm/php.prov: No such file or directory
  • error 134
  • error: Couldn't exec /usr/lib/rpm/php.prov: No such file or directory
  • error 135
  • error: Couldn't exec /usr/lib/rpm/php.prov: No such file or directory
  • error 136
  • error: Couldn't exec /usr/lib/rpm/php.prov: No such file or directory
  • error 137
  • error: Couldn't exec /usr/lib/rpm/php.prov: No such file or directory
  • error 138
  • error: Couldn't exec /usr/lib/rpm/php.prov: No such file or directory
  • error 139
  • error: Couldn't exec /usr/lib/rpm/php.prov: No such file or directory
  • error 140
  • error: Couldn't exec /usr/lib/rpm/php.prov: No such file or directory
  • error 141
  • error: Couldn't exec /usr/lib/rpm/php.prov: No such file or directory
  • error 142
  • error: Couldn't exec /usr/lib/rpm/php.prov: No such file or directory
  • error 143
  • error: Couldn't exec /usr/lib/rpm/php.prov: No such file or directory
  • error 144
  • error: Couldn't exec /usr/lib/rpm/php.prov: No such file or directory
  • error 145
  • error: Couldn't exec /usr/lib/rpm/php.prov: No such file or directory
  • error 146
  • error: Couldn't exec /usr/lib/rpm/php.prov: No such file or directory
  • error 147
  • error: Couldn't exec /usr/lib/rpm/php.prov: No such file or directory
  • error 148
  • error: Couldn't exec /usr/lib/rpm/php.prov: No such file or directory
  • error 149
  • error: Couldn't exec /usr/lib/rpm/php.prov: No such file or directory
  • error 150
  • error: Couldn't exec /usr/lib/rpm/php.prov: No such file or directory
  • error 151
  • error: Couldn't exec /usr/lib/rpm/php.prov: No such file or directory
  • error 152
  • error: Couldn't exec /usr/lib/rpm/php.prov: No such file or directory
  • error 153
  • error: Couldn't exec /usr/lib/rpm/php.prov: No such file or directory
  • error 154
  • error: Couldn't exec /usr/lib/rpm/php.prov: No such file or directory
  • error 155
  • error: Couldn't exec /usr/lib/rpm/php.prov: No such file or directory
  • error 156
  • error: Couldn't exec /usr/lib/rpm/php.prov: No such file or directory
  • error 157
  • error: Couldn't exec /usr/lib/rpm/php.prov: No such file or directory
  • error 158
  • error: Couldn't exec /usr/lib/rpm/php.prov: No such file or directory
  • error 159
  • error: Couldn't exec /usr/lib/rpm/php.prov: No such file or directory
  • error 160
  • error: Couldn't exec /usr/lib/rpm/php.prov: No such file or directory
  • error 161
  • error: Couldn't exec /usr/lib/rpm/php.prov: No such file or directory
  • error 162
  • error: Couldn't exec /usr/lib/rpm/php.prov: No such file or directory
  • error 163
  • error: Couldn't exec /usr/lib/rpm/php.prov: No such file or directory
  • error 164
  • error: Couldn't exec /usr/lib/rpm/php.prov: No such file or directory
  • error 165
  • error: Couldn't exec /usr/lib/rpm/php.prov: No such file or directory
  • error 166
  • error: Couldn't exec /usr/lib/rpm/php.prov: No such file or directory
  • error 167
  • error: Couldn't exec /usr/lib/rpm/php.prov: No such file or directory
  • error 168
  • error: Couldn't exec /usr/lib/rpm/php.prov: No such file or directory
  • error 169
  • error: Couldn't exec /usr/lib/rpm/php.prov: No such file or directory
  • error 170
  • error: Couldn't exec /usr/lib/rpm/php.prov: No such file or directory
  • error 171
  • error: Couldn't exec /usr/lib/rpm/php.prov: No such file or directory
  • error 172
  • error: Couldn't exec /usr/lib/rpm/php.prov: No such file or directory
  • error 173
  • error: Couldn't exec /usr/lib/rpm/php.prov: No such file or directory
  • error 174
  • error: Couldn't exec /usr/lib/rpm/php.prov: No such file or directory
  • error 175
  • error: Couldn't exec /usr/lib/rpm/php.prov: No such file or directory
  • error 176
  • error: Couldn't exec /usr/lib/rpm/php.prov: No such file or directory
  • error 177
  • error: Couldn't exec /usr/lib/rpm/php.prov: No such file or directory
  • error 178
  • error: Couldn't exec /usr/lib/rpm/php.prov: No such file or directory
  • error 179
  • error: Couldn't exec /usr/lib/rpm/php.prov: No such file or directory
  • error 180
  • error: Couldn't exec /usr/lib/rpm/php.prov: No such file or directory
  • error 181
  • error: Couldn't exec /usr/lib/rpm/php.prov: No such file or directory
  • error 182
  • error: Couldn't exec /usr/lib/rpm/php.prov: No such file or directory
  • error 183
  • error: Couldn't exec /usr/lib/rpm/php.prov: No such file or directory
  • error 184
  • error: Couldn't exec /usr/lib/rpm/php.prov: No such file or directory
  • error 185
  • error: Couldn't exec /usr/lib/rpm/php.prov: No such file or directory
  • error 186
  • error: Couldn't exec /usr/lib/rpm/php.prov: No such file or directory
  • error 187
  • error: Couldn't exec /usr/lib/rpm/php.prov: No such file or directory
  • error 188
  • error: Couldn't exec /usr/lib/rpm/php.prov: No such file or directory
  • error 189
  • error: Couldn't exec /usr/lib/rpm/php.prov: No such file or directory
  • error 190
  • error: Couldn't exec /usr/lib/rpm/php.prov: No such file or directory
  • error 191
  • error: Couldn't exec /usr/lib/rpm/php.prov: No such file or directory
  • error 192
  • error: Couldn't exec /usr/lib/rpm/php.prov: No such file or directory
  • error 193
  • error: Couldn't exec /usr/lib/rpm/php.prov: No such file or directory
  • error 194
  • error: Couldn't exec /usr/lib/rpm/php.prov: No such file or directory
  • error 195
  • error: Couldn't exec /usr/lib/rpm/php.prov: No such file or directory
  • error 196
  • error: Couldn't exec /usr/lib/rpm/php.prov: No such file or directory
  • error 197
  • error: Couldn't exec /usr/lib/rpm/php.prov: No such file or directory
  • error 198
  • error: Couldn't exec /usr/lib/rpm/php.prov: No such file or directory
  • error 199
  • error: Couldn't exec /usr/lib/rpm/php.prov: No such file or directory
  • error 200
  • error: Couldn't exec /usr/lib/rpm/php.prov: No such file or directory
  • error 201
  • error: Couldn't exec /usr/lib/rpm/php.prov: No such file or directory
  • error 202
  • error: Couldn't exec /usr/lib/rpm/php.prov: No such file or directory
  • error 203
  • error: Couldn't exec /usr/lib/rpm/php.prov: No such file or directory
  • error 204
  • error: Couldn't exec /usr/lib/rpm/php.prov: No such file or directory
  • error 205
  • error: Couldn't exec /usr/lib/rpm/php.prov: No such file or directory
  • error 206
  • error: Couldn't exec /usr/lib/rpm/php.prov: No such file or directory
  • error 207
  • error: Couldn't exec /usr/lib/rpm/php.prov: No such file or directory
  • error 208
  • error: Couldn't exec /usr/lib/rpm/php.prov: No such file or directory
  • error 209
  • error: Couldn't exec /usr/lib/rpm/php.prov: No such file or directory
  • error 210
  • error: Couldn't exec /usr/lib/rpm/php.prov: No such file or directory
  • error 211
  • error: Couldn't exec /usr/lib/rpm/php.prov: No such file or directory
  • error 212
  • error: Couldn't exec /usr/lib/rpm/php.prov: No such file or directory
  • error 213
  • error: Couldn't exec /usr/lib/rpm/php.prov: No such file or directory
  • error 214
  • error: Couldn't exec /usr/lib/rpm/php.prov: No such file or directory
  • error 215
  • error: Couldn't exec /usr/lib/rpm/php.prov: No such file or directory
  • error 216
  • error: Couldn't exec /usr/lib/rpm/php.prov: No such file or directory
  • error 217
  • error: Couldn't exec /usr/lib/rpm/php.prov: No such file or directory
  • error 218
  • error: Couldn't exec /usr/lib/rpm/php.prov: No such file or directory
  • error 219
  • error: Couldn't exec /usr/lib/rpm/php.prov: No such file or directory
  • error 220
  • error: Couldn't exec /usr/lib/rpm/php.prov: No such file or directory
  • error 221
  • error: Couldn't exec /usr/lib/rpm/php.prov: No such file or directory
  • error 222
  • error: Couldn't exec /usr/lib/rpm/php.prov: No such file or directory
  • error 223
  • error: Couldn't exec /usr/lib/rpm/php.prov: No such file or directory
  • error 224
  • error: Couldn't exec /usr/lib/rpm/php.prov: No such file or directory
  • error 225
  • error: Couldn't exec /usr/lib/rpm/php.prov: No such file or directory
  • error 226
  • error: Couldn't exec /usr/lib/rpm/php.prov: No such file or directory
  • error 227
  • error: Couldn't exec /usr/lib/rpm/php.prov: No such file or directory
  • error 228
  • error: Couldn't exec /usr/lib/rpm/php.prov: No such file or directory
  • error 229
  • error: Couldn't exec /usr/lib/rpm/php.prov: No such file or directory
  • error 230
  • error: Couldn't exec /usr/lib/rpm/php.prov: No such file or directory
  • error 231
  • error: Couldn't exec /usr/lib/rpm/php.prov: No such file or directory
  • error 232
  • error: Couldn't exec /usr/lib/rpm/php.prov: No such file or directory
  • error 233
  • error: Couldn't exec /usr/lib/rpm/php.prov: No such file or directory
  • error 234
  • error: Couldn't exec /usr/lib/rpm/php.prov: No such file or directory
  • error 235
  • error: Couldn't exec /usr/lib/rpm/php.prov: No such file or directory
  • error 236
  • error: Couldn't exec /usr/lib/rpm/php.prov: No such file or directory
  • error 237
  • error: Couldn't exec /usr/lib/rpm/php.prov: No such file or directory
  • error 238
  • error: Couldn't exec /usr/lib/rpm/php.prov: No such file or directory
  • error 239
  • error: Couldn't exec /usr/lib/rpm/php.prov: No such file or directory
  • error 240
  • error: Couldn't exec /usr/lib/rpm/php.prov: No such file or directory
  • error 241
  • error: Couldn't exec /usr/lib/rpm/php.prov: No such file or directory
  • error 242
  • error: Couldn't exec /usr/lib/rpm/php.prov: No such file or directory
  • error 243
  • error: Couldn't exec /usr/lib/rpm/php.prov: No such file or directory
  • error 244
  • error: Couldn't exec /usr/lib/rpm/php.prov: No such file or directory
  • error 245
  • error: Couldn't exec /usr/lib/rpm/php.prov: No such file or directory
  • error 246
  • error: Couldn't exec /usr/lib/rpm/php.prov: No such file or directory
  • error 247
  • error: Couldn't exec /usr/lib/rpm/php.prov: No such file or directory
  • error 248
  • error: Couldn't exec /usr/lib/rpm/php.prov: No such file or directory
  • error 249
  • error: Couldn't exec /usr/lib/rpm/php.prov: No such file or directory
  • error 250
  • error: Couldn't exec /usr/lib/rpm/php.prov: No such file or directory
  • error 251
  • error: Couldn't exec /usr/lib/rpm/php.prov: No such file or directory
  • error 252
  • error: Couldn't exec /usr/lib/rpm/php.prov: No such file or directory
  • error 253
  • error: Couldn't exec /usr/lib/rpm/php.prov: No such file or directory
  • error 254
  • error: Couldn't exec /usr/lib/rpm/php.prov: No such file or directory
  • error 255
  • error: Couldn't exec /usr/lib/rpm/php.prov: No such file or directory
  • error 256
  • error: Couldn't exec /usr/lib/rpm/php.prov: No such file or directory
  • error 257
  • error: Couldn't exec /usr/lib/rpm/php.prov: No such file or directory
  • error 258
  • error: Couldn't exec /usr/lib/rpm/php.prov: No such file or directory
  • error 259
  • error: Couldn't exec /usr/lib/rpm/php.prov: No such file or directory
  • error 260
  • error: Couldn't exec /usr/lib/rpm/php.prov: No such file or directory
  • error 261
  • error: Couldn't exec /usr/lib/rpm/php.prov: No such file or directory
  • error 262
  • error: Couldn't exec /usr/lib/rpm/php.prov: No such file or directory
  • error 263
  • error: Couldn't exec /usr/lib/rpm/php.prov: No such file or directory
  • error 264
  • error: Couldn't exec /usr/lib/rpm/php.prov: No such file or directory
  • error 265
  • error: Couldn't exec /usr/lib/rpm/php.prov: No such file or directory
  • error 266
  • error: Couldn't exec /usr/lib/rpm/php.prov: No such file or directory
  • error 267
  • error: Couldn't exec /usr/lib/rpm/php.prov: No such file or directory
  • error 268
  • error: Couldn't exec /usr/lib/rpm/php.prov: No such file or directory
  • error 269
  • error: Couldn't exec /usr/lib/rpm/php.prov: No such file or directory
  • error 270
  • error: Couldn't exec /usr/lib/rpm/php.prov: No such file or directory
  • error 271
  • error: Couldn't exec /usr/lib/rpm/php.prov: No such file or directory
  • error 272
  • error: Couldn't exec /usr/lib/rpm/php.prov: No such file or directory
  • error 273
  • error: Couldn't exec /usr/lib/rpm/php.prov: No such file or directory
  • error 274
  • error: Couldn't exec /usr/lib/rpm/php.prov: No such file or directory
  • error 275
  • error: Couldn't exec /usr/lib/rpm/php.prov: No such file or directory
  • error 276
  • error: Couldn't exec /usr/lib/rpm/php.prov: No such file or directory
  • error 277
  • error: Couldn't exec /usr/lib/rpm/php.prov: No such file or directory
  • error 278
  • error: Couldn't exec /usr/lib/rpm/php.prov: No such file or directory
  • error 279
  • error: Couldn't exec /usr/lib/rpm/php.prov: No such file or directory
  • error 280
  • error: Couldn't exec /usr/lib/rpm/php.prov: No such file or directory
  • error 281
  • error: Couldn't exec /usr/lib/rpm/php.prov: No such file or directory
  • error 282
  • error: Couldn't exec /usr/lib/rpm/php.prov: No such file or directory
  • error 283
  • error: Couldn't exec /usr/lib/rpm/php.prov: No such file or directory
  • error 284
  • error: Couldn't exec /usr/lib/rpm/php.prov: No such file or directory
  • error 285
  • error: Couldn't exec /usr/lib/rpm/php.prov: No such file or directory
  • error 286
  • error: Couldn't exec /usr/lib/rpm/php.prov: No such file or directory
  • error 287
  • error: Couldn't exec /usr/lib/rpm/php.prov: No such file or directory
  • error 288
  • error: Couldn't exec /usr/lib/rpm/php.prov: No such file or directory
  • error 289
  • error: Couldn't exec /usr/lib/rpm/php.prov: No such file or directory
  • error 290
  • error: Couldn't exec /usr/lib/rpm/php.prov: No such file or directory
  • error 291
  • error: Couldn't exec /usr/lib/rpm/php.prov: No such file or directory
  • error 292
  • error: Couldn't exec /usr/lib/rpm/php.prov: No such file or directory
  • error 293
  • error: Couldn't exec /usr/lib/rpm/php.prov: No such file or directory
  • error 294
  • error: Couldn't exec /usr/lib/rpm/php.prov: No such file or directory
  • error 295
  • error: Couldn't exec /usr/lib/rpm/php.prov: No such file or directory
  • error 296
  • error: Couldn't exec /usr/lib/rpm/php.prov: No such file or directory
  • error 297
  • error: Couldn't exec /usr/lib/rpm/php.prov: No such file or directory
  • error 298
  • error: Couldn't exec /usr/lib/rpm/php.prov: No such file or directory
  • error 299
  • error: Couldn't exec /usr/lib/rpm/php.prov: No such file or directory
  • error 300
  • error: Couldn't exec /usr/lib/rpm/php.prov: No such file or directory
  • error 301
  • error: Couldn't exec /usr/lib/rpm/php.prov: No such file or directory
  • error 302
  • error: Couldn't exec /usr/lib/rpm/php.prov: No such file or directory
  • error 303
  • error: Couldn't exec /usr/lib/rpm/php.prov: No such file or directory
  • error 304
  • error: Couldn't exec /usr/lib/rpm/php.prov: No such file or directory
  • error 305
  • error: Couldn't exec /usr/lib/rpm/php.prov: No such file or directory
  • error 306
  • error: Couldn't exec /usr/lib/rpm/php.prov: No such file or directory
  • error 307
  • error: Couldn't exec /usr/lib/rpm/php.prov: No such file or directory
  • error 308
  • error: Couldn't exec /usr/lib/rpm/php.prov: No such file or directory
  • error 309
  • error: Couldn't exec /usr/lib/rpm/php.prov: No such file or directory
  • error 310
  • error: Couldn't exec /usr/lib/rpm/php.prov: No such file or directory
  • error 311
  • error: Couldn't exec /usr/lib/rpm/php.prov: No such file or directory
  • error 312
  • error: Couldn't exec /usr/lib/rpm/php.prov: No such file or directory
  • error 313
  • error: Couldn't exec /usr/lib/rpm/php.prov: No such file or directory
  • error 314
  • error: Couldn't exec /usr/lib/rpm/php.prov: No such file or directory
  • error 315
  • error: Couldn't exec /usr/lib/rpm/php.prov: No such file or directory
  • error 316
  • error: Couldn't exec /usr/lib/rpm/php.prov: No such file or directory
  • error 317
  • error: Couldn't exec /usr/lib/rpm/php.prov: No such file or directory
  • error 318
  • error: Couldn't exec /usr/lib/rpm/php.prov: No such file or directory
  • error 319
  • error: Couldn't exec /usr/lib/rpm/php.prov: No such file or directory
  • error 320
  • error: Couldn't exec /usr/lib/rpm/php.prov: No such file or directory
  • error 321
  • error: Couldn't exec /usr/lib/rpm/php.prov: No such file or directory
  • error 322
  • error: Couldn't exec /usr/lib/rpm/php.prov: No such file or directory
  • error 323
  • error: Couldn't exec /usr/lib/rpm/php.prov: No such file or directory
  • error 324
  • error: Couldn't exec /usr/lib/rpm/php.prov: No such file or directory
  • error 325
  • error: Couldn't exec /usr/lib/rpm/php.prov: No such file or directory
  • error 326
  • error: Couldn't exec /usr/lib/rpm/php.prov: No such file or directory
  • error 327
  • error: Couldn't exec /usr/lib/rpm/php.prov: No such file or directory
  • error 328
  • error: Couldn't exec /usr/lib/rpm/php.prov: No such file or directory
  • error 329
  • error: Couldn't exec /usr/lib/rpm/php.prov: No such file or directory
  • error 330
  • error: Couldn't exec /usr/lib/rpm/php.prov: No such file or directory
  • error 331
  • error: Couldn't exec /usr/lib/rpm/php.prov: No such file or directory
  • error 332
  • error: Couldn't exec /usr/lib/rpm/php.prov: No such file or directory
  • error 333
  • error: Couldn't exec /usr/lib/rpm/php.prov: No such file or directory
  • error 334
  • error: Couldn't exec /usr/lib/rpm/php.prov: No such file or directory
  • error 335
  • error: Couldn't exec /usr/lib/rpm/php.prov: No such file or directory
  • error 336
  • error: Couldn't exec /usr/lib/rpm/php.prov: No such file or directory
  • error 337
  • error: Couldn't exec /usr/lib/rpm/php.prov: No such file or directory
  • error 338
  • error: Couldn't exec /usr/lib/rpm/php.prov: No such file or directory
  • error 339
  • error: Couldn't exec /usr/lib/rpm/php.prov: No such file or directory
  • error 340
  • error: Couldn't exec /usr/lib/rpm/php.prov: No such file or directory
  • error 341
  • error: Couldn't exec /usr/lib/rpm/php.prov: No such file or directory
  • error 342
  • error: Couldn't exec /usr/lib/rpm/php.prov: No such file or directory
  • error 343
  • error: Couldn't exec /usr/lib/rpm/php.prov: No such file or directory
  • error 344
  • error: Couldn't exec /usr/lib/rpm/php.prov: No such file or directory
  • error 345
  • error: Couldn't exec /usr/lib/rpm/php.prov: No such file or directory
  • error 346
  • error: Couldn't exec /usr/lib/rpm/php.prov: No such file or directory
  • error 347
  • error: Couldn't exec /usr/lib/rpm/php.prov: No such file or directory
  • error 348
  • error: Couldn't exec /usr/lib/rpm/php.prov: No such file or directory
  • error 349
  • error: Couldn't exec /usr/lib/rpm/php.prov: No such file or directory
  • error 350
  • error: Couldn't exec /usr/lib/rpm/php.prov: No such file or directory
  • error 351
  • error: Couldn't exec /usr/lib/rpm/php.prov: No such file or directory
  • error 352
  • error: Couldn't exec /usr/lib/rpm/php.prov: No such file or directory
  • error 353
  • error: Couldn't exec /usr/lib/rpm/php.prov: No such file or directory
  • error 354
  • error: Couldn't exec /usr/lib/rpm/php.prov: No such file or directory
  • error 355
  • error: Couldn't exec /usr/lib/rpm/php.prov: No such file or directory
  • error 356
  • error: Couldn't exec /usr/lib/rpm/php.prov: No such file or directory
  • error 357
  • error: Couldn't exec /usr/lib/rpm/php.prov: No such file or directory
  • error 358
  • error: Couldn't exec /usr/lib/rpm/php.prov: No such file or directory
  • error 359
  • error: Couldn't exec /usr/lib/rpm/php.prov: No such file or directory
  • error 360
  • error: Couldn't exec /usr/lib/rpm/php.prov: No such file or directory
  • error 361
  • error: Couldn't exec /usr/lib/rpm/php.prov: No such file or directory
  • error 362
  • error: Couldn't exec /usr/lib/rpm/php.prov: No such file or directory
  • error 363
  • error: Couldn't exec /usr/lib/rpm/php.prov: No such file or directory
  • error 364
  • error: Couldn't exec /usr/lib/rpm/php.prov: No such file or directory
  • error 365
  • error: Couldn't exec /usr/lib/rpm/php.prov: No such file or directory
  • error 366
  • error: Couldn't exec /usr/lib/rpm/php.prov: No such file or directory
  • error 367
  • error: Couldn't exec /usr/lib/rpm/php.prov: No such file or directory
  • error 368
  • error: Couldn't exec /usr/lib/rpm/php.prov: No such file or directory
  • error 369
  • error: Couldn't exec /usr/lib/rpm/php.prov: No such file or directory
  • error 370
  • error: Couldn't exec /usr/lib/rpm/php.prov: No such file or directory
  • error 371
  • error: Couldn't exec /usr/lib/rpm/php.prov: No such file or directory
  • error 372
  • error: Couldn't exec /usr/lib/rpm/php.prov: No such file or directory
  • error 373
  • error: Couldn't exec /usr/lib/rpm/php.prov: No such file or directory
  • error 374
  • error: Couldn't exec /usr/lib/rpm/php.prov: No such file or directory
  • error 375
  • error: Couldn't exec /usr/lib/rpm/php.prov: No such file or directory
  • error 376
  • error: Couldn't exec /usr/lib/rpm/php.prov: No such file or directory
  • error 377
  • error: Couldn't exec /usr/lib/rpm/php.prov: No such file or directory
  • error 378
  • error: Couldn't exec /usr/lib/rpm/php.prov: No such file or directory
  • error 379
  • error: Couldn't exec /usr/lib/rpm/php.prov: No such file or directory
  • error 380
  • error: Couldn't exec /usr/lib/rpm/php.prov: No such file or directory
  • error 381
  • error: Couldn't exec /usr/lib/rpm/php.prov: No such file or directory
  • error 382
  • error: Couldn't exec /usr/lib/rpm/php.prov: No such file or directory
  • error 383
  • error: Couldn't exec /usr/lib/rpm/php.prov: No such file or directory
  • error 384
  • error: Couldn't exec /usr/lib/rpm/php.prov: No such file or directory
  • error 385
  • error: Couldn't exec /usr/lib/rpm/php.prov: No such file or directory
  • error 386
  • error: Couldn't exec /usr/lib/rpm/php.prov: No such file or directory
  • error 387
  • error: Couldn't exec /usr/lib/rpm/php.prov: No such file or directory
  • error 388
  • error: Couldn't exec /usr/lib/rpm/php.prov: No such file or directory
  • error 389
  • error: Couldn't exec /usr/lib/rpm/php.prov: No such file or directory
  • error 390
  • error: Couldn't exec /usr/lib/rpm/php.prov: No such file or directory
  • error 391
  • error: Couldn't exec /usr/lib/rpm/php.prov: No such file or directory
  • error 392
  • error: Couldn't exec /usr/lib/rpm/php.prov: No such file or directory
  • error 393
  • error: Couldn't exec /usr/lib/rpm/php.prov: No such file or directory
  • error 394
  • error: Couldn't exec /usr/lib/rpm/php.prov: No such file or directory
  • error 395
  • error: Couldn't exec /usr/lib/rpm/php.prov: No such file or directory
  • error 396
  • error: Couldn't exec /usr/lib/rpm/php.prov: No such file or directory
  • error 397
  • error: Couldn't exec /usr/lib/rpm/php.prov: No such file or directory
  • error 398
  • error: Couldn't exec /usr/lib/rpm/php.prov: No such file or directory
  • error 399
  • error: Couldn't exec /usr/lib/rpm/php.prov: No such file or directory
  • error 400
  • error: Couldn't exec /usr/lib/rpm/php.prov: No such file or directory
  • error 401
  • error: Couldn't exec /usr/lib/rpm/php.prov: No such file or directory
  • error 402
  • error: Couldn't exec /usr/lib/rpm/php.prov: No such file or directory
  • error 403
  • error: Couldn't exec /usr/lib/rpm/php.prov: No such file or directory
  • error 404
  • error: Couldn't exec /usr/lib/rpm/php.prov: No such file or directory
  • error 405
  • error: Couldn't exec /usr/lib/rpm/php.prov: No such file or directory
  • error 406
  • error: Couldn't exec /usr/lib/rpm/php.prov: No such file or directory
  • error 407
  • error: Couldn't exec /usr/lib/rpm/php.prov: No such file or directory
  • error 408
  • error: Couldn't exec /usr/lib/rpm/php.prov: No such file or directory
  • error 409
  • error: Couldn't exec /usr/lib/rpm/php.prov: No such file or directory
  • error 410
  • error: Couldn't exec /usr/lib/rpm/php.prov: No such file or directory
  • error 411
  • error: Couldn't exec /usr/lib/rpm/php.prov: No such file or directory
  • error 412
  • error: Couldn't exec /usr/lib/rpm/php.prov: No such file or directory
  • error 413
  • error: Couldn't exec /usr/lib/rpm/php.prov: No such file or directory
  • error 414
  • error: Couldn't exec /usr/lib/rpm/php.prov: No such file or directory
  • error 415
  • error: Couldn't exec /usr/lib/rpm/php.prov: No such file or directory
  • error 416
  • error: Couldn't exec /usr/lib/rpm/php.prov: No such file or directory
  • error 417
  • error: Couldn't exec /usr/lib/rpm/php.prov: No such file or directory
  • error 418
  • error: Couldn't exec /usr/lib/rpm/php.prov: No such file or directory
  • error 419
  • error: Couldn't exec /usr/lib/rpm/php.prov: No such file or directory
  • error 420
  • error: Couldn't exec /usr/lib/rpm/php.prov: No such file or directory
  • error 421
  • error: Couldn't exec /usr/lib/rpm/php.prov: No such file or directory
  • error 422
  • error: Couldn't exec /usr/lib/rpm/php.prov: No such file or directory
  • error 423
  • error: Couldn't exec /usr/lib/rpm/php.prov: No such file or directory
  • error 424
  • error: Couldn't exec /usr/lib/rpm/php.prov: No such file or directory
  • error 425
  • error: Couldn't exec /usr/lib/rpm/php.prov: No such file or directory
  • error 426
  • error: Couldn't exec /usr/lib/rpm/php.prov: No such file or directory
  • error 427
  • error: Couldn't exec /usr/lib/rpm/php.prov: No such file or directory
  • error 428
  • error: Couldn't exec /usr/lib/rpm/php.prov: No such file or directory
  • error 429
  • error: Couldn't exec /usr/lib/rpm/php.prov: No such file or directory
  • error 430
  • error: Couldn't exec /usr/lib/rpm/php.prov: No such file or directory
  • error 431
  • error: Couldn't exec /usr/lib/rpm/php.prov: No such file or directory
  • error 432
  • error: Couldn't exec /usr/lib/rpm/php.prov: No such file or directory
  • error 433
  • error: Couldn't exec /usr/lib/rpm/php.prov: No such file or directory
  • error 434
  • error: Couldn't exec /usr/lib/rpm/php.prov: No such file or directory
  • error 435
  • error: Couldn't exec /usr/lib/rpm/php.prov: No such file or directory
  • error 436
  • error: Couldn't exec /usr/lib/rpm/php.prov: No such file or directory
  • error 437
  • error: Couldn't exec /usr/lib/rpm/php.prov: No such file or directory
  • error 438
  • error: Couldn't exec /usr/lib/rpm/php.prov: No such file or directory
  • error 439
  • error: Couldn't exec /usr/lib/rpm/php.prov: No such file or directory
  • error 440
  • error: Couldn't exec /usr/lib/rpm/php.prov: No such file or directory
  • error 441
  • error: Couldn't exec /usr/lib/rpm/php.prov: No such file or directory
  • error 442
  • error: Couldn't exec /usr/lib/rpm/php.prov: No such file or directory
  • error 443
  • error: Couldn't exec /usr/lib/rpm/php.prov: No such file or directory
  • error 444
  • error: Couldn't exec /usr/lib/rpm/php.prov: No such file or directory
  • error 445
  • error: Couldn't exec /usr/lib/rpm/php.prov: No such file or directory
  • error 446
  • error: Couldn't exec /usr/lib/rpm/php.prov: No such file or directory
  • error 447
  • error: Couldn't exec /usr/lib/rpm/php.prov: No such file or directory
  • error 448
  • error: Couldn't exec /usr/lib/rpm/php.prov: No such file or directory
  • error 449
  • error: Couldn't exec /usr/lib/rpm/php.prov: No such file or directory
  • error 450
  • error: Couldn't exec /usr/lib/rpm/php.prov: No such file or directory
  • error 451
  • error: Couldn't exec /usr/lib/rpm/php.prov: No such file or directory
  • error 452
  • error: Couldn't exec /usr/lib/rpm/php.prov: No such file or directory
  • error 453
  • error: Couldn't exec /usr/lib/rpm/php.prov: No such file or directory
  • error 454
  • error: Couldn't exec /usr/lib/rpm/php.prov: No such file or directory
  • error 455
  • error: Couldn't exec /usr/lib/rpm/php.prov: No such file or directory
  • error 456
  • error: Couldn't exec /usr/lib/rpm/php.prov: No such file or directory
  • error 457
  • error: Couldn't exec /usr/lib/rpm/php.prov: No such file or directory
  • error 458
  • error: Couldn't exec /usr/lib/rpm/php.prov: No such file or directory
  • error 459
  • error: Couldn't exec /usr/lib/rpm/php.prov: No such file or directory
  • error 460
  • error: Couldn't exec /usr/lib/rpm/php.prov: No such file or directory
  • error 461
  • error: Couldn't exec /usr/lib/rpm/php.prov: No such file or directory
  • error 462
  • error: Couldn't exec /usr/lib/rpm/php.prov: No such file or directory
  • error 463
  • error: Couldn't exec /usr/lib/rpm/php.prov: No such file or directory
  • error 464
  • error: Couldn't exec /usr/lib/rpm/php.prov: No such file or directory
  • error 465
  • error: Couldn't exec /usr/lib/rpm/php.prov: No such file or directory
  • error 466
  • error: Couldn't exec /usr/lib/rpm/php.prov: No such file or directory
  • error 467
  • error: Couldn't exec /usr/lib/rpm/php.prov: No such file or directory
  • error 468
  • error: Couldn't exec /usr/lib/rpm/php.prov: No such file or directory
  • error 469
  • error: Couldn't exec /usr/lib/rpm/php.prov: No such file or directory
  • error 470
  • error: Couldn't exec /usr/lib/rpm/php.prov: No such file or directory
  • error 471
  • error: Couldn't exec /usr/lib/rpm/php.prov: No such file or directory
  • error 472
  • error: Couldn't exec /usr/lib/rpm/php.prov: No such file or directory
  • error 473
  • error: Couldn't exec /usr/lib/rpm/php.prov: No such file or directory
  • error 474
  • error: Couldn't exec /usr/lib/rpm/php.prov: No such file or directory
  • error 475
  • error: Couldn't exec /usr/lib/rpm/php.prov: No such file or directory
  • error 476
  • error: Couldn't exec /usr/lib/rpm/php.prov: No such file or directory
  • error 477
  • error: Couldn't exec /usr/lib/rpm/php.prov: No such file or directory
  • error 478
  • error: Couldn't exec /usr/lib/rpm/php.prov: No such file or directory
  • error 479
  • error: Couldn't exec /usr/lib/rpm/php.prov: No such file or directory
  • error 480
  • error: Couldn't exec /usr/lib/rpm/php.prov: No such file or directory
  • error 481
  • error: Couldn't exec /usr/lib/rpm/php.prov: No such file or directory
  • error 482
  • error: Couldn't exec /usr/lib/rpm/php.prov: No such file or directory
  • error 483
  • error: Couldn't exec /usr/lib/rpm/php.prov: No such file or directory
  • error 484
  • error: Couldn't exec /usr/lib/rpm/php.prov: No such file or directory
  • error 485
  • error: Couldn't exec /usr/lib/rpm/php.prov: No such file or directory
  • error 486
  • error: Couldn't exec /usr/lib/rpm/php.prov: No such file or directory
  • error 487
  • error: Couldn't exec /usr/lib/rpm/php.prov: No such file or directory
  • error 488
  • error: Couldn't exec /usr/lib/rpm/php.prov: No such file or directory
  • error 489
  • error: Couldn't exec /usr/lib/rpm/php.prov: No such file or directory
  • error 490
  • error: Couldn't exec /usr/lib/rpm/php.prov: No such file or directory
  • error 491
  • error: Couldn't exec /usr/lib/rpm/php.prov: No such file or directory
  • error 492
  • error: Couldn't exec /usr/lib/rpm/php.prov: No such file or directory
  • error 493
  • error: Couldn't exec /usr/lib/rpm/php.prov: No such file or directory
  • error 494
  • error: Couldn't exec /usr/lib/rpm/php.prov: No such file or directory
  • error 495
  • error: Couldn't exec /usr/lib/rpm/php.prov: No such file or directory
  • error 496
  • error: Couldn't exec /usr/lib/rpm/php.prov: No such file or directory
  • error 497
  • error: Couldn't exec /usr/lib/rpm/php.prov: No such file or directory
  • error 498
  • error: Couldn't exec /usr/lib/rpm/php.prov: No such file or directory
  • error 499
  • error: Couldn't exec /usr/lib/rpm/php.prov: No such file or directory
  • error 500
  • error: Couldn't exec /usr/lib/rpm/php.prov: No such file or directory
  • error 501
  • error: Couldn't exec /usr/lib/rpm/php.prov: No such file or directory
  • error 502
  • error: Couldn't exec /usr/lib/rpm/php.prov: No such file or directory
  • error 503
  • error: Couldn't exec /usr/lib/rpm/php.prov: No such file or directory
  • error 504
  • error: Couldn't exec /usr/lib/rpm/php.prov: No such file or directory
  • error 505
  • error: Couldn't exec /usr/lib/rpm/php.prov: No such file or directory
  • error 506
  • error: Couldn't exec /usr/lib/rpm/php.prov: No such file or directory
  • error 507
  • error: Couldn't exec /usr/lib/rpm/php.prov: No such file or directory
  • error 508
  • error: Couldn't exec /usr/lib/rpm/php.prov: No such file or directory
  • error 509
  • error: Couldn't exec /usr/lib/rpm/php.prov: No such file or directory
  • error 510
  • error: Couldn't exec /usr/lib/rpm/php.prov: No such file or directory
  • error 511
  • error: Couldn't exec /usr/lib/rpm/php.prov: No such file or directory
  • error 512
  • error: Couldn't exec /usr/lib/rpm/php.prov: No such file or directory
  • error 513
  • error: Couldn't exec /usr/lib/rpm/php.prov: No such file or directory
  • error 514
  • error: Couldn't exec /usr/lib/rpm/php.prov: No such file or directory
  • error 515
  • error: Couldn't exec /usr/lib/rpm/php.prov: No such file or directory
  • error 516
  • error: Couldn't exec /usr/lib/rpm/php.prov: No such file or directory
  • error 517
  • error: Couldn't exec /usr/lib/rpm/php.prov: No such file or directory
  • error 518
  • error: Couldn't exec /usr/lib/rpm/php.prov: No such file or directory
  • error 519
  • error: Couldn't exec /usr/lib/rpm/php.prov: No such file or directory
  • error 520
  • error: Couldn't exec /usr/lib/rpm/php.prov: No such file or directory
  • error 521
  • error: Couldn't exec /usr/lib/rpm/php.prov: No such file or directory
  • error 522
  • error: Couldn't exec /usr/lib/rpm/php.prov: No such file or directory
  • error 523
  • error: Couldn't exec /usr/lib/rpm/php.prov: No such file or directory
  • error 524
  • error: Couldn't exec /usr/lib/rpm/php.prov: No such file or directory
  • error 525
  • error: Couldn't exec /usr/lib/rpm/php.prov: No such file or directory
  • error 526
  • error: Couldn't exec /usr/lib/rpm/php.prov: No such file or directory
  • error 527
  • error: Couldn't exec /usr/lib/rpm/php.prov: No such file or directory
  • error 528
  • error: Couldn't exec /usr/lib/rpm/php.prov: No such file or directory
  • error 529
  • error: Couldn't exec /usr/lib/rpm/php.prov: No such file or directory
  • error 530
  • error: Couldn't exec /usr/lib/rpm/php.prov: No such file or directory
  • error 531
  • error: Couldn't exec /usr/lib/rpm/php.prov: No such file or directory
  • error 532
  • error: Couldn't exec /usr/lib/rpm/php.prov: No such file or directory
  • error 533
  • error: Couldn't exec /usr/lib/rpm/php.prov: No such file or directory
  • error 534
  • error: Couldn't exec /usr/lib/rpm/php.prov: No such file or directory
  • error 535
  • error: Couldn't exec /usr/lib/rpm/php.prov: No such file or directory
  • error 536
  • error: Couldn't exec /usr/lib/rpm/php.prov: No such file or directory
  • error 537
  • error: Couldn't exec /usr/lib/rpm/php.prov: No such file or directory
  • error 538
  • error: Couldn't exec /usr/lib/rpm/php.prov: No such file or directory
  • error 539
  • error: Couldn't exec /usr/lib/rpm/php.prov: No such file or directory
  • error 540
  • error: Couldn't exec /usr/lib/rpm/php.prov: No such file or directory
  • error 541
  • error: Couldn't exec /usr/lib/rpm/php.prov: No such file or directory
  • error 542
  • error: Couldn't exec /usr/lib/rpm/php.prov: No such file or directory
  • error 543
  • error: Couldn't exec /usr/lib/rpm/php.prov: No such file or directory
  • error 544
  • error: Couldn't exec /usr/lib/rpm/php.prov: No such file or directory
  • error 545
  • error: Couldn't exec /usr/lib/rpm/php.prov: No such file or directory
  • error 546
  • error: Couldn't exec /usr/lib/rpm/php.prov: No such file or directory
  • error 547
  • error: Couldn't exec /usr/lib/rpm/php.prov: No such file or directory
  • error 548
  • error: Couldn't exec /usr/lib/rpm/php.prov: No such file or directory
  • error 549
  • error: Couldn't exec /usr/lib/rpm/php.prov: No such file or directory
  • error 550
  • error: Couldn't exec /usr/lib/rpm/php.prov: No such file or directory
  • error 551
  • error: Couldn't exec /usr/lib/rpm/php.prov: No such file or directory
  • error 552
  • error: Couldn't exec /usr/lib/rpm/php.prov: No such file or directory
  • error 553
  • error: Couldn't exec /usr/lib/rpm/php.prov: No such file or directory
  • error 554
  • error: Couldn't exec /usr/lib/rpm/php.prov: No such file or directory
  • error 555
  • error: Couldn't exec /usr/lib/rpm/php.prov: No such file or directory
  • error 556
  • error: Couldn't exec /usr/lib/rpm/php.prov: No such file or directory
  • error 557
  • error: Couldn't exec /usr/lib/rpm/php.prov: No such file or directory
  • error 558
  • error: Couldn't exec /usr/lib/rpm/php.prov: No such file or directory
  • error 559
  • error: Couldn't exec /usr/lib/rpm/php.prov: No such file or directory
  • error 560
  • error: Couldn't exec /usr/lib/rpm/php.prov: No such file or directory
  • error 561
  • error: Couldn't exec /usr/lib/rpm/php.prov: No such file or directory
  • error 562
  • error: Couldn't exec /usr/lib/rpm/php.prov: No such file or directory
  • error 563
  • error: Couldn't exec /usr/lib/rpm/php.prov: No such file or directory
  • error 564
  • error: Couldn't exec /usr/lib/rpm/php.prov: No such file or directory
  • error 565
  • error: Couldn't exec /usr/lib/rpm/php.prov: No such file or directory
  • error 566
  • error: Couldn't exec /usr/lib/rpm/php.prov: No such file or directory
  • error 567
  • error: Couldn't exec /usr/lib/rpm/php.prov: No such file or directory
  • error 568
  • error: Couldn't exec /usr/lib/rpm/php.prov: No such file or directory
  • error 569
  • error: Couldn't exec /usr/lib/rpm/php.prov: No such file or directory
  • error 570
  • error: Couldn't exec /usr/lib/rpm/php.prov: No such file or directory
  • error 571
  • error: Couldn't exec /usr/lib/rpm/php.prov: No such file or directory
  • error 572
  • error: Couldn't exec /usr/lib/rpm/php.prov: No such file or directory
  • error 573
  • error: Couldn't exec /usr/lib/rpm/php.prov: No such file or directory
  • error 574
  • error: Couldn't exec /usr/lib/rpm/php.prov: No such file or directory
  • error 575
  • error: Couldn't exec /usr/lib/rpm/php.prov: No such file or directory
  • error 576
  • error: Couldn't exec /usr/lib/rpm/php.prov: No such file or directory
  • error 577
  • error: Couldn't exec /usr/lib/rpm/php.prov: No such file or directory
  • error 578
  • error: Couldn't exec /usr/lib/rpm/php.prov: No such file or directory
  • error 579
  • error: Couldn't exec /usr/lib/rpm/php.prov: No such file or directory
  • error 580
  • error: Couldn't exec /usr/lib/rpm/php.prov: No such file or directory
  • error 581
  • error: Couldn't exec /usr/lib/rpm/php.prov: No such file or directory
  • error 582
  • error: Couldn't exec /usr/lib/rpm/php.prov: No such file or directory
  • error 583
  • error: Couldn't exec /usr/lib/rpm/php.prov: No such file or directory
  • error 584
  • error: Couldn't exec /usr/lib/rpm/php.prov: No such file or directory
  • error 585
  • error: Couldn't exec /usr/lib/rpm/php.prov: No such file or directory
  • error 586
  • error: Couldn't exec /usr/lib/rpm/php.prov: No such file or directory
  • error 587
  • error: Couldn't exec /usr/lib/rpm/php.prov: No such file or directory
  • error 588
  • error: Couldn't exec /usr/lib/rpm/php.prov: No such file or directory
  • error 589
  • error: Couldn't exec /usr/lib/rpm/php.prov: No such file or directory
  • error 590
  • error: Couldn't exec /usr/lib/rpm/php.prov: No such file or directory
  • error 591
  • error: Couldn't exec /usr/lib/rpm/php.prov: No such file or directory
  • error 592
  • error: Couldn't exec /usr/lib/rpm/php.prov: No such file or directory
  • error 593
  • error: Couldn't exec /usr/lib/rpm/php.prov: No such file or directory
  • error 594
  • error: Couldn't exec /usr/lib/rpm/php.prov: No such file or directory
  • error 595
  • error: Couldn't exec /usr/lib/rpm/php.prov: No such file or directory
  • error 596
  • error: Couldn't exec /usr/lib/rpm/php.prov: No such file or directory
  • error 597
  • error: Couldn't exec /usr/lib/rpm/php.prov: No such file or directory
  • error 598
  • error: Couldn't exec /usr/lib/rpm/php.prov: No such file or directory
  • error 599
  • error: Couldn't exec /usr/lib/rpm/php.prov: No such file or directory
  • error 600
  • error: Couldn't exec /usr/lib/rpm/php.prov: No such file or directory
  • error 601
  • error: Couldn't exec /usr/lib/rpm/php.prov: No such file or directory
  • error 602
  • error: Couldn't exec /usr/lib/rpm/php.prov: No such file or directory
  • error 603
  • error: Couldn't exec /usr/lib/rpm/php.prov: No such file or directory
  • error 604
  • error: Couldn't exec /usr/lib/rpm/php.prov: No such file or directory
  • error 605
  • error: Couldn't exec /usr/lib/rpm/php.prov: No such file or directory
  • error 606
  • error: Couldn't exec /usr/lib/rpm/php.prov: No such file or directory
  • error 607
  • error: Couldn't exec /usr/lib/rpm/php.prov: No such file or directory
  • error 608
  • error: Couldn't exec /usr/lib/rpm/php.prov: No such file or directory
  • error 609
  • error: Couldn't exec /usr/lib/rpm/php.prov: No such file or directory
  • error 610
  • error: Couldn't exec /usr/lib/rpm/php.prov: No such file or directory
  • error 611
  • error: Couldn't exec /usr/lib/rpm/php.prov: No such file or directory
  • error 612
  • error: Couldn't exec /usr/lib/rpm/php.prov: No such file or directory
  • error 613
  • error: Couldn't exec /usr/lib/rpm/php.prov: No such file or directory
  • error 614
  • error: Couldn't exec /usr/lib/rpm/php.prov: No such file or directory
  • error 615
  • error: Couldn't exec /usr/lib/rpm/php.prov: No such file or directory
  • error 616
  • error: Couldn't exec /usr/lib/rpm/php.prov: No such file or directory
  • error 617
  • error: Couldn't exec /usr/lib/rpm/php.prov: No such file or directory
  • error 618
  • error: Couldn't exec /usr/lib/rpm/php.prov: No such file or directory
  • error 619
  • error: Couldn't exec /usr/lib/rpm/php.prov: No such file or directory
  • error 620
  • error: Couldn't exec /usr/lib/rpm/php.prov: No such file or directory
  • error 621
  • error: Couldn't exec /usr/lib/rpm/php.prov: No such file or directory
  • error 622
  • error: Couldn't exec /usr/lib/rpm/php.prov: No such file or directory
  • error 623
  • error: Couldn't exec /usr/lib/rpm/php.prov: No such file or directory
  • error 624
  • error: Couldn't exec /usr/lib/rpm/php.prov: No such file or directory
  • error 625
  • error: Couldn't exec /usr/lib/rpm/php.prov: No such file or directory
  • error 626
  • error: Couldn't exec /usr/lib/rpm/php.prov: No such file or directory
  • error 627
  • error: Couldn't exec /usr/lib/rpm/php.prov: No such file or directory
  • error 628
  • error: Couldn't exec /usr/lib/rpm/php.prov: No such file or directory
  • error 629
  • error: Couldn't exec /usr/lib/rpm/php.prov: No such file or directory
  • error 630
  • error: Couldn't exec /usr/lib/rpm/php.prov: No such file or directory
  • error 631
  • error: Couldn't exec /usr/lib/rpm/php.prov: No such file or directory
  • error 632
  • error: Couldn't exec /usr/lib/rpm/php.prov: No such file or directory
  • error 633
  • error: Couldn't exec /usr/lib/rpm/php.prov: No such file or directory
  • error 634
  • error: Couldn't exec /usr/lib/rpm/php.prov: No such file or directory
  • error 635
  • error: Couldn't exec /usr/lib/rpm/php.prov: No such file or directory
  • error 636
  • error: Couldn't exec /usr/lib/rpm/php.prov: No such file or directory
  • error 637
  • error: Couldn't exec /usr/lib/rpm/php.prov: No such file or directory
  • error 638
  • error: Couldn't exec /usr/lib/rpm/php.prov: No such file or directory
  • error 639
  • error: Couldn't exec /usr/lib/rpm/php.prov: No such file or directory
  • error 640
  • error: Couldn't exec /usr/lib/rpm/php.prov: No such file or directory
  • error 641
  • error: Couldn't exec /usr/lib/rpm/php.prov: No such file or directory
  • error 642
  • error: Couldn't exec /usr/lib/rpm/php.prov: No such file or directory
  • error 643
  • error: Couldn't exec /usr/lib/rpm/php.prov: No such file or directory
  • error 644
  • error: Couldn't exec /usr/lib/rpm/php.prov: No such file or directory
  • error 645
  • error: Couldn't exec /usr/lib/rpm/php.prov: No such file or directory
  • error 646
  • error: Couldn't exec /usr/lib/rpm/php.prov: No such file or directory
  • error 647
  • error: Couldn't exec /usr/lib/rpm/php.prov: No such file or directory
  • error 648
  • error: Couldn't exec /usr/lib/rpm/php.prov: No such file or directory
  • error 649
  • error: Couldn't exec /usr/lib/rpm/php.prov: No such file or directory
  • error 650
  • error: Couldn't exec /usr/lib/rpm/php.prov: No such file or directory
  • error 651
  • error: Couldn't exec /usr/lib/rpm/php.prov: No such file or directory
  • error 652
  • error: Couldn't exec /usr/lib/rpm/php.prov: No such file or directory
  • error 653
  • error: Couldn't exec /usr/lib/rpm/php.prov: No such file or directory
  • error 654
  • error: Couldn't exec /usr/lib/rpm/php.prov: No such file or directory
  • error 655
  • error: Couldn't exec /usr/lib/rpm/php.prov: No such file or directory
  • error 656
  • error: Couldn't exec /usr/lib/rpm/php.prov: No such file or directory
  • error 657
  • error: Couldn't exec /usr/lib/rpm/php.prov: No such file or directory
  • error 658
  • error: Couldn't exec /usr/lib/rpm/php.prov: No such file or directory
  • error 659
  • error: Couldn't exec /usr/lib/rpm/php.prov: No such file or directory
  • error 660
  • error: Couldn't exec /usr/lib/rpm/php.prov: No such file or directory
  • error 661
  • error: Couldn't exec /usr/lib/rpm/php.prov: No such file or directory
  • error 662
  • error: Couldn't exec /usr/lib/rpm/php.prov: No such file or directory
  • error 663
  • error: Couldn't exec /usr/lib/rpm/php.prov: No such file or directory
  • error 664
  • error: Couldn't exec /usr/lib/rpm/php.prov: No such file or directory
  • error 665
  • error: Couldn't exec /usr/lib/rpm/php.prov: No such file or directory
  • error 666
  • error: Couldn't exec /usr/lib/rpm/php.prov: No such file or directory
  • error 667
  • error: Couldn't exec /usr/lib/rpm/php.prov: No such file or directory
  • error 668
  • error: Couldn't exec /usr/lib/rpm/php.prov: No such file or directory
  • error 669
  • error: Couldn't exec /usr/lib/rpm/php.prov: No such file or directory
  • error 670
  • error: Couldn't exec /usr/lib/rpm/php.prov: No such file or directory
  • error 671
  • error: Couldn't exec /usr/lib/rpm/php.prov: No such file or directory
  • error 672
  • error: Couldn't exec /usr/lib/rpm/php.prov: No such file or directory
  • error 673
  • error: Couldn't exec /usr/lib/rpm/php.prov: No such file or directory
  • error 674
  • error: Couldn't exec /usr/lib/rpm/php.prov: No such file or directory
  • error 675
  • error: Couldn't exec /usr/lib/rpm/php.prov: No such file or directory
  • error 676
  • error: Couldn't exec /usr/lib/rpm/php.prov: No such file or directory
  • error 677
  • error: Couldn't exec /usr/lib/rpm/php.prov: No such file or directory
  • error 678
  • error: Couldn't exec /usr/lib/rpm/php.prov: No such file or directory
  • error 679
  • error: Couldn't exec /usr/lib/rpm/php.prov: No such file or directory
  • error 680
  • error: Couldn't exec /usr/lib/rpm/php.prov: No such file or directory
  • error 681
  • error: Couldn't exec /usr/lib/rpm/php.prov: No such file or directory
  • error 682
  • error: Couldn't exec /usr/lib/rpm/php.prov: No such file or directory
  • error 683
  • error: Couldn't exec /usr/lib/rpm/php.prov: No such file or directory
  • error 684
  • error: Couldn't exec /usr/lib/rpm/php.prov: No such file or directory
  • error 685
  • error: Couldn't exec /usr/lib/rpm/php.prov: No such file or directory
  • error 686
  • error: Couldn't exec /usr/lib/rpm/php.prov: No such file or directory
  • error 687
  • error: Couldn't exec /usr/lib/rpm/php.prov: No such file or directory
  • error 688
  • error: Couldn't exec /usr/lib/rpm/php.prov: No such file or directory
  • error 689
  • error: Couldn't exec /usr/lib/rpm/php.prov: No such file or directory
  • error 690
  • error: Couldn't exec /usr/lib/rpm/php.prov: No such file or directory
  • error 691
  • error: Couldn't exec /usr/lib/rpm/php.prov: No such file or directory
  • error 692
  • error: Couldn't exec /usr/lib/rpm/php.prov: No such file or directory
  • error 693
  • error: Couldn't exec /usr/lib/rpm/php.prov: No such file or directory
  • error 694
  • error: Couldn't exec /usr/lib/rpm/php.prov: No such file or directory
  • error 695
  • error: Couldn't exec /usr/lib/rpm/php.prov: No such file or directory
  • error 696
  • error: Couldn't exec /usr/lib/rpm/php.prov: No such file or directory
  • error 697
  • error: Couldn't exec /usr/lib/rpm/php.prov: No such file or directory
  • error 698
  • error: Couldn't exec /usr/lib/rpm/php.prov: No such file or directory
  • files lms-scripts
  • Processing files: lms-scripts-1.11.13-12.x86_64
  • files lms-sqlpanel
  • Processing files: lms-sqlpanel-1.11.13-12.x86_64
  • error 699
  • error: Couldn't exec /usr/lib/rpm/php.prov: No such file or directory
  • error 700
  • error: Couldn't exec /usr/lib/rpm/php.prov: No such file or directory
  • files lms-user
  • Processing files: lms-user-1.11.13-12.x86_64
  • error 701
  • error: Couldn't exec /usr/lib/rpm/php.prov: No such file or directory
  • error 702
  • error: Couldn't exec /usr/lib/rpm/php.prov: No such file or directory
  • files lms-lmsd
  • Processing files: lms-lmsd-1.11.13-12.x86_64
  • files lms-userpanel
  • Processing files: lms-userpanel-1.11.13-12.x86_64
  • error 703
  • error: Couldn't exec /usr/lib/rpm/php.prov: No such file or directory
  • error 704
  • error: Couldn't exec /usr/lib/rpm/php.prov: No such file or directory
  • error 705
  • error: Couldn't exec /usr/lib/rpm/php.prov: No such file or directory
  • error 706
  • error: Couldn't exec /usr/lib/rpm/php.prov: No such file or directory
  • error 707
  • error: Couldn't exec /usr/lib/rpm/php.prov: No such file or directory
  • error 708
  • error: Couldn't exec /usr/lib/rpm/php.prov: No such file or directory
  • error 709
  • error: Couldn't exec /usr/lib/rpm/php.prov: No such file or directory
  • error 710
  • error: Couldn't exec /usr/lib/rpm/php.prov: No such file or directory
  • error 711
  • error: Couldn't exec /usr/lib/rpm/php.prov: No such file or directory
  • error 712
  • error: Couldn't exec /usr/lib/rpm/php.prov: No such file or directory
  • error 713
  • error: Couldn't exec /usr/lib/rpm/php.prov: No such file or directory
  • error 714
  • error: Couldn't exec /usr/lib/rpm/php.prov: No such file or directory
  • error 715
  • error: Couldn't exec /usr/lib/rpm/php.prov: No such file or directory
  • error 716
  • error: Couldn't exec /usr/lib/rpm/php.prov: No such file or directory
  • error 717
  • error: Couldn't exec /usr/lib/rpm/php.prov: No such file or directory
  • error 718
  • error: Couldn't exec /usr/lib/rpm/php.prov: No such file or directory
  • error 719
  • error: Couldn't exec /usr/lib/rpm/php.prov: No such file or directory
  • error 720
  • error: Couldn't exec /usr/lib/rpm/php.prov: No such file or directory
  • error 721
  • error: Couldn't exec /usr/lib/rpm/php.prov: No such file or directory
  • error 722
  • error: Couldn't exec /usr/lib/rpm/php.prov: No such file or directory
  • error 723
  • error: Couldn't exec /usr/lib/rpm/php.prov: No such file or directory
  • error 724
  • error: Couldn't exec /usr/lib/rpm/php.prov: No such file or directory
  • error 725
  • error: Couldn't exec /usr/lib/rpm/php.prov: No such file or directory
  • error 726
  • error: Couldn't exec /usr/lib/rpm/php.prov: No such file or directory
  • error 727
  • error: Couldn't exec /usr/lib/rpm/php.prov: No such file or directory
  • error 728
  • error: Couldn't exec /usr/lib/rpm/php.prov: No such file or directory
  • error 729
  • error: Couldn't exec /usr/lib/rpm/php.prov: No such file or directory
  • error 730
  • error: Couldn't exec /usr/lib/rpm/php.prov: No such file or directory
  • error 731
  • error: Couldn't exec /usr/lib/rpm/php.prov: No such file or directory
  • error 732
  • error: Couldn't exec /usr/lib/rpm/php.prov: No such file or directory
  • error 733
  • error: Couldn't exec /usr/lib/rpm/php.prov: No such file or directory
  • error 734
  • error: Couldn't exec /usr/lib/rpm/php.prov: No such file or directory
  • error 735
  • error: Couldn't exec /usr/lib/rpm/php.prov: No such file or directory
  • error 736
  • error: Couldn't exec /usr/lib/rpm/php.prov: No such file or directory
  • error 737
  • error: Couldn't exec /usr/lib/rpm/php.prov: No such file or directory
  • error 738
  • error: Couldn't exec /usr/lib/rpm/php.prov: No such file or directory
  • error 739
  • error: Couldn't exec /usr/lib/rpm/php.prov: No such file or directory
  • error 740
  • error: Couldn't exec /usr/lib/rpm/php.prov: No such file or directory
  • error 741
  • error: Couldn't exec /usr/lib/rpm/php.prov: No such file or directory
  • error 742
  • error: Couldn't exec /usr/lib/rpm/php.prov: No such file or directory
  • error 743
  • error: Couldn't exec /usr/lib/rpm/php.prov: No such file or directory
  • error 744
  • error: Couldn't exec /usr/lib/rpm/php.prov: No such file or directory
  • error 745
  • error: Couldn't exec /usr/lib/rpm/php.prov: No such file or directory
  • error 746
  • error: Couldn't exec /usr/lib/rpm/php.prov: No such file or directory
  • error 747
  • error: Couldn't exec /usr/lib/rpm/php.prov: No such file or directory
  • error 748
  • error: Couldn't exec /usr/lib/rpm/php.prov: No such file or directory
  • error 749
  • error: Couldn't exec /usr/lib/rpm/php.prov: No such file or directory
  • error 750
  • error: Couldn't exec /usr/lib/rpm/php.prov: No such file or directory
  • error 751
  • error: Couldn't exec /usr/lib/rpm/php.prov: No such file or directory
  • error 752
  • error: Couldn't exec /usr/lib/rpm/php.prov: No such file or directory
  • error 753
  • error: Couldn't exec /usr/lib/rpm/php.prov: No such file or directory
  • error 754
  • error: Couldn't exec /usr/lib/rpm/php.prov: No such file or directory
  • error 755
  • error: Couldn't exec /usr/lib/rpm/php.prov: No such file or directory
  • error 756
  • error: Couldn't exec /usr/lib/rpm/php.prov: No such file or directory
  • error 757
  • error: Couldn't exec /usr/lib/rpm/php.prov: No such file or directory
  • error 758
  • error: Couldn't exec /usr/lib/rpm/php.prov: No such file or directory
  • files lms-debuginfo
  • Processing files: lms-debuginfo-1.11.13-12.x86_64
  • clean
  • Executing(%clean): /bin/sh -e /tmp/B.BHJf8e/BUILD/tmp/rpm-tmp.53055

Content:

gcc -shared ethers.o -o ethers.so -L/usr/lib64 -lmysqlclient -ldl 
rm -rf ethers.o
make[2]: Leaving directory '/tmp/B.BHJf8e/BUILD/lms/daemon/modules/ethers'
make[2]: Entering directory '/tmp/B.BHJf8e/BUILD/lms/daemon/modules/ewx-pt'
x86_64-pld-linux-gcc -O2 -fwrapv -pipe -Wformat -Werror=format-security -gdwarf-4 -fno-debug-types-section -fvar-tracking-assignments -g2 -Wp,-D_FORTIFY_SOURCE=2 -fstack-protector-strong --param=ssp-buffer-size=4 -Werror=trampolines -fPIC -march=x86-64 -gdwarf-4 -fno-debug-types-section -fvar-tracking-assignments -g2  -fPIC -DUSE_MYSQL -DLMS_LIB_DIR=\"/usr/lib64/lms/\" -I../..   -c -o ewx-pt.o ewx-pt.c
ewx-pt.c: In function 'reload':
ewx-pt.c:204:2: warning: 'remote_port' is deprecated [-Wdeprecated-declarations]
  204 |  session.remote_port = ewx->port;   // destination port
      |  ^~~~~~~
In file included from /usr/include/net-snmp/definitions.h:22,
                 from /usr/include/net-snmp/net-snmp-includes.h:24,
                 from ewx-pt.h:2,
                 from ewx-pt.c:33:
/usr/include/net-snmp/types.h:307:21: note: declared here
  307 |     u_short         remote_port NETSNMP_ATTRIBUTE_DEPRECATED;
      |                     ^~~~~~~~~~~
make[2]: Leaving directory '/tmp/B.BHJf8e/BUILD/lms/daemon/modules/ewx-pt'
make[2]: Entering directory '/tmp/B.BHJf8e/BUILD/lms/daemon/modules/ewx-pt'
gcc -shared ewx-pt.o -o ewx-pt.so -L/usr/lib64 `net-snmp-config --ldflags` -lmysqlclient -ldl  `net-snmp-config --libs`
rm -rf ewx-pt.o
make[2]: Leaving directory '/tmp/B.BHJf8e/BUILD/lms/daemon/modules/ewx-pt'
make[2]: Entering directory '/tmp/B.BHJf8e/BUILD/lms/daemon/modules/ewx-stm'
x86_64-pld-linux-gcc -O2 -fwrapv -pipe -Wformat -Werror=format-security -gdwarf-4 -fno-debug-types-section -fvar-tracking-assignments -g2 -Wp,-D_FORTIFY_SOURCE=2 -fstack-protector-strong --param=ssp-buffer-size=4 -Werror=trampolines -fPIC -march=x86-64 -gdwarf-4 -fno-debug-types-section -fvar-tracking-assignments -g2  -fPIC -DUSE_MYSQL -DLMS_LIB_DIR=\"/usr/lib64/lms/\" -I../..   -c -o ewx-stm.o ewx-stm.c
ewx-stm.c: In function 'reload':
ewx-stm.c:101:2: warning: 'remote_port' is deprecated [-Wdeprecated-declarations]
  101 |  session.remote_port = ewx->port;   // destination port
      |  ^~~~~~~
In file included from /usr/include/net-snmp/definitions.h:22,
                 from /usr/include/net-snmp/net-snmp-includes.h:24,
                 from ewx-stm.h:2,
                 from ewx-stm.c:34:
/usr/include/net-snmp/types.h:307:21: note: declared here
  307 |     u_short         remote_port NETSNMP_ATTRIBUTE_DEPRECATED;
      |                     ^~~~~~~~~~~
make[2]: Leaving directory '/tmp/B.BHJf8e/BUILD/lms/daemon/modules/ewx-stm'
make[2]: Entering directory '/tmp/B.BHJf8e/BUILD/lms/daemon/modules/ewx-stm'
gcc -shared ewx-stm.o -o ewx-stm.so -L/usr/lib64 `net-snmp-config --ldflags` -lmysqlclient -ldl  `net-snmp-config --libs` -lm
rm -rf ewx-stm.o
make[2]: Leaving directory '/tmp/B.BHJf8e/BUILD/lms/daemon/modules/ewx-stm'
make[2]: Entering directory '/tmp/B.BHJf8e/BUILD/lms/daemon/modules/ewx-stm-channels'
x86_64-pld-linux-gcc -O2 -fwrapv -pipe -Wformat -Werror=format-security -gdwarf-4 -fno-debug-types-section -fvar-tracking-assignments -g2 -Wp,-D_FORTIFY_SOURCE=2 -fstack-protector-strong --param=ssp-buffer-size=4 -Werror=trampolines -fPIC -march=x86-64 -gdwarf-4 -fno-debug-types-section -fvar-tracking-assignments -g2  -fPIC -DUSE_MYSQL -DLMS_LIB_DIR=\"/usr/lib64/lms/\" -I../..   -c -o ewx-stm-channels.o ewx-stm-channels.c
ewx-stm-channels.c: In function 'reload':
ewx-stm-channels.c:101:2: warning: 'remote_port' is deprecated [-Wdeprecated-declarations]
  101 |  session.remote_port = ewx->port;   // destination port
      |  ^~~~~~~
In file included from /usr/include/net-snmp/definitions.h:22,
                 from /usr/include/net-snmp/net-snmp-includes.h:24,
                 from ewx-stm-channels.h:2,
                 from ewx-stm-channels.c:33:
/usr/include/net-snmp/types.h:307:21: note: declared here
  307 |     u_short         remote_port NETSNMP_ATTRIBUTE_DEPRECATED;
      |                     ^~~~~~~~~~~
make[2]: Leaving directory '/tmp/B.BHJf8e/BUILD/lms/daemon/modules/ewx-stm-channels'
make[2]: Entering directory '/tmp/B.BHJf8e/BUILD/lms/daemon/modules/ewx-stm-channels'
gcc -shared ewx-stm-channels.o -o ewx-stm-channels.so -L/usr/lib64 `net-snmp-config --ldflags` -lmysqlclient -ldl  `net-snmp-config --libs`
rm -rf ewx-stm-channels.o
make[2]: Leaving directory '/tmp/B.BHJf8e/BUILD/lms/daemon/modules/ewx-stm-channels'
make[2]: Entering directory '/tmp/B.BHJf8e/BUILD/lms/daemon/modules/ggnotify'
x86_64-pld-linux-gcc -O2 -fwrapv -pipe -Wformat -Werror=format-security -gdwarf-4 -fno-debug-types-section -fvar-tracking-assignments -g2 -Wp,-D_FORTIFY_SOURCE=2 -fstack-protector-strong --param=ssp-buffer-size=4 -Werror=trampolines -fPIC -march=x86-64 -gdwarf-4 -fno-debug-types-section -fvar-tracking-assignments -g2  -fPIC -DUSE_MYSQL -DLMS_LIB_DIR=\"/usr/lib64/lms/\" -I../..   -c -o ggnotify.o ggnotify.c
make[2]: Leaving directory '/tmp/B.BHJf8e/BUILD/lms/daemon/modules/ggnotify'
make[2]: Entering directory '/tmp/B.BHJf8e/BUILD/lms/daemon/modules/ggnotify'
gcc -shared ggnotify.o -o ggnotify.so -L/usr/lib64 -L/usr/lib64 -lmysqlclient -ldl  -lgadu
rm -rf ggnotify.o
make[2]: Leaving directory '/tmp/B.BHJf8e/BUILD/lms/daemon/modules/ggnotify'
make[2]: Entering directory '/tmp/B.BHJf8e/BUILD/lms/daemon/modules/hostfile'
x86_64-pld-linux-gcc -O2 -fwrapv -pipe -Wformat -Werror=format-security -gdwarf-4 -fno-debug-types-section -fvar-tracking-assignments -g2 -Wp,-D_FORTIFY_SOURCE=2 -fstack-protector-strong --param=ssp-buffer-size=4 -Werror=trampolines -fPIC -march=x86-64 -gdwarf-4 -fno-debug-types-section -fvar-tracking-assignments -g2  -fPIC -DUSE_MYSQL -DLMS_LIB_DIR=\"/usr/lib64/lms/\" -I../..   -c -o hostfile.o hostfile.c
hostfile.c: In function 'reload':
hostfile.c:470:3: warning: ignoring return value of 'system' declared with attribute 'warn_unused_result' [-Wunused-result]
  470 |   system(hm->command);
      |   ^~~~~~~~~~~~~~~~~~~
make[2]: Leaving directory '/tmp/B.BHJf8e/BUILD/lms/daemon/modules/hostfile'
make[2]: Entering directory '/tmp/B.BHJf8e/BUILD/lms/daemon/modules/hostfile'
gcc -shared hostfile.o -o hostfile.so -L/usr/lib64 -lmysqlclient -ldl 
rm -rf hostfile.o
make[2]: Leaving directory '/tmp/B.BHJf8e/BUILD/lms/daemon/modules/hostfile'
make[2]: Entering directory '/tmp/B.BHJf8e/BUILD/lms/daemon/modules/notify'
x86_64-pld-linux-gcc -O2 -fwrapv -pipe -Wformat -Werror=format-security -gdwarf-4 -fno-debug-types-section -fvar-tracking-assignments -g2 -Wp,-D_FORTIFY_SOURCE=2 -fstack-protector-strong --param=ssp-buffer-size=4 -Werror=trampolines -fPIC -march=x86-64 -gdwarf-4 -fno-debug-types-section -fvar-tracking-assignments -g2  -fPIC -DUSE_MYSQL -DLMS_LIB_DIR=\"/usr/lib64/lms/\" -I../..   -c -o notify.o notify.c
notify.c: In function 'reload':
notify.c:174:6: warning: ignoring return value of 'system' declared with attribute 'warn_unused_result' [-Wunused-result]
  174 |      system(command);
      |      ^~~~~~~~~~~~~~~
make[2]: Leaving directory '/tmp/B.BHJf8e/BUILD/lms/daemon/modules/notify'
make[2]: Entering directory '/tmp/B.BHJf8e/BUILD/lms/daemon/modules/notify'
gcc -shared notify.o -o notify.so -L/usr/lib64 -lmysqlclient -ldl 
rm -rf notify.o
make[2]: Leaving directory '/tmp/B.BHJf8e/BUILD/lms/daemon/modules/notify'
make[2]: Entering directory '/tmp/B.BHJf8e/BUILD/lms/daemon/modules/oident'
x86_64-pld-linux-gcc -O2 -fwrapv -pipe -Wformat -Werror=format-security -gdwarf-4 -fno-debug-types-section -fvar-tracking-assignments -g2 -Wp,-D_FORTIFY_SOURCE=2 -fstack-protector-strong --param=ssp-buffer-size=4 -Werror=trampolines -fPIC -march=x86-64 -gdwarf-4 -fno-debug-types-section -fvar-tracking-assignments -g2  -fPIC -DUSE_MYSQL -DLMS_LIB_DIR=\"/usr/lib64/lms/\" -I../..   -c -o oident.o oident.c
oident.c: In function 'reload':
oident.c:123:3: warning: ignoring return value of 'system' declared with attribute 'warn_unused_result' [-Wunused-result]
  123 |   system(o->command);
      |   ^~~~~~~~~~~~~~~~~~
make[2]: Leaving directory '/tmp/B.BHJf8e/BUILD/lms/daemon/modules/oident'
make[2]: Entering directory '/tmp/B.BHJf8e/BUILD/lms/daemon/modules/oident'
gcc -shared oident.o -o oident.so -L/usr/lib64 -lmysqlclient -ldl 
rm -rf oident.o
make[2]: Leaving directory '/tmp/B.BHJf8e/BUILD/lms/daemon/modules/oident'
/usr/bin/make -C lib
/usr/bin/make -C extensions
make[2]: *** No rule to make target 'lib/libtscript.a', needed by 'parser.so'.  Stop.
make[2]: *** Waiting for unfinished jobs....
make[3]: Circular tscript_parser.h <- tscript_parser.h dependency dropped.
make[3]: Entering directory '/tmp/B.BHJf8e/BUILD/lms/daemon/modules/parser/lib'
yacc  tscript_parser.y 
yacc: e - line 45 of "tscript_parser.y", syntax error
%error-verbose
^
make[3]: *** [<builtin>: tscript_parser.c] Error 1
make[3]: Leaving directory '/tmp/B.BHJf8e/BUILD/lms/daemon/modules/parser/lib'
make[3]: *** Waiting for unfinished jobs....
make[3]: Entering directory '/tmp/B.BHJf8e/BUILD/lms/daemon/modules/parser/extensions'
gcc -c tscript_exec.c -O2 -fwrapv -pipe -Wformat -Werror=format-security -gdwarf-4 -fno-debug-types-section -fvar-tracking-assignments -g2 -Wp,-D_FORTIFY_SOURCE=2 -fstack-protector-strong --param=ssp-buffer-size=4 -Werror=trampolines -fPIC -march=x86-64 -gdwarf-4 -fno-debug-types-section -fvar-tracking-assignments -g2  -fPIC -DUSE_MYSQL -DLMS_LIB_DIR=\"/usr/lib64/lms/\" -I../..
In file included from tscript_exec.c:32:
tscript_exec.h:4:10: fatal error: tscript_context.h: No such file or directory
    4 | #include "tscript_context.h"
      |          ^~~~~~~~~~~~~~~~~~~
compilation terminated.
make[3]: *** [Makefile:14: tscript_exec.o] Error 1
make[3]: Leaving directory '/tmp/B.BHJf8e/BUILD/lms/daemon/modules/parser/extensions'
make[3]: *** Waiting for unfinished jobs....
make[3]: Entering directory '/tmp/B.BHJf8e/BUILD/lms/daemon/modules/parser/extensions'
gcc -c tscript_sysinfo.c -O2 -fwrapv -pipe -Wformat -Werror=format-security -gdwarf-4 -fno-debug-types-section -fvar-tracking-assignments -g2 -Wp,-D_FORTIFY_SOURCE=2 -fstack-protector-strong --param=ssp-buffer-size=4 -Werror=trampolines -fPIC -march=x86-64 -gdwarf-4 -fno-debug-types-section -fvar-tracking-assignments -g2  -fPIC -DUSE_MYSQL -DLMS_LIB_DIR=\"/usr/lib64/lms/\" -I../..
In file included from tscript_sysinfo.c:32:
tscript_sysinfo.h:4:10: fatal error: tscript_context.h: No such file or directory
    4 | #include "tscript_context.h"
      |          ^~~~~~~~~~~~~~~~~~~
compilation terminated.
make[3]: *** [Makefile:14: tscript_sysinfo.o] Error 1
make[3]: Leaving directory '/tmp/B.BHJf8e/BUILD/lms/daemon/modules/parser/extensions'
make[3]: Entering directory '/tmp/B.BHJf8e/BUILD/lms/daemon/modules/parser/extensions'
gcc -c tscript_string.c -O2 -fwrapv -pipe -Wformat -Werror=format-security -gdwarf-4 -fno-debug-types-section -fvar-tracking-assignments -g2 -Wp,-D_FORTIFY_SOURCE=2 -fstack-protector-strong --param=ssp-buffer-size=4 -Werror=trampolines -fPIC -march=x86-64 -gdwarf-4 -fno-debug-types-section -fvar-tracking-assignments -g2  -fPIC -DUSE_MYSQL -DLMS_LIB_DIR=\"/usr/lib64/lms/\" -I../..
In file included from tscript_string.c:32:
tscript_string.h:4:10: fatal error: tscript_context.h: No such file or directory
    4 | #include "tscript_context.h"
      |          ^~~~~~~~~~~~~~~~~~~
compilation terminated.
make[3]: *** [Makefile:14: tscript_string.o] Error 1
make[3]: Leaving directory '/tmp/B.BHJf8e/BUILD/lms/daemon/modules/parser/extensions'
make[3]: Entering directory '/tmp/B.BHJf8e/BUILD/lms/daemon/modules/parser/extensions'
gcc -c tscript_file.c -O2 -fwrapv -pipe -Wformat -Werror=format-security -gdwarf-4 -fno-debug-types-section -fvar-tracking-assignments -g2 -Wp,-D_FORTIFY_SOURCE=2 -fstack-protector-strong --param=ssp-buffer-size=4 -Werror=trampolines -fPIC -march=x86-64 -gdwarf-4 -fno-debug-types-section -fvar-tracking-assignments -g2  -fPIC -DUSE_MYSQL -DLMS_LIB_DIR=\"/usr/lib64/lms/\" -I../..
In file included from tscript_file.c:32:
tscript_file.h:4:10: fatal error: tscript_context.h: No such file or directory
    4 | #include "tscript_context.h"
      |          ^~~~~~~~~~~~~~~~~~~
compilation terminated.
make[3]: *** [Makefile:14: tscript_file.o] Error 1
make[3]: Leaving directory '/tmp/B.BHJf8e/BUILD/lms/daemon/modules/parser/extensions'
make[2]: Entering directory '/tmp/B.BHJf8e/BUILD/lms/daemon/modules/parser'
x86_64-pld-linux-gcc -O2 -fwrapv -pipe -Wformat -Werror=format-security -gdwarf-4 -fno-debug-types-section -fvar-tracking-assignments -g2 -Wp,-D_FORTIFY_SOURCE=2 -fstack-protector-strong --param=ssp-buffer-size=4 -Werror=trampolines -fPIC -march=x86-64 -gdwarf-4 -fno-debug-types-section -fvar-tracking-assignments -g2  -fPIC -DUSE_MYSQL -DLMS_LIB_DIR=\"/usr/lib64/lms/\" -I../..   -c -o parser.o parser.c
parser.c:32:10: fatal error: tscript_context.h: No such file or directory
   32 | #include "tscript_context.h"
      |          ^~~~~~~~~~~~~~~~~~~
compilation terminated.
make[2]: *** [<builtin>: parser.o] Error 1
make[2]: Leaving directory '/tmp/B.BHJf8e/BUILD/lms/daemon/modules/parser'
make[3]: Entering directory '/tmp/B.BHJf8e/BUILD/lms/daemon/modules/parser/extensions'
gcc -c net.c -O2 -fwrapv -pipe -Wformat -Werror=format-security -gdwarf-4 -fno-debug-types-section -fvar-tracking-assignments -g2 -Wp,-D_FORTIFY_SOURCE=2 -fstack-protector-strong --param=ssp-buffer-size=4 -Werror=trampolines -fPIC -march=x86-64 -gdwarf-4 -fno-debug-types-section -fvar-tracking-assignments -g2  -fPIC -DUSE_MYSQL -DLMS_LIB_DIR=\"/usr/lib64/lms/\" -I../..
In file included from net.c:31:
net.h:4:10: fatal error: tscript_context.h: No such file or directory
    4 | #include "tscript_context.h"
      |          ^~~~~~~~~~~~~~~~~~~
compilation terminated.
make[3]: *** [Makefile:14: net.o] Error 1
make[3]: Leaving directory '/tmp/B.BHJf8e/BUILD/lms/daemon/modules/parser/extensions'
make[3]: Entering directory '/tmp/B.BHJf8e/BUILD/lms/daemon/modules/parser/extensions'
gcc -c sql.c -O2 -fwrapv -pipe -Wformat -Werror=format-security -gdwarf-4 -fno-debug-types-section -fvar-tracking-assignments -g2 -Wp,-D_FORTIFY_SOURCE=2 -fstack-protector-strong --param=ssp-buffer-size=4 -Werror=trampolines -fPIC -march=x86-64 -gdwarf-4 -fno-debug-types-section -fvar-tracking-assignments -g2  -fPIC -DUSE_MYSQL -DLMS_LIB_DIR=\"/usr/lib64/lms/\" -I../..
In file included from sql.c:25:
sql.h:4:10: fatal error: tscript_context.h: No such file or directory
    4 | #include "tscript_context.h"
      |          ^~~~~~~~~~~~~~~~~~~
compilation terminated.
make[3]: *** [Makefile:14: sql.o] Error 1
make[3]: Leaving directory '/tmp/B.BHJf8e/BUILD/lms/daemon/modules/parser/extensions'
make[2]: *** [Makefile:20: ext] Error 2
make[3]: Entering directory '/tmp/B.BHJf8e/BUILD/lms/daemon/modules/parser/lib'
bison -o tscript_parser.c -d tscript_parser.y -p tscript_yy -r lookahead
tscript_parser.y:45.1-14: warning: deprecated directive: '%error-verbose', use '%define parse.error verbose' [-Wdeprecated]
   45 | %error-verbose
      | ^~~~~~~~~~~~~~
      | %define parse.error verbose
tscript_parser.y: warning: 32 shift/reduce conflicts [-Wconflicts-sr]
tscript_parser.y: warning: 1 reduce/reduce conflict [-Wconflicts-rr]
tscript_parser.y: note: rerun with option '-Wcounterexamples' to generate conflict counterexamples
tscript_parser.y: warning: fix-its can be applied.  Rerun with option '--update'. [-Wother]
make[3]: Leaving directory '/tmp/B.BHJf8e/BUILD/lms/daemon/modules/parser/lib'
make[2]: *** [Makefile:17: libs] Error 2
make[2]: Entering directory '/tmp/B.BHJf8e/BUILD/lms/daemon/modules/payments'
x86_64-pld-linux-gcc -O2 -fwrapv -pipe -Wformat -Werror=format-security -gdwarf-4 -fno-debug-types-section -fvar-tracking-assignments -g2 -Wp,-D_FORTIFY_SOURCE=2 -fstack-protector-strong --param=ssp-buffer-size=4 -Werror=trampolines -fPIC -march=x86-64 -gdwarf-4 -fno-debug-types-section -fvar-tracking-assignments -g2  -fPIC -DUSE_MYSQL -DLMS_LIB_DIR=\"/usr/lib64/lms/\" -I../..   -c -o payments.o payments.c
make[2]: Leaving directory '/tmp/B.BHJf8e/BUILD/lms/daemon/modules/payments'
make[2]: Entering directory '/tmp/B.BHJf8e/BUILD/lms/daemon/modules/payments'
gcc -shared payments.o -o payments.so -L/usr/lib64 -lmysqlclient -ldl 
rm -rf payments.o
make[2]: Leaving directory '/tmp/B.BHJf8e/BUILD/lms/daemon/modules/payments'
make[2]: Entering directory '/tmp/B.BHJf8e/BUILD/lms/daemon/modules/pinger'
x86_64-pld-linux-gcc -O2 -fwrapv -pipe -Wformat -Werror=format-security -gdwarf-4 -fno-debug-types-section -fvar-tracking-assignments -g2 -Wp,-D_FORTIFY_SOURCE=2 -fstack-protector-strong --param=ssp-buffer-size=4 -Werror=trampolines -fPIC -march=x86-64 -gdwarf-4 -fno-debug-types-section -fvar-tracking-assignments -g2  -fPIC -DUSE_MYSQL -DLMS_LIB_DIR=\"/usr/lib64/lms/\" -I../..   -c -o pinger.o pinger.c
make[2]: Leaving directory '/tmp/B.BHJf8e/BUILD/lms/daemon/modules/pinger'
make[2]: Entering directory '/tmp/B.BHJf8e/BUILD/lms/daemon/modules/pinger'
gcc -shared pinger.o -o pinger.so -L/usr/lib64 -lmysqlclient -ldl 
rm -rf pinger.o
make[2]: Leaving directory '/tmp/B.BHJf8e/BUILD/lms/daemon/modules/pinger'
make[2]: Entering directory '/tmp/B.BHJf8e/BUILD/lms/daemon/modules/system'
x86_64-pld-linux-gcc -O2 -fwrapv -pipe -Wformat -Werror=format-security -gdwarf-4 -fno-debug-types-section -fvar-tracking-assignments -g2 -Wp,-D_FORTIFY_SOURCE=2 -fstack-protector-strong --param=ssp-buffer-size=4 -Werror=trampolines -fPIC -march=x86-64 -gdwarf-4 -fno-debug-types-section -fvar-tracking-assignments -g2  -fPIC -DUSE_MYSQL -DLMS_LIB_DIR=\"/usr/lib64/lms/\" -I../..   -c -o system.o system.c
system.c: In function 'reload':
system.c:42:3: warning: ignoring return value of 'system' declared with attribute 'warn_unused_result' [-Wunused-result]
   42 |   system(s->command);
      |   ^~~~~~~~~~~~~~~~~~
make[2]: Leaving directory '/tmp/B.BHJf8e/BUILD/lms/daemon/modules/system'
make[2]: Entering directory '/tmp/B.BHJf8e/BUILD/lms/daemon/modules/system'
gcc -shared system.o -o system.so -L/usr/lib64 -lmysqlclient -ldl 
rm -rf system.o
make[2]: Leaving directory '/tmp/B.BHJf8e/BUILD/lms/daemon/modules/system'
make[2]: Entering directory '/tmp/B.BHJf8e/BUILD/lms/daemon/modules/tc'
x86_64-pld-linux-gcc -O2 -fwrapv -pipe -Wformat -Werror=format-security -gdwarf-4 -fno-debug-types-section -fvar-tracking-assignments -g2 -Wp,-D_FORTIFY_SOURCE=2 -fstack-protector-strong --param=ssp-buffer-size=4 -Werror=trampolines -fPIC -march=x86-64 -gdwarf-4 -fno-debug-types-section -fvar-tracking-assignments -g2  -fPIC -DUSE_MYSQL -DLMS_LIB_DIR=\"/usr/lib64/lms/\" -I../..   -c -o tc.o tc.c
tc.c: In function 'reload':
tc.c:443:3: warning: ignoring return value of 'system' declared with attribute 'warn_unused_result' [-Wunused-result]
  443 |   system(tc->command);
      |   ^~~~~~~~~~~~~~~~~~~
make[2]: Leaving directory '/tmp/B.BHJf8e/BUILD/lms/daemon/modules/tc'
make[2]: Entering directory '/tmp/B.BHJf8e/BUILD/lms/daemon/modules/tc'
gcc -shared tc.o -o tc.so -L/usr/lib64 -lmysqlclient -ldl 
rm -rf tc.o
make[2]: Leaving directory '/tmp/B.BHJf8e/BUILD/lms/daemon/modules/tc'
make[2]: Entering directory '/tmp/B.BHJf8e/BUILD/lms/daemon/modules/tc-new'
x86_64-pld-linux-gcc -O2 -fwrapv -pipe -Wformat -Werror=format-security -gdwarf-4 -fno-debug-types-section -fvar-tracking-assignments -g2 -Wp,-D_FORTIFY_SOURCE=2 -fstack-protector-strong --param=ssp-buffer-size=4 -Werror=trampolines -fPIC -march=x86-64 -gdwarf-4 -fno-debug-types-section -fvar-tracking-assignments -g2  -fPIC -DUSE_MYSQL -DLMS_LIB_DIR=\"/usr/lib64/lms/\" -I../..   -c -o tc-new.o tc-new.c
tc-new.c: In function 'reload':
tc-new.c:513:3: warning: ignoring return value of 'system' declared with attribute 'warn_unused_result' [-Wunused-result]
  513 |   system(tc->command);
      |   ^~~~~~~~~~~~~~~~~~~
make[2]: Leaving directory '/tmp/B.BHJf8e/BUILD/lms/daemon/modules/tc-new'
make[2]: Entering directory '/tmp/B.BHJf8e/BUILD/lms/daemon/modules/tc-new'
gcc -shared tc-new.o -o tc-new.so -L/usr/lib64 -lmysqlclient -ldl 
rm -rf tc-new.o
make[2]: Leaving directory '/tmp/B.BHJf8e/BUILD/lms/daemon/modules/tc-new'
make[2]: Entering directory '/tmp/B.BHJf8e/BUILD/lms/daemon/modules/traffic'
x86_64-pld-linux-gcc -O2 -fwrapv -pipe -Wformat -Werror=format-security -gdwarf-4 -fno-debug-types-section -fvar-tracking-assignments -g2 -Wp,-D_FORTIFY_SOURCE=2 -fstack-protector-strong --param=ssp-buffer-size=4 -Werror=trampolines -fPIC -march=x86-64 -gdwarf-4 -fno-debug-types-section -fvar-tracking-assignments -g2  -fPIC -DUSE_MYSQL -DLMS_LIB_DIR=\"/usr/lib64/lms/\" -I../..   -c -o traffic.o traffic.c
traffic.c: In function 'reload':
traffic.c:65:4: warning: ignoring return value of 'system' declared with attribute 'warn_unused_result' [-Wunused-result]
   65 |    system(traffic->begin_command);
      |    ^~~~~~~~~~~~~~~~~~~~~~~~~~~~~~
traffic.c:119:3: warning: ignoring return value of 'system' declared with attribute 'warn_unused_result' [-Wunused-result]
  119 |   system(traffic->end_command);
      |   ^~~~~~~~~~~~~~~~~~~~~~~~~~~~
make[2]: Leaving directory '/tmp/B.BHJf8e/BUILD/lms/daemon/modules/traffic'
make[2]: Entering directory '/tmp/B.BHJf8e/BUILD/lms/daemon/modules/traffic'
gcc -shared traffic.o -o traffic.so -L/usr/lib64 -lmysqlclient -ldl 
rm -rf traffic.o
make[2]: Leaving directory '/tmp/B.BHJf8e/BUILD/lms/daemon/modules/traffic'
+ /bin/mv lmsd lmsd-mysql
+ ./configure --with-pgsql
OS Type... Linux
Database type... PostgreSQL
Library location... /usr/lib64
Includes location... /usr/include
SQL queries debugging... no
Events debugging... no
Configuration file... no
Daemon install directory... /usr/local/lms/bin
Modules install directory... /usr/local/lms/lib
Create Makefile for main program... done
Create Makefile for mod_cutoff... done
Create Makefile for mod_dhcp... done
Create Makefile for mod_dns... done
Create Makefile for mod_ethers... done
Create Makefile for mod_ewx-pt... done
Create Makefile for mod_ewx-stm... done
Create Makefile for mod_ewx-stm-channels... done
Create Makefile for mod_ggnotify... done
Create Makefile for mod_hostfile... done
Create Makefile for mod_notify... done
Create Makefile for mod_oident... done
Create Makefile for mod_parser... done
Create Makefile for mod_payments... done
Create Makefile for mod_pinger... done
Create Makefile for mod_system... done
Create Makefile for mod_tc... done
Create Makefile for mod_tc-new... done
Create Makefile for mod_traffic... done
Create Makefile for mod_parser extensions... done
***************************************************************
Configuration finished. Now You can type 'make && make install'
+ /usr/bin/make -Otarget -j9 lmsd 'CC=x86_64-pld-linux-gcc' 'CFLAGS=-O2 -fwrapv -pipe -Wformat -Werror=format-security -gdwarf-4 -fno-debug-types-section -fvar-tracking-assignments -g2 -Wp,-D_FORTIFY_SOURCE=2 -fstack-protector-strong --param=ssp-buffer-size=4 -Werror=trampolines -fPIC -march=x86-64 -gdwarf-4 -fno-debug-types-section -fvar-tracking-assignments -g2  -fPIC -DUSE_PGSQL -DLMS_LIB_DIR=\"/usr/lib64/lms/\" -I../..'
x86_64-pld-linux-gcc -O2 -fwrapv -pipe -Wformat -Werror=format-security -gdwarf-4 -fno-debug-types-section -fvar-tracking-assignments -g2 -Wp,-D_FORTIFY_SOURCE=2 -fstack-protector-strong --param=ssp-buffer-size=4 -Werror=trampolines -fPIC -march=x86-64 -gdwarf-4 -fno-debug-types-section -fvar-tracking-assignments -g2  -fPIC -DUSE_PGSQL -DLMS_LIB_DIR=\"/usr/lib64/lms/\" -I../..   -c -o dbdrivers/pgsql/db.o dbdrivers/pgsql/db.c
gcc dbdrivers/pgsql/db.o util.o cron/cronparse.o cron/cron.o config/dictionary.o config/config.o lmsd.o -o lmsd -L/usr/lib64 -lpq -ldl
+ /bin/mv lmsd lmsd-pgsql
+ CFLAGS='-O2 -fwrapv -pipe -Wformat -Werror=format-security -gdwarf-4 -fno-debug-types-section -fvar-tracking-assignments -g2 -Wp,-D_FORTIFY_SOURCE=2 -fstack-protector-strong --param=ssp-buffer-size=4 -Werror=trampolines -fPIC -march=x86-64 -gdwarf-4 -fno-debug-types-section -fvar-tracking-assignments -g2 ' /usr/bin/make -Otarget -j9 -j1 -C modules/parser 'CC=x86_64-pld-linux-gcc'
make: Entering directory '/tmp/B.BHJf8e/BUILD/lms/daemon/modules/parser'
/usr/bin/make -C lib
make[1]: Entering directory '/tmp/B.BHJf8e/BUILD/lms/daemon/modules/parser/lib'
make[1]: Circular tscript_parser.h <- tscript_parser.h dependency dropped.
x86_64-pld-linux-gcc -c tscript_ast.c -O2 -fPIC
x86_64-pld-linux-gcc -c tscript_context.c -O2 -fPIC
x86_64-pld-linux-gcc -c tscript_compiler.c -O2 -fPIC
tscript_compiler.c: In function 'tscript_compile_stream':
tscript_compiler.c:42:2: warning: implicit declaration of function 'tscript_init_lexical' [-Wimplicit-function-declaration]
   42 |  tscript_init_lexical();
      |  ^~~~~~~~~~~~~~~~~~~~
tscript_compiler.c:43:25: warning: passing argument 1 of 'tscript_yyparse' from incompatible pointer type [-Wincompatible-pointer-types]
   43 |  return tscript_yyparse(&context->ast);
      |                         ^~~~~~~~~~~~~
      |                         |
      |                         struct tscript_ast_node **
In file included from tscript_compiler.c:33:
tscript_parser.h:123:39: note: expected 'tscript_context *' but argument is of type 'struct tscript_ast_node **'
  123 | int tscript_yyparse (tscript_context* context);
      |                      ~~~~~~~~~~~~~~~~~^~~~~~~
tscript_compiler.c: In function 'tscript_compile_string':
tscript_compiler.c:51:22: warning: passing argument 1 of 'tscript_yyparse' from incompatible pointer type [-Wincompatible-pointer-types]
   51 |  r = tscript_yyparse(&context->ast);
      |                      ^~~~~~~~~~~~~
      |                      |
      |                      struct tscript_ast_node **
In file included from tscript_compiler.c:33:
tscript_parser.h:123:39: note: expected 'tscript_context *' but argument is of type 'struct tscript_ast_node **'
  123 | int tscript_yyparse (tscript_context* context);
      |                      ~~~~~~~~~~~~~~~~~^~~~~~~
x86_64-pld-linux-gcc -c tscript_interpreter.c -O2 -fPIC
tscript_interpreter.c: In function 'tscript_interprete_sub':
tscript_interpreter.c:125:2: warning: implicit declaration of function 'tscript_debug' [-Wimplicit-function-declaration]
  125 |  tscript_debug(context, "Interpretting %s\n", ast->type);
      |  ^~~~~~~~~~~~~
tscript_interpreter.c:580:4: warning: implicit declaration of function 'tscript_internal_error' [-Wimplicit-function-declaration]
  580 |    tscript_internal_error("Incorrect conversion");
      |    ^~~~~~~~~~~~~~~~~~~~~~
x86_64-pld-linux-gcc -c tscript_variables.c -O2 -fPIC
tscript_variables.c: In function 'tscript_variable_get_reference':
tscript_variables.c:47:2: warning: implicit declaration of function 'tscript_debug' [-Wimplicit-function-declaration]
   47 |  tscript_debug(context, "Getting reference for variable %s\n", name);
      |  ^~~~~~~~~~~~~
x86_64-pld-linux-gcc -c tscript_parser.c -O2 -fPIC
tscript_parser.c: In function 'tscript_yyparse':
tscript_parser.c:69:25: warning: implicit declaration of function 'tscript_yylex'; did you mean 'tscript_yyparse'? [-Wimplicit-function-declaration]
   69 | #define yylex           tscript_yylex
      |                         ^~~~~~~~~~~~~
tscript_parser.c:1691:16: note: in expansion of macro 'yylex'
 1691 |       yychar = yylex (context);
      |                ^~~~~
tscript_parser.y:151:9: warning: implicit declaration of function 'strcmp' [-Wimplicit-function-declaration]
  151 |     if (strcmp(tscript_value_as_string($1->value),
      |         ^~~~~~
tscript_parser.c:70:25: warning: implicit declaration of function 'tscript_yyerror'; did you mean 'tscript_yyparse'? [-Wimplicit-function-declaration]
   70 | #define yyerror         tscript_yyerror
      |                         ^~~~~~~~~~~~~~~
tscript_parser.y:154:6: note: in expansion of macro 'yyerror'
  154 |      yyerror(context,
      |      ^~~~~~~
x86_64-pld-linux-gcc -c tscript_values.c -O2 -fPIC
tscript_values.c: In function 'tscript_value_create':
tscript_values.c:50:3: warning: implicit declaration of function 'asprintf' [-Wimplicit-function-declaration]
   50 |   asprintf(&v->data, "%s", data);
      |   ^~~~~~~~
tscript_values.c: In function 'tscript_value_create_error':
tscript_values.c:69:2: warning: implicit declaration of function 'vasprintf' [-Wimplicit-function-declaration]
   69 |  vasprintf(&msg, format, va);
      |  ^~~~~~~~~
tscript_values.c: In function 'tscript_value_dereference':
tscript_values.c:200:4: warning: implicit declaration of function 'tscript_internal_error'; did you mean 'tscript_value_create_error'? [-Wimplicit-function-declaration]
  200 |    tscript_internal_error("Reference pointer is NULL!\n");
      |    ^~~~~~~~~~~~~~~~~~~~~~
      |    tscript_value_create_error
x86_64-pld-linux-gcc -c tscript_extensions.c -O2 -fPIC
tscript_extensions.c: In function 'tscript_run_extension':
tscript_extensions.c:113:3: warning: implicit declaration of function 'tscript_internal_error'; did you mean 'tscript_value_create_error'? [-Wimplicit-function-declaration]
  113 |   tscript_internal_error("Cannot find extension\n");
      |   ^~~~~~~~~~~~~~~~~~~~~~
      |   tscript_value_create_error
x86_64-pld-linux-gcc -c tscript_debug.c -O2 -fPIC
tscript_debug.c: In function 'tscript_yyerror':
tscript_debug.c:70:2: warning: implicit declaration of function 'asprintf'; did you mean 'vsprintf'? [-Wimplicit-function-declaration]
   70 |  asprintf(&context->error, "(line: %i, col: %i): %s",
      |  ^~~~~~~~
      |  vsprintf
flex -otscript_lexical.c -Ptscript_yy tscript_lexical.yy 
x86_64-pld-linux-gcc -c tscript_lexical.c -O2 -fPIC
tscript_lexical.yy: In function 'tscript_yylex':
tscript_lexical.yy:282:11: warning: implicit declaration of function 'tscript_has_extension' [-Wimplicit-function-declaration]
  282 |       if (tscript_has_extension(context, yytext))
      |           ^~~~~~~~~~~~~~~~~~~~~
tscript_lexical.yy:286:12: warning: implicit declaration of function 'tscript_extension_is_block'; did you mean 'tscript_extension_map_count'? [-Wimplicit-function-declaration]
  286 |        if (tscript_extension_is_block(context,
      |            ^~~~~~~~~~~~~~~~~~~~~~~~~~
      |            tscript_extension_map_count
tscript_lexical.yy:291:11: warning: implicit declaration of function 'tscript_has_constant'; did you mean 'tscript_yy_scan_string'? [-Wimplicit-function-declaration]
  291 |       if (tscript_has_constant(context, yytext))
      |           ^~~~~~~~~~~~~~~~~~~~
      |           tscript_yy_scan_string
ar rs libtscript.a tscript_ast.o tscript_context.o tscript_compiler.o tscript_interpreter.o tscript_variables.o tscript_parser.o tscript_values.o tscript_extensions.o tscript_debug.o tscript_lexical.o
ar: creating libtscript.a
x86_64-pld-linux-gcc -shared -o libtscript.so tscript_ast.o tscript_context.o tscript_compiler.o tscript_interpreter.o tscript_variables.o tscript_parser.o tscript_values.o tscript_extensions.o tscript_debug.o tscript_lexical.o 
strip libtscript.so
make[1]: Leaving directory '/tmp/B.BHJf8e/BUILD/lms/daemon/modules/parser/lib'
/usr/bin/make -C extensions
make[1]: Entering directory '/tmp/B.BHJf8e/BUILD/lms/daemon/modules/parser/extensions'
gcc -c tscript_exec.c -I/usr/include -Wall -O2 -fPIC -DGNU -DUSE_PGSQL -I../.. -I../lib -D_GNU_SOURCE
gcc -c tscript_string.c -I/usr/include -Wall -O2 -fPIC -DGNU -DUSE_PGSQL -I../.. -I../lib -D_GNU_SOURCE
gcc -c tscript_file.c -I/usr/include -Wall -O2 -fPIC -DGNU -DUSE_PGSQL -I../.. -I../lib -D_GNU_SOURCE
gcc -c tscript_sysinfo.c -I/usr/include -Wall -O2 -fPIC -DGNU -DUSE_PGSQL -I../.. -I../lib -D_GNU_SOURCE
gcc -c sql.c -I/usr/include -Wall -O2 -fPIC -DGNU -DUSE_PGSQL -I../.. -I../lib -D_GNU_SOURCE
gcc -c net.c -I/usr/include -Wall -O2 -fPIC -DGNU -DUSE_PGSQL -I../.. -I../lib -D_GNU_SOURCE
gcc -c syslog.c -I/usr/include -Wall -O2 -fPIC -DGNU -DUSE_PGSQL -I../.. -I../lib -D_GNU_SOURCE
ar rs tscript_extensions.a ../../../dbdrivers/pgsql/db.o ../../../util.o tscript_exec.o tscript_string.o tscript_file.o tscript_sysinfo.o sql.o net.o syslog.o
ar: creating tscript_extensions.a
make[1]: Leaving directory '/tmp/B.BHJf8e/BUILD/lms/daemon/modules/parser/extensions'
x86_64-pld-linux-gcc -I/usr/include -Wall -O2 -fPIC -DGNU -DUSE_PGSQL -I../.. -I./lib   -c -o parser.o parser.c
gcc -shared parser.o lib/libtscript.a extensions/tscript_extensions.a -o parser.so -L/usr/lib64 -lfl -lm -lpq -ldl  
rm -rf parser.o lib/libtscript.a extensions/tscript_extensions.a
make: Leaving directory '/tmp/B.BHJf8e/BUILD/lms/daemon/modules/parser'
+ cd ..
+ exit 0
Executing(%install): /bin/sh -e /tmp/B.BHJf8e/BUILD/tmp/rpm-tmp.9426
TMP=/home/users/builder/tmp
HOME=/home/users/builder
PATH=/home/users/builder/GNUstep/Tools:/bin:/usr/bin:/usr/local/bin:/home/users/builder/bin
TMPDIR=/tmp/B.BHJf8e/BUILD/tmp
+ umask 022
+ cd /tmp/B.BHJf8e/BUILD
+ /bin/rm '--interactive=never' -rf /tmp/B.BHJf8e/BUILD/tmp/lms-1.11.13-root-builder
+ /bin/mkdir -p /tmp/B.BHJf8e/BUILD/tmp/lms-1.11.13-root-builder
+ cd lms
+ rm -rf /tmp/B.BHJf8e/BUILD/tmp/lms-1.11.13-root-builder
+ install -d /tmp/B.BHJf8e/BUILD/tmp/lms-1.11.13-root-builder/usr/sbin /tmp/B.BHJf8e/BUILD/tmp/lms-1.11.13-root-builder/usr/lib64/lms /tmp/B.BHJf8e/BUILD/tmp/lms-1.11.13-root-builder/etc/webapps/lms /tmp/B.BHJf8e/BUILD/tmp/lms-1.11.13-root-builder/etc/rc.d/init.d /tmp/B.BHJf8e/BUILD/tmp/lms-1.11.13-root-builder/etc/sysconfig /tmp/B.BHJf8e/BUILD/tmp/lms-1.11.13-root-builder/etc/lms/modules /tmp/B.BHJf8e/BUILD/tmp/lms-1.11.13-root-builder/usr/share/php/Smarty/plugins /tmp/B.BHJf8e/BUILD/tmp/lms-1.11.13-root-builder/usr/share/lms/lms /tmp/B.BHJf8e/BUILD/tmp/lms-1.11.13-root-builder/usr/share/lms/userpanel /tmp/B.BHJf8e/BUILD/tmp/lms-1.11.13-root-builder/usr/share/lms/www/doc /tmp/B.BHJf8e/BUILD/tmp/lms-1.11.13-root-builder/usr/share/lms/www/user /tmp/B.BHJf8e/BUILD/tmp/lms-1.11.13-root-builder/usr/share/lms/www/userpanel/modules /tmp/B.BHJf8e/BUILD/tmp/lms-1.11.13-root-builder/var/lib/lms/backups /tmp/B.BHJf8e/BUILD/tmp/lms-1.11.13-root-builder/var/lib/lms/documents /tmp/B.BHJf8e/BUILD/tmp/lms-1.11.13-root-builder/var/lib/lms/templates_c /tmp/B.BHJf8e/BUILD/tmp/lms-1.11.13-root-builder/var/lib/lms/userpanel/templates_c
+ cp -a index.php img /tmp/B.BHJf8e/BUILD/tmp/lms-1.11.13-root-builder/usr/share/lms/www
+ cp -a doc/html /tmp/B.BHJf8e/BUILD/tmp/lms-1.11.13-root-builder/usr/share/lms/www/doc
+ cp -a contrib lib modules sample templates /tmp/B.BHJf8e/BUILD/tmp/lms-1.11.13-root-builder/usr/share/lms
+ cp -a smarty-plugins/block.t.php smarty-plugins/function.bankaccount.php smarty-plugins/function.gentime.php smarty-plugins/function.handle.php smarty-plugins/function.memory.php smarty-plugins/function.number.php smarty-plugins/function.size.php smarty-plugins/function.sum.php smarty-plugins/function.tip.php smarty-plugins/modifier.money_format.php smarty-plugins/modifier.striphtml.php smarty-plugins/modifier.to_words.php /tmp/B.BHJf8e/BUILD/tmp/lms-1.11.13-root-builder/usr/share/php/Smarty/plugins
+ cp -a bin/lms-arpd bin/lms-arping bin/lms-cutoff bin/lms-etherdesc bin/lms-fping bin/lms-ipfw bin/lms-makearp bin/lms-makedhcpconf bin/lms-makehosts bin/lms-makeipchains bin/lms-makeiptables bin/lms-makemacs bin/lms-makemessages bin/lms-makeoidentconf bin/lms-makeon bin/lms-makeopenbsdpf bin/lms-makewarnings bin/lms-mgc bin/lms-notify bin/lms-notify-messages bin/lms-notify-sms bin/lms-payments bin/lms-reminder bin/lms-rtparser bin/lms-sendinvoices bin/lms-smstools bin/lms-traffic bin/lms-traffic-htbiptlimits bin/lms-traffic-logiptables /tmp/B.BHJf8e/BUILD/tmp/lms-1.11.13-root-builder/usr/sbin
+ /bin/mv /tmp/B.BHJf8e/BUILD/tmp/lms-1.11.13-root-builder/usr/share/lms/sample/lms.ini /tmp/B.BHJf8e/BUILD/tmp/lms-1.11.13-root-builder/etc/lms
+ install /tmp/B.BHJf8e/lms-apache.conf /tmp/B.BHJf8e/BUILD/tmp/lms-1.11.13-root-builder/etc/webapps/lms/apache.conf
+ install /tmp/B.BHJf8e/lms-httpd.conf /tmp/B.BHJf8e/BUILD/tmp/lms-1.11.13-root-builder/etc/webapps/lms/httpd.conf
+ /bin/mv /tmp/B.BHJf8e/BUILD/tmp/lms-1.11.13-root-builder/usr/share/lms/contrib/sqlpanel/sql.php /tmp/B.BHJf8e/BUILD/tmp/lms-1.11.13-root-builder/usr/share/lms/contrib/sqlpanel/sqllang.php /tmp/B.BHJf8e/BUILD/tmp/lms-1.11.13-root-builder/usr/share/lms/modules
+ /bin/mv /tmp/B.BHJf8e/BUILD/tmp/lms-1.11.13-root-builder/usr/share/lms/contrib/sqlpanel/sql.html /tmp/B.BHJf8e/BUILD/tmp/lms-1.11.13-root-builder/usr/share/lms/contrib/sqlpanel/sqlprint.html /tmp/B.BHJf8e/BUILD/tmp/lms-1.11.13-root-builder/usr/share/lms/templates
+ /bin/mv /tmp/B.BHJf8e/BUILD/tmp/lms-1.11.13-root-builder/usr/share/lms/contrib/customer/customer.html /tmp/B.BHJf8e/BUILD/tmp/lms-1.11.13-root-builder/usr/share/lms/contrib/customer/index.php /tmp/B.BHJf8e/BUILD/tmp/lms-1.11.13-root-builder/usr/share/lms/contrib/customer/lms-powered.png /tmp/B.BHJf8e/BUILD/tmp/lms-1.11.13-root-builder/usr/share/lms/contrib/customer/locale /tmp/B.BHJf8e/BUILD/tmp/lms-1.11.13-root-builder/usr/share/lms/www/user
+ install daemon/lmsd-mysql daemon/lmsd-pgsql /tmp/B.BHJf8e/BUILD/tmp/lms-1.11.13-root-builder/usr/sbin
+ install daemon/modules/cutoff/cutoff.so daemon/modules/dhcp/dhcp.so daemon/modules/dns/dns.so daemon/modules/ethers/ethers.so daemon/modules/ewx-pt/ewx-pt.so daemon/modules/ewx-stm-channels/ewx-stm-channels.so daemon/modules/ewx-stm/ewx-stm.so daemon/modules/ggnotify/ggnotify.so daemon/modules/hostfile/hostfile.so daemon/modules/notify/notify.so daemon/modules/oident/oident.so daemon/modules/parser/parser.so daemon/modules/payments/payments.so daemon/modules/pinger/pinger.so daemon/modules/system/system.so daemon/modules/tc-new/tc-new.so daemon/modules/tc/tc.so daemon/modules/traffic/traffic.so /tmp/B.BHJf8e/BUILD/tmp/lms-1.11.13-root-builder/usr/lib64/lms
+ cp -a daemon/modules/dns/sample /tmp/B.BHJf8e/BUILD/tmp/lms-1.11.13-root-builder/etc/lms/modules/dns
+ cp -a daemon/modules/ggnotify/sample /tmp/B.BHJf8e/BUILD/tmp/lms-1.11.13-root-builder/etc/lms/modules/ggnotify
+ cp -a daemon/modules/notify/sample /tmp/B.BHJf8e/BUILD/tmp/lms-1.11.13-root-builder/etc/lms/modules/notify
+ install /tmp/B.BHJf8e/lms.init /tmp/B.BHJf8e/BUILD/tmp/lms-1.11.13-root-builder/etc/rc.d/init.d/lmsd
+ install /tmp/B.BHJf8e/lms.sysconfig /tmp/B.BHJf8e/BUILD/tmp/lms-1.11.13-root-builder/etc/sysconfig/lms
+ cp -a userpanel/lib userpanel/modules userpanel/templates /tmp/B.BHJf8e/BUILD/tmp/lms-1.11.13-root-builder/usr/share/lms/userpanel
+ cp -a userpanel/index.php userpanel/style /tmp/B.BHJf8e/BUILD/tmp/lms-1.11.13-root-builder/usr/share/lms/www/userpanel
+ ln -s /usr/share/lms/www/userpanel/style /tmp/B.BHJf8e/BUILD/tmp/lms-1.11.13-root-builder/usr/share/lms/userpanel
+ ln -s /var/lib/lms/userpanel/templates_c /tmp/B.BHJf8e/BUILD/tmp/lms-1.11.13-root-builder/usr/share/lms/userpanel
+ basename /tmp/B.BHJf8e/BUILD/tmp/lms-1.11.13-root-builder/usr/share/lms/userpanel/modules/finances
+ MODULE=finances 
+ mkdir /tmp/B.BHJf8e/BUILD/tmp/lms-1.11.13-root-builder/usr/share/lms/www/userpanel/modules/finances
+ ln -s /usr/share/lms/userpanel/modules/finances/style /tmp/B.BHJf8e/BUILD/tmp/lms-1.11.13-root-builder/usr/share/lms/www/userpanel/modules/finances
+ basename /tmp/B.BHJf8e/BUILD/tmp/lms-1.11.13-root-builder/usr/share/lms/userpanel/modules/help
+ MODULE=help 
+ mkdir /tmp/B.BHJf8e/BUILD/tmp/lms-1.11.13-root-builder/usr/share/lms/www/userpanel/modules/help
+ ln -s /usr/share/lms/userpanel/modules/help/style /tmp/B.BHJf8e/BUILD/tmp/lms-1.11.13-root-builder/usr/share/lms/www/userpanel/modules/help
+ basename /tmp/B.BHJf8e/BUILD/tmp/lms-1.11.13-root-builder/usr/share/lms/userpanel/modules/helpdesk
+ MODULE=helpdesk 
+ mkdir /tmp/B.BHJf8e/BUILD/tmp/lms-1.11.13-root-builder/usr/share/lms/www/userpanel/modules/helpdesk
+ ln -s /usr/share/lms/userpanel/modules/helpdesk/style /tmp/B.BHJf8e/BUILD/tmp/lms-1.11.13-root-builder/usr/share/lms/www/userpanel/modules/helpdesk
+ basename /tmp/B.BHJf8e/BUILD/tmp/lms-1.11.13-root-builder/usr/share/lms/userpanel/modules/info
+ MODULE=info 
+ mkdir /tmp/B.BHJf8e/BUILD/tmp/lms-1.11.13-root-builder/usr/share/lms/www/userpanel/modules/info
+ ln -s /usr/share/lms/userpanel/modules/info/style /tmp/B.BHJf8e/BUILD/tmp/lms-1.11.13-root-builder/usr/share/lms/www/userpanel/modules/info
+ basename /tmp/B.BHJf8e/BUILD/tmp/lms-1.11.13-root-builder/usr/share/lms/userpanel/modules/logout
+ MODULE=logout 
+ mkdir /tmp/B.BHJf8e/BUILD/tmp/lms-1.11.13-root-builder/usr/share/lms/www/userpanel/modules/logout
+ ln -s /usr/share/lms/userpanel/modules/logout/style /tmp/B.BHJf8e/BUILD/tmp/lms-1.11.13-root-builder/usr/share/lms/www/userpanel/modules/logout
+ basename /tmp/B.BHJf8e/BUILD/tmp/lms-1.11.13-root-builder/usr/share/lms/userpanel/modules/messages
+ MODULE=messages 
+ mkdir /tmp/B.BHJf8e/BUILD/tmp/lms-1.11.13-root-builder/usr/share/lms/www/userpanel/modules/messages
+ ln -s /usr/share/lms/userpanel/modules/messages/style /tmp/B.BHJf8e/BUILD/tmp/lms-1.11.13-root-builder/usr/share/lms/www/userpanel/modules/messages
+ basename /tmp/B.BHJf8e/BUILD/tmp/lms-1.11.13-root-builder/usr/share/lms/userpanel/modules/modules
+ MODULE=modules 
+ mkdir /tmp/B.BHJf8e/BUILD/tmp/lms-1.11.13-root-builder/usr/share/lms/www/userpanel/modules/modules
+ ln -s /usr/share/lms/userpanel/modules/modules/style /tmp/B.BHJf8e/BUILD/tmp/lms-1.11.13-root-builder/usr/share/lms/www/userpanel/modules/modules
+ basename /tmp/B.BHJf8e/BUILD/tmp/lms-1.11.13-root-builder/usr/share/lms/userpanel/modules/stats
+ MODULE=stats 
+ mkdir /tmp/B.BHJf8e/BUILD/tmp/lms-1.11.13-root-builder/usr/share/lms/www/userpanel/modules/stats
+ ln -s /usr/share/lms/userpanel/modules/stats/style /tmp/B.BHJf8e/BUILD/tmp/lms-1.11.13-root-builder/usr/share/lms/www/userpanel/modules/stats
+ /usr/lib/rpm/find-debuginfo.sh /tmp/B.BHJf8e/BUILD/lms
RPM_BUILD_DIR=/tmp/B.BHJf8e/BUILD

extracting debug info from /tmp/B.BHJf8e/BUILD/tmp/lms-1.11.13-root-builder/usr/lib64/lms/cutoff.so
extracting debug info from /tmp/B.BHJf8e/BUILD/tmp/lms-1.11.13-root-builder/usr/lib64/lms/dhcp.so
extracting debug info from /tmp/B.BHJf8e/BUILD/tmp/lms-1.11.13-root-builder/usr/lib64/lms/dns.so
extracting debug info from /tmp/B.BHJf8e/BUILD/tmp/lms-1.11.13-root-builder/usr/lib64/lms/ethers.so
extracting debug info from /tmp/B.BHJf8e/BUILD/tmp/lms-1.11.13-root-builder/usr/lib64/lms/ewx-pt.so
extracting debug info from /tmp/B.BHJf8e/BUILD/tmp/lms-1.11.13-root-builder/usr/lib64/lms/ewx-stm-channels.so
extracting debug info from /tmp/B.BHJf8e/BUILD/tmp/lms-1.11.13-root-builder/usr/lib64/lms/ewx-stm.so
extracting debug info from /tmp/B.BHJf8e/BUILD/tmp/lms-1.11.13-root-builder/usr/lib64/lms/ggnotify.so
extracting debug info from /tmp/B.BHJf8e/BUILD/tmp/lms-1.11.13-root-builder/usr/lib64/lms/hostfile.so
extracting debug info from /tmp/B.BHJf8e/BUILD/tmp/lms-1.11.13-root-builder/usr/lib64/lms/notify.so
extracting debug info from /tmp/B.BHJf8e/BUILD/tmp/lms-1.11.13-root-builder/usr/lib64/lms/oident.so
extracting debug info from /tmp/B.BHJf8e/BUILD/tmp/lms-1.11.13-root-builder/usr/lib64/lms/parser.so
extracting debug info from /tmp/B.BHJf8e/BUILD/tmp/lms-1.11.13-root-builder/usr/lib64/lms/payments.so
extracting debug info from /tmp/B.BHJf8e/BUILD/tmp/lms-1.11.13-root-builder/usr/lib64/lms/pinger.so
extracting debug info from /tmp/B.BHJf8e/BUILD/tmp/lms-1.11.13-root-builder/usr/lib64/lms/system.so
extracting debug info from /tmp/B.BHJf8e/BUILD/tmp/lms-1.11.13-root-builder/usr/lib64/lms/tc-new.so
extracting debug info from /tmp/B.BHJf8e/BUILD/tmp/lms-1.11.13-root-builder/usr/lib64/lms/tc.so
extracting debug info from /tmp/B.BHJf8e/BUILD/tmp/lms-1.11.13-root-builder/usr/lib64/lms/traffic.so
extracting debug info from /tmp/B.BHJf8e/BUILD/tmp/lms-1.11.13-root-builder/usr/sbin/lmsd-mysql
extracting debug info from /tmp/B.BHJf8e/BUILD/tmp/lms-1.11.13-root-builder/usr/sbin/lmsd-pgsql
cpio: /tmp/B.fDKtQa/BUILD/glibc-2.32/csu: Cannot stat: No such file or directory
798 blocks
+ __spec_install_post_strip
+ set +x
Stripping 2 ELF executables...DONE
Stripping 18 ELF shared libraries...DONE
+ __spec_install_post_chrpath
+ set +x
Remove RPATH/RUNPATH from 20 executable binaries and shared object files.
+ __spec_install_post_compress_modules
+ set +x
+ __spec_install_post_check_so
+ set +x
Searching for shared objects with unresolved symbols... DONE
+ __spec_install_post_check_tmpfiles
+ set +x
Checking /var/run <-> tmpfiles.d completeness...
 DONE
+ __spec_install_post_check_shebangs
+ set +x
Checking script shebangs...
 DONE
+ __spec_install_post_compress_docs
+ set +x
+ __spec_install_post_py_hardlink
+ set +x
Processing files: lms-1.11.13-12.x86_64
Executing(%doc): /bin/sh -e /tmp/B.BHJf8e/BUILD/tmp/rpm-tmp.69335
+ umask 022
+ cd /tmp/B.BHJf8e/BUILD
+ cd lms
+ DOCDIR=/tmp/B.BHJf8e/BUILD/tmp/lms-1.11.13-root-builder/usr/share/doc/lms-1.11.13 
+ export DOCDIR
+ test -d /tmp/B.BHJf8e/BUILD/tmp/lms-1.11.13-root-builder/usr/share/doc/lms-1.11.13
+ /bin/mkdir -p /tmp/B.BHJf8e/BUILD/tmp/lms-1.11.13-root-builder/usr/share/doc/lms-1.11.13
+ cp -pr doc/AUTHORS doc/ChangeLog doc/INSTALL doc/README doc/README.pl doc/lms.mysql doc/lms.pgsql /tmp/B.BHJf8e/BUILD/tmp/lms-1.11.13-root-builder/usr/share/doc/lms-1.11.13
+ /usr/lib/rpm/compress-doc
Compressing documentation in /tmp/B.BHJf8e/BUILD/tmp/lms-1.11.13-root-builder/usr/share/doc/lms-1.11.13...
./AUTHORS ./ChangeLog ./INSTALL ./README ./README.pl ./lms.mysql ./lms.pgsql 
Documentation compressed.
+ exit 0
skipping /usr/share/doc/lms-1.11.13 requires detection
error: Couldn't exec /usr/lib/rpm/php.prov: No such file or directory
env: '/usr/lib/rpm/php.req': No such file or directory
error: Couldn't exec /usr/lib/rpm/php.prov: No such file or directory
env: '/usr/lib/rpm/php.req': No such file or directory
error: Couldn't exec /usr/lib/rpm/php.prov: No such file or directory
env: '/usr/lib/rpm/php.req': No such file or directory
error: Couldn't exec /usr/lib/rpm/php.prov: No such file or directory
env: '/usr/lib/rpm/php.req': No such file or directory
error: Couldn't exec /usr/lib/rpm/php.prov: No such file or directory
env: '/usr/lib/rpm/php.req': No such file or directory
error: Couldn't exec /usr/lib/rpm/php.prov: No such file or directory
env: '/usr/lib/rpm/php.req': No such file or directory
error: Couldn't exec /usr/lib/rpm/php.prov: No such file or directory
env: '/usr/lib/rpm/php.req': No such file or directory
error: Couldn't exec /usr/lib/rpm/php.prov: No such file or directory
env: '/usr/lib/rpm/php.req': No such file or directory
error: Couldn't exec /usr/lib/rpm/php.prov: No such file or directory
env: '/usr/lib/rpm/php.req': No such file or directory
error: Couldn't exec /usr/lib/rpm/php.prov: No such file or directory
env: '/usr/lib/rpm/php.req': No such file or directory
error: Couldn't exec /usr/lib/rpm/php.prov: No such file or directory
env: '/usr/lib/rpm/php.req': No such file or directory
error: Couldn't exec /usr/lib/rpm/php.prov: No such file or directory
env: '/usr/lib/rpm/php.req': No such file or directory
error: Couldn't exec /usr/lib/rpm/php.prov: No such file or directory
env: '/usr/lib/rpm/php.req': No such file or directory
error: Couldn't exec /usr/lib/rpm/php.prov: No such file or directory
env: '/usr/lib/rpm/php.req': No such file or directory
error: Couldn't exec /usr/lib/rpm/php.prov: No such file or directory
env: '/usr/lib/rpm/php.req': No such file or directory
error: Couldn't exec /usr/lib/rpm/php.prov: No such file or directory
env: '/usr/lib/rpm/php.req': No such file or directory
error: Couldn't exec /usr/lib/rpm/php.prov: No such file or directory
env: '/usr/lib/rpm/php.req': No such file or directory
error: Couldn't exec /usr/lib/rpm/php.prov: No such file or directory
env: '/usr/lib/rpm/php.req': No such file or directory
error: Couldn't exec /usr/lib/rpm/php.prov: No such file or directory
env: '/usr/lib/rpm/php.req': No such file or directory
error: Couldn't exec /usr/lib/rpm/php.prov: No such file or directory
env: '/usr/lib/rpm/php.req': No such file or directory
error: Couldn't exec /usr/lib/rpm/php.prov: No such file or directory
env: '/usr/lib/rpm/php.req': No such file or directory
error: Couldn't exec /usr/lib/rpm/php.prov: No such file or directory
env: '/usr/lib/rpm/php.req': No such file or directory
error: Couldn't exec /usr/lib/rpm/php.prov: No such file or directory
env: '/usr/lib/rpm/php.req': No such file or directory
error: Couldn't exec /usr/lib/rpm/php.prov: No such file or directory
env: '/usr/lib/rpm/php.req': No such file or directory
error: Couldn't exec /usr/lib/rpm/php.prov: No such file or directory
env: '/usr/lib/rpm/php.req': No such file or directory
error: Couldn't exec /usr/lib/rpm/php.prov: No such file or directory
env: '/usr/lib/rpm/php.req': No such file or directory
error: Couldn't exec /usr/lib/rpm/php.prov: No such file or directory
env: '/usr/lib/rpm/php.req': No such file or directory
error: Couldn't exec /usr/lib/rpm/php.prov: No such file or directory
env: '/usr/lib/rpm/php.req': No such file or directory
error: Couldn't exec /usr/lib/rpm/php.prov: No such file or directory
env: '/usr/lib/rpm/php.req': No such file or directory
error: Couldn't exec /usr/lib/rpm/php.prov: No such file or directory
env: '/usr/lib/rpm/php.req': No such file or directory
error: Couldn't exec /usr/lib/rpm/php.prov: No such file or directory
env: '/usr/lib/rpm/php.req': No such file or directory
error: Couldn't exec /usr/lib/rpm/php.prov: No such file or directory
env: '/usr/lib/rpm/php.req': No such file or directory
error: Couldn't exec /usr/lib/rpm/php.prov: No such file or directory
env: '/usr/lib/rpm/php.req': No such file or directory
error: Couldn't exec /usr/lib/rpm/php.prov: No such file or directory
env: '/usr/lib/rpm/php.req': No such file or directory
error: Couldn't exec /usr/lib/rpm/php.prov: No such file or directory
env: '/usr/lib/rpm/php.req': No such file or directory
error: Couldn't exec /usr/lib/rpm/php.prov: No such file or directory
env: '/usr/lib/rpm/php.req': No such file or directory
error: Couldn't exec /usr/lib/rpm/php.prov: No such file or directory
env: '/usr/lib/rpm/php.req': No such file or directory
error: Couldn't exec /usr/lib/rpm/php.prov: No such file or directory
env: '/usr/lib/rpm/php.req': No such file or directory
error: Couldn't exec /usr/lib/rpm/php.prov: No such file or directory
env: '/usr/lib/rpm/php.req': No such file or directory
error: Couldn't exec /usr/lib/rpm/php.prov: No such file or directory
env: '/usr/lib/rpm/php.req': No such file or directory
error: Couldn't exec /usr/lib/rpm/php.prov: No such file or directory
env: '/usr/lib/rpm/php.req': No such file or directory
error: Couldn't exec /usr/lib/rpm/php.prov: No such file or directory
env: '/usr/lib/rpm/php.req': No such file or directory
error: Couldn't exec /usr/lib/rpm/php.prov: No such file or directory
env: '/usr/lib/rpm/php.req': No such file or directory
error: Couldn't exec /usr/lib/rpm/php.prov: No such file or directory
env: '/usr/lib/rpm/php.req': No such file or directory
error: Couldn't exec /usr/lib/rpm/php.prov: No such file or directory
env: '/usr/lib/rpm/php.req': No such file or directory
error: Couldn't exec /usr/lib/rpm/php.prov: No such file or directory
env: '/usr/lib/rpm/php.req': No such file or directory
error: Couldn't exec /usr/lib/rpm/php.prov: No such file or directory
env: '/usr/lib/rpm/php.req': No such file or directory
error: Couldn't exec /usr/lib/rpm/php.prov: No such file or directory
env: '/usr/lib/rpm/php.req': No such file or directory
error: Couldn't exec /usr/lib/rpm/php.prov: No such file or directory
env: '/usr/lib/rpm/php.req': No such file or directory
error: Couldn't exec /usr/lib/rpm/php.prov: No such file or directory
env: '/usr/lib/rpm/php.req': No such file or directory
error: Couldn't exec /usr/lib/rpm/php.prov: No such file or directory
env: '/usr/lib/rpm/php.req': No such file or directory
error: Couldn't exec /usr/lib/rpm/php.prov: No such file or directory
env: '/usr/lib/rpm/php.req': No such file or directory
error: Couldn't exec /usr/lib/rpm/php.prov: No such file or directory
env: '/usr/lib/rpm/php.req': No such file or directory
error: Couldn't exec /usr/lib/rpm/php.prov: No such file or directory
env: '/usr/lib/rpm/php.req': No such file or directory
error: Couldn't exec /usr/lib/rpm/php.prov: No such file or directory
env: '/usr/lib/rpm/php.req': No such file or directory
error: Couldn't exec /usr/lib/rpm/php.prov: No such file or directory
env: '/usr/lib/rpm/php.req': No such file or directory
error: Couldn't exec /usr/lib/rpm/php.prov: No such file or directory
env: '/usr/lib/rpm/php.req': No such file or directory
error: Couldn't exec /usr/lib/rpm/php.prov: No such file or directory
env: '/usr/lib/rpm/php.req': No such file or directory
error: Couldn't exec /usr/lib/rpm/php.prov: No such file or directory
env: '/usr/lib/rpm/php.req': No such file or directory
error: Couldn't exec /usr/lib/rpm/php.prov: No such file or directory
env: '/usr/lib/rpm/php.req': No such file or directory
error: Couldn't exec /usr/lib/rpm/php.prov: No such file or directory
env: '/usr/lib/rpm/php.req': No such file or directory
error: Couldn't exec /usr/lib/rpm/php.prov: No such file or directory
env: '/usr/lib/rpm/php.req': No such file or directory
error: Couldn't exec /usr/lib/rpm/php.prov: No such file or directory
env: '/usr/lib/rpm/php.req': No such file or directory
error: Couldn't exec /usr/lib/rpm/php.prov: No such file or directory
env: '/usr/lib/rpm/php.req': No such file or directory
error: Couldn't exec /usr/lib/rpm/php.prov: No such file or directory
env: '/usr/lib/rpm/php.req': No such file or directory
error: Couldn't exec /usr/lib/rpm/php.prov: No such file or directory
env: '/usr/lib/rpm/php.req': No such file or directory
error: Couldn't exec /usr/lib/rpm/php.prov: No such file or directory
env: '/usr/lib/rpm/php.req': No such file or directory
error: Couldn't exec /usr/lib/rpm/php.prov: No such file or directory
env: '/usr/lib/rpm/php.req': No such file or directory
error: Couldn't exec /usr/lib/rpm/php.prov: No such file or directory
env: '/usr/lib/rpm/php.req': No such file or directory
error: Couldn't exec /usr/lib/rpm/php.prov: No such file or directory
env: '/usr/lib/rpm/php.req': No such file or directory
error: Couldn't exec /usr/lib/rpm/php.prov: No such file or directory
env: '/usr/lib/rpm/php.req': No such file or directory
error: Couldn't exec /usr/lib/rpm/php.prov: No such file or directory
env: '/usr/lib/rpm/php.req': No such file or directory
error: Couldn't exec /usr/lib/rpm/php.prov: No such file or directory
env: '/usr/lib/rpm/php.req': No such file or directory
error: Couldn't exec /usr/lib/rpm/php.prov: No such file or directory
env: '/usr/lib/rpm/php.req': No such file or directory
error: Couldn't exec /usr/lib/rpm/php.prov: No such file or directory
env: '/usr/lib/rpm/php.req': No such file or directory
error: Couldn't exec /usr/lib/rpm/php.prov: No such file or directory
env: '/usr/lib/rpm/php.req': No such file or directory
error: Couldn't exec /usr/lib/rpm/php.prov: No such file or directory
env: '/usr/lib/rpm/php.req': No such file or directory
error: Couldn't exec /usr/lib/rpm/php.prov: No such file or directory
env: '/usr/lib/rpm/php.req': No such file or directory
error: Couldn't exec /usr/lib/rpm/php.prov: No such file or directory
env: '/usr/lib/rpm/php.req': No such file or directory
error: Couldn't exec /usr/lib/rpm/php.prov: No such file or directory
env: '/usr/lib/rpm/php.req': No such file or directory
error: Couldn't exec /usr/lib/rpm/php.prov: No such file or directory
env: '/usr/lib/rpm/php.req': No such file or directory
error: Couldn't exec /usr/lib/rpm/php.prov: No such file or directory
env: '/usr/lib/rpm/php.req': No such file or directory
error: Couldn't exec /usr/lib/rpm/php.prov: No such file or directory
env: '/usr/lib/rpm/php.req': No such file or directory
error: Couldn't exec /usr/lib/rpm/php.prov: No such file or directory
env: '/usr/lib/rpm/php.req': No such file or directory
error: Couldn't exec /usr/lib/rpm/php.prov: No such file or directory
env: '/usr/lib/rpm/php.req': No such file or directory
error: Couldn't exec /usr/lib/rpm/php.prov: No such file or directory
env: '/usr/lib/rpm/php.req': No such file or directory
error: Couldn't exec /usr/lib/rpm/php.prov: No such file or directory
env: '/usr/lib/rpm/php.req': No such file or directory
error: Couldn't exec /usr/lib/rpm/php.prov: No such file or directory
env: '/usr/lib/rpm/php.req': No such file or directory
error: Couldn't exec /usr/lib/rpm/php.prov: No such file or directory
env: '/usr/lib/rpm/php.req': No such file or directory
error: Couldn't exec /usr/lib/rpm/php.prov: No such file or directory
env: '/usr/lib/rpm/php.req': No such file or directory
error: Couldn't exec /usr/lib/rpm/php.prov: No such file or directory
env: '/usr/lib/rpm/php.req': No such file or directory
error: Couldn't exec /usr/lib/rpm/php.prov: No such file or directory
env: '/usr/lib/rpm/php.req': No such file or directory
error: Couldn't exec /usr/lib/rpm/php.prov: No such file or directory
env: '/usr/lib/rpm/php.req': No such file or directory
error: Couldn't exec /usr/lib/rpm/php.prov: No such file or directory
env: '/usr/lib/rpm/php.req': No such file or directory
error: Couldn't exec /usr/lib/rpm/php.prov: No such file or directory
env: '/usr/lib/rpm/php.req': No such file or directory
error: Couldn't exec /usr/lib/rpm/php.prov: No such file or directory
env: '/usr/lib/rpm/php.req': No such file or directory
error: Couldn't exec /usr/lib/rpm/php.prov: No such file or directory
env: '/usr/lib/rpm/php.req': No such file or directory
error: Couldn't exec /usr/lib/rpm/php.prov: No such file or directory
env: '/usr/lib/rpm/php.req': No such file or directory
error: Couldn't exec /usr/lib/rpm/php.prov: No such file or directory
env: '/usr/lib/rpm/php.req': No such file or directory
error: Couldn't exec /usr/lib/rpm/php.prov: No such file or directory
env: '/usr/lib/rpm/php.req': No such file or directory
error: Couldn't exec /usr/lib/rpm/php.prov: No such file or directory
env: '/usr/lib/rpm/php.req': No such file or directory
error: Couldn't exec /usr/lib/rpm/php.prov: No such file or directory
env: '/usr/lib/rpm/php.req': No such file or directory
error: Couldn't exec /usr/lib/rpm/php.prov: No such file or directory
env: '/usr/lib/rpm/php.req': No such file or directory
error: Couldn't exec /usr/lib/rpm/php.prov: No such file or directory
env: '/usr/lib/rpm/php.req': No such file or directory
error: Couldn't exec /usr/lib/rpm/php.prov: No such file or directory
env: '/usr/lib/rpm/php.req': No such file or directory
error: Couldn't exec /usr/lib/rpm/php.prov: No such file or directory
env: '/usr/lib/rpm/php.req': No such file or directory
error: Couldn't exec /usr/lib/rpm/php.prov: No such file or directory
env: '/usr/lib/rpm/php.req': No such file or directory
error: Couldn't exec /usr/lib/rpm/php.prov: No such file or directory
env: '/usr/lib/rpm/php.req': No such file or directory
error: Couldn't exec /usr/lib/rpm/php.prov: No such file or directory
env: '/usr/lib/rpm/php.req': No such file or directory
error: Couldn't exec /usr/lib/rpm/php.prov: No such file or directory
env: '/usr/lib/rpm/php.req': No such file or directory
error: Couldn't exec /usr/lib/rpm/php.prov: No such file or directory
env: '/usr/lib/rpm/php.req': No such file or directory
error: Couldn't exec /usr/lib/rpm/php.prov: No such file or directory
env: '/usr/lib/rpm/php.req': No such file or directory
error: Couldn't exec /usr/lib/rpm/php.prov: No such file or directory
env: '/usr/lib/rpm/php.req': No such file or directory
error: Couldn't exec /usr/lib/rpm/php.prov: No such file or directory
env: '/usr/lib/rpm/php.req': No such file or directory
error: Couldn't exec /usr/lib/rpm/php.prov: No such file or directory
env: '/usr/lib/rpm/php.req': No such file or directory
error: Couldn't exec /usr/lib/rpm/php.prov: No such file or directory
env: '/usr/lib/rpm/php.req': No such file or directory
error: Couldn't exec /usr/lib/rpm/php.prov: No such file or directory
env: '/usr/lib/rpm/php.req': No such file or directory
error: Couldn't exec /usr/lib/rpm/php.prov: No such file or directory
env: '/usr/lib/rpm/php.req': No such file or directory
error: Couldn't exec /usr/lib/rpm/php.prov: No such file or directory
env: '/usr/lib/rpm/php.req': No such file or directory
error: Couldn't exec /usr/lib/rpm/php.prov: No such file or directory
env: '/usr/lib/rpm/php.req': No such file or directory
error: Couldn't exec /usr/lib/rpm/php.prov: No such file or directory
env: '/usr/lib/rpm/php.req': No such file or directory
error: Couldn't exec /usr/lib/rpm/php.prov: No such file or directory
env: '/usr/lib/rpm/php.req': No such file or directory
error: Couldn't exec /usr/lib/rpm/php.prov: No such file or directory
env: '/usr/lib/rpm/php.req': No such file or directory
error: Couldn't exec /usr/lib/rpm/php.prov: No such file or directory
env: '/usr/lib/rpm/php.req': No such file or directory
error: Couldn't exec /usr/lib/rpm/php.prov: No such file or directory
env: '/usr/lib/rpm/php.req': No such file or directory
error: Couldn't exec /usr/lib/rpm/php.prov: No such file or directory
env: '/usr/lib/rpm/php.req': No such file or directory
error: Couldn't exec /usr/lib/rpm/php.prov: No such file or directory
env: '/usr/lib/rpm/php.req': No such file or directory
error: Couldn't exec /usr/lib/rpm/php.prov: No such file or directory
env: '/usr/lib/rpm/php.req': No such file or directory
error: Couldn't exec /usr/lib/rpm/php.prov: No such file or directory
env: '/usr/lib/rpm/php.req': No such file or directory
error: Couldn't exec /usr/lib/rpm/php.prov: No such file or directory
env: '/usr/lib/rpm/php.req': No such file or directory
error: Couldn't exec /usr/lib/rpm/php.prov: No such file or directory
env: '/usr/lib/rpm/php.req': No such file or directory
error: Couldn't exec /usr/lib/rpm/php.prov: No such file or directory
env: '/usr/lib/rpm/php.req': No such file or directory
error: Couldn't exec /usr/lib/rpm/php.prov: No such file or directory
env: '/usr/lib/rpm/php.req': No such file or directory
error: Couldn't exec /usr/lib/rpm/php.prov: No such file or directory
env: '/usr/lib/rpm/php.req': No such file or directory
error: Couldn't exec /usr/lib/rpm/php.prov: No such file or directory
env: '/usr/lib/rpm/php.req': No such file or directory
error: Couldn't exec /usr/lib/rpm/php.prov: No such file or directory
env: '/usr/lib/rpm/php.req': No such file or directory
error: Couldn't exec /usr/lib/rpm/php.prov: No such file or directory
env: '/usr/lib/rpm/php.req': No such file or directory
error: Couldn't exec /usr/lib/rpm/php.prov: No such file or directory
env: '/usr/lib/rpm/php.req': No such file or directory
error: Couldn't exec /usr/lib/rpm/php.prov: No such file or directory
env: '/usr/lib/rpm/php.req': No such file or directory
error: Couldn't exec /usr/lib/rpm/php.prov: No such file or directory
env: '/usr/lib/rpm/php.req': No such file or directory
error: Couldn't exec /usr/lib/rpm/php.prov: No such file or directory
env: '/usr/lib/rpm/php.req': No such file or directory
error: Couldn't exec /usr/lib/rpm/php.prov: No such file or directory
env: '/usr/lib/rpm/php.req': No such file or directory
error: Couldn't exec /usr/lib/rpm/php.prov: No such file or directory
env: '/usr/lib/rpm/php.req': No such file or directory
error: Couldn't exec /usr/lib/rpm/php.prov: No such file or directory
env: '/usr/lib/rpm/php.req': No such file or directory
error: Couldn't exec /usr/lib/rpm/php.prov: No such file or directory
env: '/usr/lib/rpm/php.req': No such file or directory
error: Couldn't exec /usr/lib/rpm/php.prov: No such file or directory
env: '/usr/lib/rpm/php.req': No such file or directory
error: Couldn't exec /usr/lib/rpm/php.prov: No such file or directory
env: '/usr/lib/rpm/php.req': No such file or directory
error: Couldn't exec /usr/lib/rpm/php.prov: No such file or directory
env: '/usr/lib/rpm/php.req': No such file or directory
error: Couldn't exec /usr/lib/rpm/php.prov: No such file or directory
env: '/usr/lib/rpm/php.req': No such file or directory
error: Couldn't exec /usr/lib/rpm/php.prov: No such file or directory
env: '/usr/lib/rpm/php.req': No such file or directory
error: Couldn't exec /usr/lib/rpm/php.prov: No such file or directory
env: '/usr/lib/rpm/php.req': No such file or directory
error: Couldn't exec /usr/lib/rpm/php.prov: No such file or directory
env: '/usr/lib/rpm/php.req': No such file or directory
error: Couldn't exec /usr/lib/rpm/php.prov: No such file or directory
env: '/usr/lib/rpm/php.req': No such file or directory
error: Couldn't exec /usr/lib/rpm/php.prov: No such file or directory
env: '/usr/lib/rpm/php.req': No such file or directory
error: Couldn't exec /usr/lib/rpm/php.prov: No such file or directory
env: '/usr/lib/rpm/php.req': No such file or directory
error: Couldn't exec /usr/lib/rpm/php.prov: No such file or directory
env: '/usr/lib/rpm/php.req': No such file or directory
error: Couldn't exec /usr/lib/rpm/php.prov: No such file or directory
env: '/usr/lib/rpm/php.req': No such file or directory
error: Couldn't exec /usr/lib/rpm/php.prov: No such file or directory
env: '/usr/lib/rpm/php.req': No such file or directory
error: Couldn't exec /usr/lib/rpm/php.prov: No such file or directory
env: '/usr/lib/rpm/php.req': No such file or directory
error: Couldn't exec /usr/lib/rpm/php.prov: No such file or directory
env: '/usr/lib/rpm/php.req': No such file or directory
error: Couldn't exec /usr/lib/rpm/php.prov: No such file or directory
env: '/usr/lib/rpm/php.req': No such file or directory
error: Couldn't exec /usr/lib/rpm/php.prov: No such file or directory
env: '/usr/lib/rpm/php.req': No such file or directory
error: Couldn't exec /usr/lib/rpm/php.prov: No such file or directory
env: '/usr/lib/rpm/php.req': No such file or directory
error: Couldn't exec /usr/lib/rpm/php.prov: No such file or directory
env: '/usr/lib/rpm/php.req': No such file or directory
error: Couldn't exec /usr/lib/rpm/php.prov: No such file or directory
env: '/usr/lib/rpm/php.req': No such file or directory
error: Couldn't exec /usr/lib/rpm/php.prov: No such file or directory
env: '/usr/lib/rpm/php.req': No such file or directory
error: Couldn't exec /usr/lib/rpm/php.prov: No such file or directory
env: '/usr/lib/rpm/php.req': No such file or directory
error: Couldn't exec /usr/lib/rpm/php.prov: No such file or directory
env: '/usr/lib/rpm/php.req': No such file or directory
error: Couldn't exec /usr/lib/rpm/php.prov: No such file or directory
env: '/usr/lib/rpm/php.req': No such file or directory
error: Couldn't exec /usr/lib/rpm/php.prov: No such file or directory
env: '/usr/lib/rpm/php.req': No such file or directory
error: Couldn't exec /usr/lib/rpm/php.prov: No such file or directory
env: '/usr/lib/rpm/php.req': No such file or directory
error: Couldn't exec /usr/lib/rpm/php.prov: No such file or directory
env: '/usr/lib/rpm/php.req': No such file or directory
error: Couldn't exec /usr/lib/rpm/php.prov: No such file or directory
env: '/usr/lib/rpm/php.req': No such file or directory
error: Couldn't exec /usr/lib/rpm/php.prov: No such file or directory
env: '/usr/lib/rpm/php.req': No such file or directory
error: Couldn't exec /usr/lib/rpm/php.prov: No such file or directory
env: '/usr/lib/rpm/php.req': No such file or directory
error: Couldn't exec /usr/lib/rpm/php.prov: No such file or directory
env: '/usr/lib/rpm/php.req': No such file or directory
error: Couldn't exec /usr/lib/rpm/php.prov: No such file or directory
env: '/usr/lib/rpm/php.req': No such file or directory
error: Couldn't exec /usr/lib/rpm/php.prov: No such file or directory
env: '/usr/lib/rpm/php.req': No such file or directory
error: Couldn't exec /usr/lib/rpm/php.prov: No such file or directory
env: '/usr/lib/rpm/php.req': No such file or directory
error: Couldn't exec /usr/lib/rpm/php.prov: No such file or directory
env: '/usr/lib/rpm/php.req': No such file or directory
error: Couldn't exec /usr/lib/rpm/php.prov: No such file or directory
env: '/usr/lib/rpm/php.req': No such file or directory
error: Couldn't exec /usr/lib/rpm/php.prov: No such file or directory
env: '/usr/lib/rpm/php.req': No such file or directory
error: Couldn't exec /usr/lib/rpm/php.prov: No such file or directory
env: '/usr/lib/rpm/php.req': No such file or directory
error: Couldn't exec /usr/lib/rpm/php.prov: No such file or directory
env: '/usr/lib/rpm/php.req': No such file or directory
error: Couldn't exec /usr/lib/rpm/php.prov: No such file or directory
env: '/usr/lib/rpm/php.req': No such file or directory
error: Couldn't exec /usr/lib/rpm/php.prov: No such file or directory
env: '/usr/lib/rpm/php.req': No such file or directory
error: Couldn't exec /usr/lib/rpm/php.prov: No such file or directory
env: '/usr/lib/rpm/php.req': No such file or directory
error: Couldn't exec /usr/lib/rpm/php.prov: No such file or directory
env: '/usr/lib/rpm/php.req': No such file or directory
error: Couldn't exec /usr/lib/rpm/php.prov: No such file or directory
env: '/usr/lib/rpm/php.req': No such file or directory
error: Couldn't exec /usr/lib/rpm/php.prov: No such file or directory
env: '/usr/lib/rpm/php.req': No such file or directory
error: Couldn't exec /usr/lib/rpm/php.prov: No such file or directory
env: '/usr/lib/rpm/php.req': No such file or directory
error: Couldn't exec /usr/lib/rpm/php.prov: No such file or directory
env: '/usr/lib/rpm/php.req': No such file or directory
error: Couldn't exec /usr/lib/rpm/php.prov: No such file or directory
env: '/usr/lib/rpm/php.req': No such file or directory
error: Couldn't exec /usr/lib/rpm/php.prov: No such file or directory
env: '/usr/lib/rpm/php.req': No such file or directory
error: Couldn't exec /usr/lib/rpm/php.prov: No such file or directory
env: '/usr/lib/rpm/php.req': No such file or directory
error: Couldn't exec /usr/lib/rpm/php.prov: No such file or directory
env: '/usr/lib/rpm/php.req': No such file or directory
error: Couldn't exec /usr/lib/rpm/php.prov: No such file or directory
env: '/usr/lib/rpm/php.req': No such file or directory
error: Couldn't exec /usr/lib/rpm/php.prov: No such file or directory
env: '/usr/lib/rpm/php.req': No such file or directory
error: Couldn't exec /usr/lib/rpm/php.prov: No such file or directory
env: '/usr/lib/rpm/php.req': No such file or directory
error: Couldn't exec /usr/lib/rpm/php.prov: No such file or directory
env: '/usr/lib/rpm/php.req': No such file or directory
error: Couldn't exec /usr/lib/rpm/php.prov: No such file or directory
env: '/usr/lib/rpm/php.req': No such file or directory
error: Couldn't exec /usr/lib/rpm/php.prov: No such file or directory
env: '/usr/lib/rpm/php.req': No such file or directory
error: Couldn't exec /usr/lib/rpm/php.prov: No such file or directory
env: '/usr/lib/rpm/php.req': No such file or directory
error: Couldn't exec /usr/lib/rpm/php.prov: No such file or directory
env: '/usr/lib/rpm/php.req': No such file or directory
error: Couldn't exec /usr/lib/rpm/php.prov: No such file or directory
env: '/usr/lib/rpm/php.req': No such file or directory
error: Couldn't exec /usr/lib/rpm/php.prov: No such file or directory
env: '/usr/lib/rpm/php.req': No such file or directory
error: Couldn't exec /usr/lib/rpm/php.prov: No such file or directory
env: '/usr/lib/rpm/php.req': No such file or directory
error: Couldn't exec /usr/lib/rpm/php.prov: No such file or directory
env: '/usr/lib/rpm/php.req': No such file or directory
error: Couldn't exec /usr/lib/rpm/php.prov: No such file or directory
env: '/usr/lib/rpm/php.req': No such file or directory
error: Couldn't exec /usr/lib/rpm/php.prov: No such file or directory
env: '/usr/lib/rpm/php.req': No such file or directory
error: Couldn't exec /usr/lib/rpm/php.prov: No such file or directory
env: '/usr/lib/rpm/php.req': No such file or directory
error: Couldn't exec /usr/lib/rpm/php.prov: No such file or directory
env: '/usr/lib/rpm/php.req': No such file or directory
error: Couldn't exec /usr/lib/rpm/php.prov: No such file or directory
env: '/usr/lib/rpm/php.req': No such file or directory
error: Couldn't exec /usr/lib/rpm/php.prov: No such file or directory
env: '/usr/lib/rpm/php.req': No such file or directory
error: Couldn't exec /usr/lib/rpm/php.prov: No such file or directory
env: '/usr/lib/rpm/php.req': No such file or directory
error: Couldn't exec /usr/lib/rpm/php.prov: No such file or directory
env: '/usr/lib/rpm/php.req': No such file or directory
error: Couldn't exec /usr/lib/rpm/php.prov: No such file or directory
env: '/usr/lib/rpm/php.req': No such file or directory
error: Couldn't exec /usr/lib/rpm/php.prov: No such file or directory
env: '/usr/lib/rpm/php.req': No such file or directory
error: Couldn't exec /usr/lib/rpm/php.prov: No such file or directory
env: '/usr/lib/rpm/php.req': No such file or directory
error: Couldn't exec /usr/lib/rpm/php.prov: No such file or directory
env: '/usr/lib/rpm/php.req': No such file or directory
error: Couldn't exec /usr/lib/rpm/php.prov: No such file or directory
env: '/usr/lib/rpm/php.req': No such file or directory
error: Couldn't exec /usr/lib/rpm/php.prov: No such file or directory
env: '/usr/lib/rpm/php.req': No such file or directory
error: Couldn't exec /usr/lib/rpm/php.prov: No such file or directory
env: '/usr/lib/rpm/php.req': No such file or directory
error: Couldn't exec /usr/lib/rpm/php.prov: No such file or directory
env: '/usr/lib/rpm/php.req': No such file or directory
error: Couldn't exec /usr/lib/rpm/php.prov: No such file or directory
env: '/usr/lib/rpm/php.req': No such file or directory
error: Couldn't exec /usr/lib/rpm/php.prov: No such file or directory
env: '/usr/lib/rpm/php.req': No such file or directory
error: Couldn't exec /usr/lib/rpm/php.prov: No such file or directory
env: '/usr/lib/rpm/php.req': No such file or directory
error: Couldn't exec /usr/lib/rpm/php.prov: No such file or directory
env: '/usr/lib/rpm/php.req': No such file or directory
error: Couldn't exec /usr/lib/rpm/php.prov: No such file or directory
env: '/usr/lib/rpm/php.req': No such file or directory
error: Couldn't exec /usr/lib/rpm/php.prov: No such file or directory
env: '/usr/lib/rpm/php.req': No such file or directory
error: Couldn't exec /usr/lib/rpm/php.prov: No such file or directory
env: '/usr/lib/rpm/php.req': No such file or directory
error: Couldn't exec /usr/lib/rpm/php.prov: No such file or directory
env: '/usr/lib/rpm/php.req': No such file or directory
error: Couldn't exec /usr/lib/rpm/php.prov: No such file or directory
env: '/usr/lib/rpm/php.req': No such file or directory
error: Couldn't exec /usr/lib/rpm/php.prov: No such file or directory
env: '/usr/lib/rpm/php.req': No such file or directory
error: Couldn't exec /usr/lib/rpm/php.prov: No such file or directory
env: '/usr/lib/rpm/php.req': No such file or directory
error: Couldn't exec /usr/lib/rpm/php.prov: No such file or directory
env: '/usr/lib/rpm/php.req': No such file or directory
error: Couldn't exec /usr/lib/rpm/php.prov: No such file or directory
env: '/usr/lib/rpm/php.req': No such file or directory
error: Couldn't exec /usr/lib/rpm/php.prov: No such file or directory
env: '/usr/lib/rpm/php.req': No such file or directory
error: Couldn't exec /usr/lib/rpm/php.prov: No such file or directory
env: '/usr/lib/rpm/php.req': No such file or directory
error: Couldn't exec /usr/lib/rpm/php.prov: No such file or directory
env: '/usr/lib/rpm/php.req': No such file or directory
error: Couldn't exec /usr/lib/rpm/php.prov: No such file or directory
env: '/usr/lib/rpm/php.req': No such file or directory
error: Couldn't exec /usr/lib/rpm/php.prov: No such file or directory
env: '/usr/lib/rpm/php.req': No such file or directory
error: Couldn't exec /usr/lib/rpm/php.prov: No such file or directory
env: '/usr/lib/rpm/php.req': No such file or directory
error: Couldn't exec /usr/lib/rpm/php.prov: No such file or directory
env: '/usr/lib/rpm/php.req': No such file or directory
error: Couldn't exec /usr/lib/rpm/php.prov: No such file or directory
env: '/usr/lib/rpm/php.req': No such file or directory
error: Couldn't exec /usr/lib/rpm/php.prov: No such file or directory
env: '/usr/lib/rpm/php.req': No such file or directory
error: Couldn't exec /usr/lib/rpm/php.prov: No such file or directory
env: '/usr/lib/rpm/php.req': No such file or directory
error: Couldn't exec /usr/lib/rpm/php.prov: No such file or directory
env: '/usr/lib/rpm/php.req': No such file or directory
error: Couldn't exec /usr/lib/rpm/php.prov: No such file or directory
env: '/usr/lib/rpm/php.req': No such file or directory
error: Couldn't exec /usr/lib/rpm/php.prov: No such file or directory
env: '/usr/lib/rpm/php.req': No such file or directory
error: Couldn't exec /usr/lib/rpm/php.prov: No such file or directory
env: '/usr/lib/rpm/php.req': No such file or directory
error: Couldn't exec /usr/lib/rpm/php.prov: No such file or directory
env: '/usr/lib/rpm/php.req': No such file or directory
error: Couldn't exec /usr/lib/rpm/php.prov: No such file or directory
env: '/usr/lib/rpm/php.req': No such file or directory
error: Couldn't exec /usr/lib/rpm/php.prov: No such file or directory
env: '/usr/lib/rpm/php.req': No such file or directory
error: Couldn't exec /usr/lib/rpm/php.prov: No such file or directory
env: '/usr/lib/rpm/php.req': No such file or directory
error: Couldn't exec /usr/lib/rpm/php.prov: No such file or directory
env: '/usr/lib/rpm/php.req': No such file or directory
error: Couldn't exec /usr/lib/rpm/php.prov: No such file or directory
env: '/usr/lib/rpm/php.req': No such file or directory
error: Couldn't exec /usr/lib/rpm/php.prov: No such file or directory
env: '/usr/lib/rpm/php.req': No such file or directory
error: Couldn't exec /usr/lib/rpm/php.prov: No such file or directory
env: '/usr/lib/rpm/php.req': No such file or directory
error: Couldn't exec /usr/lib/rpm/php.prov: No such file or directory
env: '/usr/lib/rpm/php.req': No such file or directory
error: Couldn't exec /usr/lib/rpm/php.prov: No such file or directory
env: '/usr/lib/rpm/php.req': No such file or directory
error: Couldn't exec /usr/lib/rpm/php.prov: No such file or directory
env: '/usr/lib/rpm/php.req': No such file or directory
error: Couldn't exec /usr/lib/rpm/php.prov: No such file or directory
env: '/usr/lib/rpm/php.req': No such file or directory
error: Couldn't exec /usr/lib/rpm/php.prov: No such file or directory
env: '/usr/lib/rpm/php.req': No such file or directory
error: Couldn't exec /usr/lib/rpm/php.prov: No such file or directory
env: '/usr/lib/rpm/php.req': No such file or directory
error: Couldn't exec /usr/lib/rpm/php.prov: No such file or directory
env: '/usr/lib/rpm/php.req': No such file or directory
error: Couldn't exec /usr/lib/rpm/php.prov: No such file or directory
env: '/usr/lib/rpm/php.req': No such file or directory
error: Couldn't exec /usr/lib/rpm/php.prov: No such file or directory
env: '/usr/lib/rpm/php.req': No such file or directory
error: Couldn't exec /usr/lib/rpm/php.prov: No such file or directory
env: '/usr/lib/rpm/php.req': No such file or directory
error: Couldn't exec /usr/lib/rpm/php.prov: No such file or directory
env: '/usr/lib/rpm/php.req': No such file or directory
error: Couldn't exec /usr/lib/rpm/php.prov: No such file or directory
env: '/usr/lib/rpm/php.req': No such file or directory
error: Couldn't exec /usr/lib/rpm/php.prov: No such file or directory
env: '/usr/lib/rpm/php.req': No such file or directory
error: Couldn't exec /usr/lib/rpm/php.prov: No such file or directory
env: '/usr/lib/rpm/php.req': No such file or directory
error: Couldn't exec /usr/lib/rpm/php.prov: No such file or directory
env: '/usr/lib/rpm/php.req': No such file or directory
error: Couldn't exec /usr/lib/rpm/php.prov: No such file or directory
env: '/usr/lib/rpm/php.req': No such file or directory
error: Couldn't exec /usr/lib/rpm/php.prov: No such file or directory
env: '/usr/lib/rpm/php.req': No such file or directory
error: Couldn't exec /usr/lib/rpm/php.prov: No such file or directory
env: '/usr/lib/rpm/php.req': No such file or directory
error: Couldn't exec /usr/lib/rpm/php.prov: No such file or directory
env: '/usr/lib/rpm/php.req': No such file or directory
error: Couldn't exec /usr/lib/rpm/php.prov: No such file or directory
env: '/usr/lib/rpm/php.req': No such file or directory
error: Couldn't exec /usr/lib/rpm/php.prov: No such file or directory
env: '/usr/lib/rpm/php.req': No such file or directory
error: Couldn't exec /usr/lib/rpm/php.prov: No such file or directory
env: '/usr/lib/rpm/php.req': No such file or directory
error: Couldn't exec /usr/lib/rpm/php.prov: No such file or directory
env: '/usr/lib/rpm/php.req': No such file or directory
error: Couldn't exec /usr/lib/rpm/php.prov: No such file or directory
env: '/usr/lib/rpm/php.req': No such file or directory
error: Couldn't exec /usr/lib/rpm/php.prov: No such file or directory
env: '/usr/lib/rpm/php.req': No such file or directory
error: Couldn't exec /usr/lib/rpm/php.prov: No such file or directory
env: '/usr/lib/rpm/php.req': No such file or directory
error: Couldn't exec /usr/lib/rpm/php.prov: No such file or directory
env: '/usr/lib/rpm/php.req': No such file or directory
error: Couldn't exec /usr/lib/rpm/php.prov: No such file or directory
env: '/usr/lib/rpm/php.req': No such file or directory
error: Couldn't exec /usr/lib/rpm/php.prov: No such file or directory
env: '/usr/lib/rpm/php.req': No such file or directory
error: Couldn't exec /usr/lib/rpm/php.prov: No such file or directory
env: '/usr/lib/rpm/php.req': No such file or directory
error: Couldn't exec /usr/lib/rpm/php.prov: No such file or directory
env: '/usr/lib/rpm/php.req': No such file or directory
error: Couldn't exec /usr/lib/rpm/php.prov: No such file or directory
env: '/usr/lib/rpm/php.req': No such file or directory
error: Couldn't exec /usr/lib/rpm/php.prov: No such file or directory
env: '/usr/lib/rpm/php.req': No such file or directory
error: Couldn't exec /usr/lib/rpm/php.prov: No such file or directory
env: '/usr/lib/rpm/php.req': No such file or directory
error: Couldn't exec /usr/lib/rpm/php.prov: No such file or directory
env: '/usr/lib/rpm/php.req': No such file or directory
error: Couldn't exec /usr/lib/rpm/php.prov: No such file or directory
env: '/usr/lib/rpm/php.req': No such file or directory
error: Couldn't exec /usr/lib/rpm/php.prov: No such file or directory
env: '/usr/lib/rpm/php.req': No such file or directory
error: Couldn't exec /usr/lib/rpm/php.prov: No such file or directory
env: '/usr/lib/rpm/php.req': No such file or directory
error: Couldn't exec /usr/lib/rpm/php.prov: No such file or directory
env: '/usr/lib/rpm/php.req': No such file or directory
error: Couldn't exec /usr/lib/rpm/php.prov: No such file or directory
env: '/usr/lib/rpm/php.req': No such file or directory
error: Couldn't exec /usr/lib/rpm/php.prov: No such file or directory
env: '/usr/lib/rpm/php.req': No such file or directory
error: Couldn't exec /usr/lib/rpm/php.prov: No such file or directory
env: '/usr/lib/rpm/php.req': No such file or directory
error: Couldn't exec /usr/lib/rpm/php.prov: No such file or directory
env: '/usr/lib/rpm/php.req': No such file or directory
error: Couldn't exec /usr/lib/rpm/php.prov: No such file or directory
env: '/usr/lib/rpm/php.req': No such file or directory
error: Couldn't exec /usr/lib/rpm/php.prov: No such file or directory
env: '/usr/lib/rpm/php.req': No such file or directory
error: Couldn't exec /usr/lib/rpm/php.prov: No such file or directory
env: '/usr/lib/rpm/php.req': No such file or directory
error: Couldn't exec /usr/lib/rpm/php.prov: No such file or directory
env: '/usr/lib/rpm/php.req': No such file or directory
error: Couldn't exec /usr/lib/rpm/php.prov: No such file or directory
env: '/usr/lib/rpm/php.req': No such file or directory
error: Couldn't exec /usr/lib/rpm/php.prov: No such file or directory
env: '/usr/lib/rpm/php.req': No such file or directory
error: Couldn't exec /usr/lib/rpm/php.prov: No such file or directory
env: '/usr/lib/rpm/php.req': No such file or directory
error: Couldn't exec /usr/lib/rpm/php.prov: No such file or directory
env: '/usr/lib/rpm/php.req': No such file or directory
error: Couldn't exec /usr/lib/rpm/php.prov: No such file or directory
env: '/usr/lib/rpm/php.req': No such file or directory
error: Couldn't exec /usr/lib/rpm/php.prov: No such file or directory
env: '/usr/lib/rpm/php.req': No such file or directory
error: Couldn't exec /usr/lib/rpm/php.prov: No such file or directory
env: '/usr/lib/rpm/php.req': No such file or directory
error: Couldn't exec /usr/lib/rpm/php.prov: No such file or directory
env: '/usr/lib/rpm/php.req': No such file or directory
error: Couldn't exec /usr/lib/rpm/php.prov: No such file or directory
env: '/usr/lib/rpm/php.req': No such file or directory
error: Couldn't exec /usr/lib/rpm/php.prov: No such file or directory
env: '/usr/lib/rpm/php.req': No such file or directory
error: Couldn't exec /usr/lib/rpm/php.prov: No such file or directory
env: '/usr/lib/rpm/php.req': No such file or directory
error: Couldn't exec /usr/lib/rpm/php.prov: No such file or directory
env: '/usr/lib/rpm/php.req': No such file or directory
error: Couldn't exec /usr/lib/rpm/php.prov: No such file or directory
env: '/usr/lib/rpm/php.req': No such file or directory
error: Couldn't exec /usr/lib/rpm/php.prov: No such file or directory
env: '/usr/lib/rpm/php.req': No such file or directory
error: Couldn't exec /usr/lib/rpm/php.prov: No such file or directory
env: '/usr/lib/rpm/php.req': No such file or directory
error: Couldn't exec /usr/lib/rpm/php.prov: No such file or directory
env: '/usr/lib/rpm/php.req': No such file or directory
error: Couldn't exec /usr/lib/rpm/php.prov: No such file or directory
env: '/usr/lib/rpm/php.req': No such file or directory
error: Couldn't exec /usr/lib/rpm/php.prov: No such file or directory
env: '/usr/lib/rpm/php.req': No such file or directory
error: Couldn't exec /usr/lib/rpm/php.prov: No such file or directory
env: '/usr/lib/rpm/php.req': No such file or directory
error: Couldn't exec /usr/lib/rpm/php.prov: No such file or directory
env: '/usr/lib/rpm/php.req': No such file or directory
error: Couldn't exec /usr/lib/rpm/php.prov: No such file or directory
env: '/usr/lib/rpm/php.req': No such file or directory
error: Couldn't exec /usr/lib/rpm/php.prov: No such file or directory
env: '/usr/lib/rpm/php.req': No such file or directory
error: Couldn't exec /usr/lib/rpm/php.prov: No such file or directory
env: '/usr/lib/rpm/php.req': No such file or directory
error: Couldn't exec /usr/lib/rpm/php.prov: No such file or directory
env: '/usr/lib/rpm/php.req': No such file or directory
error: Couldn't exec /usr/lib/rpm/php.prov: No such file or directory
env: '/usr/lib/rpm/php.req': No such file or directory
error: Couldn't exec /usr/lib/rpm/php.prov: No such file or directory
env: '/usr/lib/rpm/php.req': No such file or directory
error: Couldn't exec /usr/lib/rpm/php.prov: No such file or directory
env: '/usr/lib/rpm/php.req': No such file or directory
error: Couldn't exec /usr/lib/rpm/php.prov: No such file or directory
env: '/usr/lib/rpm/php.req': No such file or directory
error: Couldn't exec /usr/lib/rpm/php.prov: No such file or directory
env: '/usr/lib/rpm/php.req': No such file or directory
error: Couldn't exec /usr/lib/rpm/php.prov: No such file or directory
env: '/usr/lib/rpm/php.req': No such file or directory
error: Couldn't exec /usr/lib/rpm/php.prov: No such file or directory
env: '/usr/lib/rpm/php.req': No such file or directory
error: Couldn't exec /usr/lib/rpm/php.prov: No such file or directory
env: '/usr/lib/rpm/php.req': No such file or directory
error: Couldn't exec /usr/lib/rpm/php.prov: No such file or directory
env: '/usr/lib/rpm/php.req': No such file or directory
error: Couldn't exec /usr/lib/rpm/php.prov: No such file or directory
env: '/usr/lib/rpm/php.req': No such file or directory
error: Couldn't exec /usr/lib/rpm/php.prov: No such file or directory
env: '/usr/lib/rpm/php.req': No such file or directory
error: Couldn't exec /usr/lib/rpm/php.prov: No such file or directory
env: '/usr/lib/rpm/php.req': No such file or directory
error: Couldn't exec /usr/lib/rpm/php.prov: No such file or directory
env: '/usr/lib/rpm/php.req': No such file or directory
error: Couldn't exec /usr/lib/rpm/php.prov: No such file or directory
env: '/usr/lib/rpm/php.req': No such file or directory
error: Couldn't exec /usr/lib/rpm/php.prov: No such file or directory
env: '/usr/lib/rpm/php.req': No such file or directory
error: Couldn't exec /usr/lib/rpm/php.prov: No such file or directory
env: '/usr/lib/rpm/php.req': No such file or directory
error: Couldn't exec /usr/lib/rpm/php.prov: No such file or directory
env: '/usr/lib/rpm/php.req': No such file or directory
error: Couldn't exec /usr/lib/rpm/php.prov: No such file or directory
env: '/usr/lib/rpm/php.req': No such file or directory
error: Couldn't exec /usr/lib/rpm/php.prov: No such file or directory
env: '/usr/lib/rpm/php.req': No such file or directory
error: Couldn't exec /usr/lib/rpm/php.prov: No such file or directory
env: '/usr/lib/rpm/php.req': No such file or directory
error: Couldn't exec /usr/lib/rpm/php.prov: No such file or directory
env: '/usr/lib/rpm/php.req': No such file or directory
error: Couldn't exec /usr/lib/rpm/php.prov: No such file or directory
env: '/usr/lib/rpm/php.req': No such file or directory
error: Couldn't exec /usr/lib/rpm/php.prov: No such file or directory
env: '/usr/lib/rpm/php.req': No such file or directory
error: Couldn't exec /usr/lib/rpm/php.prov: No such file or directory
env: '/usr/lib/rpm/php.req': No such file or directory
error: Couldn't exec /usr/lib/rpm/php.prov: No such file or directory
env: '/usr/lib/rpm/php.req': No such file or directory
error: Couldn't exec /usr/lib/rpm/php.prov: No such file or directory
env: '/usr/lib/rpm/php.req': No such file or directory
error: Couldn't exec /usr/lib/rpm/php.prov: No such file or directory
env: '/usr/lib/rpm/php.req': No such file or directory
error: Couldn't exec /usr/lib/rpm/php.prov: No such file or directory
env: '/usr/lib/rpm/php.req': No such file or directory
error: Couldn't exec /usr/lib/rpm/php.prov: No such file or directory
env: '/usr/lib/rpm/php.req': No such file or directory
error: Couldn't exec /usr/lib/rpm/php.prov: No such file or directory
env: '/usr/lib/rpm/php.req': No such file or directory
error: Couldn't exec /usr/lib/rpm/php.prov: No such file or directory
env: '/usr/lib/rpm/php.req': No such file or directory
error: Couldn't exec /usr/lib/rpm/php.prov: No such file or directory
env: '/usr/lib/rpm/php.req': No such file or directory
error: Couldn't exec /usr/lib/rpm/php.prov: No such file or directory
env: '/usr/lib/rpm/php.req': No such file or directory
error: Couldn't exec /usr/lib/rpm/php.prov: No such file or directory
env: '/usr/lib/rpm/php.req': No such file or directory
error: Couldn't exec /usr/lib/rpm/php.prov: No such file or directory
env: '/usr/lib/rpm/php.req': No such file or directory
error: Couldn't exec /usr/lib/rpm/php.prov: No such file or directory
env: '/usr/lib/rpm/php.req': No such file or directory
error: Couldn't exec /usr/lib/rpm/php.prov: No such file or directory
env: '/usr/lib/rpm/php.req': No such file or directory
error: Couldn't exec /usr/lib/rpm/php.prov: No such file or directory
env: '/usr/lib/rpm/php.req': No such file or directory
error: Couldn't exec /usr/lib/rpm/php.prov: No such file or directory
env: '/usr/lib/rpm/php.req': No such file or directory
error: Couldn't exec /usr/lib/rpm/php.prov: No such file or directory
env: '/usr/lib/rpm/php.req': No such file or directory
error: Couldn't exec /usr/lib/rpm/php.prov: No such file or directory
env: '/usr/lib/rpm/php.req': No such file or directory
error: Couldn't exec /usr/lib/rpm/php.prov: No such file or directory
env: '/usr/lib/rpm/php.req': No such file or directory
error: Couldn't exec /usr/lib/rpm/php.prov: No such file or directory
env: '/usr/lib/rpm/php.req': No such file or directory
error: Couldn't exec /usr/lib/rpm/php.prov: No such file or directory
env: '/usr/lib/rpm/php.req': No such file or directory
error: Couldn't exec /usr/lib/rpm/php.prov: No such file or directory
env: '/usr/lib/rpm/php.req': No such file or directory
error: Couldn't exec /usr/lib/rpm/php.prov: No such file or directory
env: '/usr/lib/rpm/php.req': No such file or directory
error: Couldn't exec /usr/lib/rpm/php.prov: No such file or directory
env: '/usr/lib/rpm/php.req': No such file or directory
error: Couldn't exec /usr/lib/rpm/php.prov: No such file or directory
env: '/usr/lib/rpm/php.req': No such file or directory
error: Couldn't exec /usr/lib/rpm/php.prov: No such file or directory
env: '/usr/lib/rpm/php.req': No such file or directory
error: Couldn't exec /usr/lib/rpm/php.prov: No such file or directory
env: '/usr/lib/rpm/php.req': No such file or directory
error: Couldn't exec /usr/lib/rpm/php.prov: No such file or directory
env: '/usr/lib/rpm/php.req': No such file or directory
error: Couldn't exec /usr/lib/rpm/php.prov: No such file or directory
env: '/usr/lib/rpm/php.req': No such file or directory
error: Couldn't exec /usr/lib/rpm/php.prov: No such file or directory
env: '/usr/lib/rpm/php.req': No such file or directory
error: Couldn't exec /usr/lib/rpm/php.prov: No such file or directory
env: '/usr/lib/rpm/php.req': No such file or directory
error: Couldn't exec /usr/lib/rpm/php.prov: No such file or directory
env: '/usr/lib/rpm/php.req': No such file or directory
error: Couldn't exec /usr/lib/rpm/php.prov: No such file or directory
env: '/usr/lib/rpm/php.req': No such file or directory
error: Couldn't exec /usr/lib/rpm/php.prov: No such file or directory
env: '/usr/lib/rpm/php.req': No such file or directory
error: Couldn't exec /usr/lib/rpm/php.prov: No such file or directory
env: '/usr/lib/rpm/php.req': No such file or directory
error: Couldn't exec /usr/lib/rpm/php.prov: No such file or directory
env: '/usr/lib/rpm/php.req': No such file or directory
error: Couldn't exec /usr/lib/rpm/php.prov: No such file or directory
env: '/usr/lib/rpm/php.req': No such file or directory
error: Couldn't exec /usr/lib/rpm/php.prov: No such file or directory
env: '/usr/lib/rpm/php.req': No such file or directory
error: Couldn't exec /usr/lib/rpm/php.prov: No such file or directory
env: '/usr/lib/rpm/php.req': No such file or directory
error: Couldn't exec /usr/lib/rpm/php.prov: No such file or directory
env: '/usr/lib/rpm/php.req': No such file or directory
error: Couldn't exec /usr/lib/rpm/php.prov: No such file or directory
env: '/usr/lib/rpm/php.req': No such file or directory
error: Couldn't exec /usr/lib/rpm/php.prov: No such file or directory
env: '/usr/lib/rpm/php.req': No such file or directory
error: Couldn't exec /usr/lib/rpm/php.prov: No such file or directory
env: '/usr/lib/rpm/php.req': No such file or directory
error: Couldn't exec /usr/lib/rpm/php.prov: No such file or directory
env: '/usr/lib/rpm/php.req': No such file or directory
error: Couldn't exec /usr/lib/rpm/php.prov: No such file or directory
env: '/usr/lib/rpm/php.req': No such file or directory
error: Couldn't exec /usr/lib/rpm/php.prov: No such file or directory
env: '/usr/lib/rpm/php.req': No such file or directory
error: Couldn't exec /usr/lib/rpm/php.prov: No such file or directory
env: '/usr/lib/rpm/php.req': No such file or directory
error: Couldn't exec /usr/lib/rpm/php.prov: No such file or directory
env: '/usr/lib/rpm/php.req': No such file or directory
error: Couldn't exec /usr/lib/rpm/php.prov: No such file or directory
env: '/usr/lib/rpm/php.req': No such file or directory
error: Couldn't exec /usr/lib/rpm/php.prov: No such file or directory
env: '/usr/lib/rpm/php.req': No such file or directory
error: Couldn't exec /usr/lib/rpm/php.prov: No such file or directory
env: '/usr/lib/rpm/php.req': No such file or directory
error: Couldn't exec /usr/lib/rpm/php.prov: No such file or directory
env: '/usr/lib/rpm/php.req': No such file or directory
error: Couldn't exec /usr/lib/rpm/php.prov: No such file or directory
env: '/usr/lib/rpm/php.req': No such file or directory
error: Couldn't exec /usr/lib/rpm/php.prov: No such file or directory
env: '/usr/lib/rpm/php.req': No such file or directory
error: Couldn't exec /usr/lib/rpm/php.prov: No such file or directory
env: '/usr/lib/rpm/php.req': No such file or directory
error: Couldn't exec /usr/lib/rpm/php.prov: No such file or directory
env: '/usr/lib/rpm/php.req': No such file or directory
error: Couldn't exec /usr/lib/rpm/php.prov: No such file or directory
env: '/usr/lib/rpm/php.req': No such file or directory
error: Couldn't exec /usr/lib/rpm/php.prov: No such file or directory
env: '/usr/lib/rpm/php.req': No such file or directory
error: Couldn't exec /usr/lib/rpm/php.prov: No such file or directory
env: '/usr/lib/rpm/php.req': No such file or directory
error: Couldn't exec /usr/lib/rpm/php.prov: No such file or directory
env: '/usr/lib/rpm/php.req': No such file or directory
error: Couldn't exec /usr/lib/rpm/php.prov: No such file or directory
env: '/usr/lib/rpm/php.req': No such file or directory
error: Couldn't exec /usr/lib/rpm/php.prov: No such file or directory
env: '/usr/lib/rpm/php.req': No such file or directory
error: Couldn't exec /usr/lib/rpm/php.prov: No such file or directory
env: '/usr/lib/rpm/php.req': No such file or directory
error: Couldn't exec /usr/lib/rpm/php.prov: No such file or directory
env: '/usr/lib/rpm/php.req': No such file or directory
error: Couldn't exec /usr/lib/rpm/php.prov: No such file or directory
env: '/usr/lib/rpm/php.req': No such file or directory
error: Couldn't exec /usr/lib/rpm/php.prov: No such file or directory
env: '/usr/lib/rpm/php.req': No such file or directory
error: Couldn't exec /usr/lib/rpm/php.prov: No such file or directory
env: '/usr/lib/rpm/php.req': No such file or directory
error: Couldn't exec /usr/lib/rpm/php.prov: No such file or directory
env: '/usr/lib/rpm/php.req': No such file or directory
error: Couldn't exec /usr/lib/rpm/php.prov: No such file or directory
env: '/usr/lib/rpm/php.req': No such file or directory
error: Couldn't exec /usr/lib/rpm/php.prov: No such file or directory
env: '/usr/lib/rpm/php.req': No such file or directory
error: Couldn't exec /usr/lib/rpm/php.prov: No such file or directory
env: '/usr/lib/rpm/php.req': No such file or directory
error: Couldn't exec /usr/lib/rpm/php.prov: No such file or directory
env: '/usr/lib/rpm/php.req': No such file or directory
error: Couldn't exec /usr/lib/rpm/php.prov: No such file or directory
env: '/usr/lib/rpm/php.req': No such file or directory
error: Couldn't exec /usr/lib/rpm/php.prov: No such file or directory
env: '/usr/lib/rpm/php.req': No such file or directory
error: Couldn't exec /usr/lib/rpm/php.prov: No such file or directory
env: '/usr/lib/rpm/php.req': No such file or directory
error: Couldn't exec /usr/lib/rpm/php.prov: No such file or directory
env: '/usr/lib/rpm/php.req': No such file or directory
error: Couldn't exec /usr/lib/rpm/php.prov: No such file or directory
env: '/usr/lib/rpm/php.req': No such file or directory
error: Couldn't exec /usr/lib/rpm/php.prov: No such file or directory
env: '/usr/lib/rpm/php.req': No such file or directory
error: Couldn't exec /usr/lib/rpm/php.prov: No such file or directory
env: '/usr/lib/rpm/php.req': No such file or directory
error: Couldn't exec /usr/lib/rpm/php.prov: No such file or directory
env: '/usr/lib/rpm/php.req': No such file or directory
error: Couldn't exec /usr/lib/rpm/php.prov: No such file or directory
env: '/usr/lib/rpm/php.req': No such file or directory
error: Couldn't exec /usr/lib/rpm/php.prov: No such file or directory
env: '/usr/lib/rpm/php.req': No such file or directory
error: Couldn't exec /usr/lib/rpm/php.prov: No such file or directory
env: '/usr/lib/rpm/php.req': No such file or directory
error: Couldn't exec /usr/lib/rpm/php.prov: No such file or directory
env: '/usr/lib/rpm/php.req': No such file or directory
error: Couldn't exec /usr/lib/rpm/php.prov: No such file or directory
env: '/usr/lib/rpm/php.req': No such file or directory
error: Couldn't exec /usr/lib/rpm/php.prov: No such file or directory
env: '/usr/lib/rpm/php.req': No such file or directory
error: Couldn't exec /usr/lib/rpm/php.prov: No such file or directory
env: '/usr/lib/rpm/php.req': No such file or directory
error: Couldn't exec /usr/lib/rpm/php.prov: No such file or directory
env: '/usr/lib/rpm/php.req': No such file or directory
error: Couldn't exec /usr/lib/rpm/php.prov: No such file or directory
env: '/usr/lib/rpm/php.req': No such file or directory
error: Couldn't exec /usr/lib/rpm/php.prov: No such file or directory
env: '/usr/lib/rpm/php.req': No such file or directory
error: Couldn't exec /usr/lib/rpm/php.prov: No such file or directory
env: '/usr/lib/rpm/php.req': No such file or directory
error: Couldn't exec /usr/lib/rpm/php.prov: No such file or directory
env: '/usr/lib/rpm/php.req': No such file or directory
error: Couldn't exec /usr/lib/rpm/php.prov: No such file or directory
env: '/usr/lib/rpm/php.req': No such file or directory
error: Couldn't exec /usr/lib/rpm/php.prov: No such file or directory
env: '/usr/lib/rpm/php.req': No such file or directory
error: Couldn't exec /usr/lib/rpm/php.prov: No such file or directory
env: '/usr/lib/rpm/php.req': No such file or directory
error: Couldn't exec /usr/lib/rpm/php.prov: No such file or directory
env: '/usr/lib/rpm/php.req': No such file or directory
error: Couldn't exec /usr/lib/rpm/php.prov: No such file or directory
env: '/usr/lib/rpm/php.req': No such file or directory
error: Couldn't exec /usr/lib/rpm/php.prov: No such file or directory
env: '/usr/lib/rpm/php.req': No such file or directory
error: Couldn't exec /usr/lib/rpm/php.prov: No such file or directory
env: '/usr/lib/rpm/php.req': No such file or directory
error: Couldn't exec /usr/lib/rpm/php.prov: No such file or directory
env: '/usr/lib/rpm/php.req': No such file or directory
error: Couldn't exec /usr/lib/rpm/php.prov: No such file or directory
env: '/usr/lib/rpm/php.req': No such file or directory
error: Couldn't exec /usr/lib/rpm/php.prov: No such file or directory
env: '/usr/lib/rpm/php.req': No such file or directory
error: Couldn't exec /usr/lib/rpm/php.prov: No such file or directory
env: '/usr/lib/rpm/php.req': No such file or directory
error: Couldn't exec /usr/lib/rpm/php.prov: No such file or directory
env: '/usr/lib/rpm/php.req': No such file or directory
error: Couldn't exec /usr/lib/rpm/php.prov: No such file or directory
env: '/usr/lib/rpm/php.req': No such file or directory
error: Couldn't exec /usr/lib/rpm/php.prov: No such file or directory
env: '/usr/lib/rpm/php.req': No such file or directory
error: Couldn't exec /usr/lib/rpm/php.prov: No such file or directory
env: '/usr/lib/rpm/php.req': No such file or directory
error: Couldn't exec /usr/lib/rpm/php.prov: No such file or directory
env: '/usr/lib/rpm/php.req': No such file or directory
error: Couldn't exec /usr/lib/rpm/php.prov: No such file or directory
env: '/usr/lib/rpm/php.req': No such file or directory
error: Couldn't exec /usr/lib/rpm/php.prov: No such file or directory
env: '/usr/lib/rpm/php.req': No such file or directory
error: Couldn't exec /usr/lib/rpm/php.prov: No such file or directory
env: '/usr/lib/rpm/php.req': No such file or directory
error: Couldn't exec /usr/lib/rpm/php.prov: No such file or directory
env: '/usr/lib/rpm/php.req': No such file or directory
error: Couldn't exec /usr/lib/rpm/php.prov: No such file or directory
env: '/usr/lib/rpm/php.req': No such file or directory
error: Couldn't exec /usr/lib/rpm/php.prov: No such file or directory
env: '/usr/lib/rpm/php.req': No such file or directory
error: Couldn't exec /usr/lib/rpm/php.prov: No such file or directory
env: '/usr/lib/rpm/php.req': No such file or directory
error: Couldn't exec /usr/lib/rpm/php.prov: No such file or directory
env: '/usr/lib/rpm/php.req': No such file or directory
error: Couldn't exec /usr/lib/rpm/php.prov: No such file or directory
env: '/usr/lib/rpm/php.req': No such file or directory
error: Couldn't exec /usr/lib/rpm/php.prov: No such file or directory
env: '/usr/lib/rpm/php.req': No such file or directory
error: Couldn't exec /usr/lib/rpm/php.prov: No such file or directory
env: '/usr/lib/rpm/php.req': No such file or directory
error: Couldn't exec /usr/lib/rpm/php.prov: No such file or directory
env: '/usr/lib/rpm/php.req': No such file or directory
error: Couldn't exec /usr/lib/rpm/php.prov: No such file or directory
env: '/usr/lib/rpm/php.req': No such file or directory
error: Couldn't exec /usr/lib/rpm/php.prov: No such file or directory
env: '/usr/lib/rpm/php.req': No such file or directory
error: Couldn't exec /usr/lib/rpm/php.prov: No such file or directory
env: '/usr/lib/rpm/php.req': No such file or directory
error: Couldn't exec /usr/lib/rpm/php.prov: No such file or directory
env: '/usr/lib/rpm/php.req': No such file or directory
error: Couldn't exec /usr/lib/rpm/php.prov: No such file or directory
env: '/usr/lib/rpm/php.req': No such file or directory
error: Couldn't exec /usr/lib/rpm/php.prov: No such file or directory
env: '/usr/lib/rpm/php.req': No such file or directory
error: Couldn't exec /usr/lib/rpm/php.prov: No such file or directory
env: '/usr/lib/rpm/php.req': No such file or directory
error: Couldn't exec /usr/lib/rpm/php.prov: No such file or directory
env: '/usr/lib/rpm/php.req': No such file or directory
error: Couldn't exec /usr/lib/rpm/php.prov: No such file or directory
env: '/usr/lib/rpm/php.req': No such file or directory
error: Couldn't exec /usr/lib/rpm/php.prov: No such file or directory
env: '/usr/lib/rpm/php.req': No such file or directory
error: Couldn't exec /usr/lib/rpm/php.prov: No such file or directory
env: '/usr/lib/rpm/php.req': No such file or directory
error: Couldn't exec /usr/lib/rpm/php.prov: No such file or directory
env: '/usr/lib/rpm/php.req': No such file or directory
error: Couldn't exec /usr/lib/rpm/php.prov: No such file or directory
env: '/usr/lib/rpm/php.req': No such file or directory
error: Couldn't exec /usr/lib/rpm/php.prov: No such file or directory
env: '/usr/lib/rpm/php.req': No such file or directory
error: Couldn't exec /usr/lib/rpm/php.prov: No such file or directory
env: '/usr/lib/rpm/php.req': No such file or directory
error: Couldn't exec /usr/lib/rpm/php.prov: No such file or directory
env: '/usr/lib/rpm/php.req': No such file or directory
error: Couldn't exec /usr/lib/rpm/php.prov: No such file or directory
env: '/usr/lib/rpm/php.req': No such file or directory
error: Couldn't exec /usr/lib/rpm/php.prov: No such file or directory
env: '/usr/lib/rpm/php.req': No such file or directory
error: Couldn't exec /usr/lib/rpm/php.prov: No such file or directory
env: '/usr/lib/rpm/php.req': No such file or directory
error: Couldn't exec /usr/lib/rpm/php.prov: No such file or directory
env: '/usr/lib/rpm/php.req': No such file or directory
error: Couldn't exec /usr/lib/rpm/php.prov: No such file or directory
env: '/usr/lib/rpm/php.req': No such file or directory
error: Couldn't exec /usr/lib/rpm/php.prov: No such file or directory
env: '/usr/lib/rpm/php.req': No such file or directory
error: Couldn't exec /usr/lib/rpm/php.prov: No such file or directory
env: '/usr/lib/rpm/php.req': No such file or directory
error: Couldn't exec /usr/lib/rpm/php.prov: No such file or directory
env: '/usr/lib/rpm/php.req': No such file or directory
error: Couldn't exec /usr/lib/rpm/php.prov: No such file or directory
env: '/usr/lib/rpm/php.req': No such file or directory
error: Couldn't exec /usr/lib/rpm/php.prov: No such file or directory
env: '/usr/lib/rpm/php.req': No such file or directory
error: Couldn't exec /usr/lib/rpm/php.prov: No such file or directory
env: '/usr/lib/rpm/php.req': No such file or directory
error: Couldn't exec /usr/lib/rpm/php.prov: No such file or directory
env: '/usr/lib/rpm/php.req': No such file or directory
error: Couldn't exec /usr/lib/rpm/php.prov: No such file or directory
env: '/usr/lib/rpm/php.req': No such file or directory
error: Couldn't exec /usr/lib/rpm/php.prov: No such file or directory
env: '/usr/lib/rpm/php.req': No such file or directory
error: Couldn't exec /usr/lib/rpm/php.prov: No such file or directory
env: '/usr/lib/rpm/php.req': No such file or directory
error: Couldn't exec /usr/lib/rpm/php.prov: No such file or directory
env: '/usr/lib/rpm/php.req': No such file or directory
error: Couldn't exec /usr/lib/rpm/php.prov: No such file or directory
env: '/usr/lib/rpm/php.req': No such file or directory
error: Couldn't exec /usr/lib/rpm/php.prov: No such file or directory
env: '/usr/lib/rpm/php.req': No such file or directory
error: Couldn't exec /usr/lib/rpm/php.prov: No such file or directory
env: '/usr/lib/rpm/php.req': No such file or directory
error: Couldn't exec /usr/lib/rpm/php.prov: No such file or directory
env: '/usr/lib/rpm/php.req': No such file or directory
error: Couldn't exec /usr/lib/rpm/php.prov: No such file or directory
env: '/usr/lib/rpm/php.req': No such file or directory
error: Couldn't exec /usr/lib/rpm/php.prov: No such file or directory
env: '/usr/lib/rpm/php.req': No such file or directory
error: Couldn't exec /usr/lib/rpm/php.prov: No such file or directory
env: '/usr/lib/rpm/php.req': No such file or directory
error: Couldn't exec /usr/lib/rpm/php.prov: No such file or directory
env: '/usr/lib/rpm/php.req': No such file or directory
error: Couldn't exec /usr/lib/rpm/php.prov: No such file or directory
env: '/usr/lib/rpm/php.req': No such file or directory
error: Couldn't exec /usr/lib/rpm/php.prov: No such file or directory
env: '/usr/lib/rpm/php.req': No such file or directory
error: Couldn't exec /usr/lib/rpm/php.prov: No such file or directory
env: '/usr/lib/rpm/php.req': No such file or directory
error: Couldn't exec /usr/lib/rpm/php.prov: No such file or directory
env: '/usr/lib/rpm/php.req': No such file or directory
error: Couldn't exec /usr/lib/rpm/php.prov: No such file or directory
env: '/usr/lib/rpm/php.req': No such file or directory
error: Couldn't exec /usr/lib/rpm/php.prov: No such file or directory
env: '/usr/lib/rpm/php.req': No such file or directory
error: Couldn't exec /usr/lib/rpm/php.prov: No such file or directory
env: '/usr/lib/rpm/php.req': No such file or directory
error: Couldn't exec /usr/lib/rpm/php.prov: No such file or directory
env: '/usr/lib/rpm/php.req': No such file or directory
error: Couldn't exec /usr/lib/rpm/php.prov: No such file or directory
env: '/usr/lib/rpm/php.req': No such file or directory
error: Couldn't exec /usr/lib/rpm/php.prov: No such file or directory
env: '/usr/lib/rpm/php.req': No such file or directory
error: Couldn't exec /usr/lib/rpm/php.prov: No such file or directory
env: '/usr/lib/rpm/php.req': No such file or directory
error: Couldn't exec /usr/lib/rpm/php.prov: No such file or directory
env: '/usr/lib/rpm/php.req': No such file or directory
error: Couldn't exec /usr/lib/rpm/php.prov: No such file or directory
env: '/usr/lib/rpm/php.req': No such file or directory
error: Couldn't exec /usr/lib/rpm/php.prov: No such file or directory
env: '/usr/lib/rpm/php.req': No such file or directory
error: Couldn't exec /usr/lib/rpm/php.prov: No such file or directory
env: '/usr/lib/rpm/php.req': No such file or directory
error: Couldn't exec /usr/lib/rpm/php.prov: No such file or directory
env: '/usr/lib/rpm/php.req': No such file or directory
error: Couldn't exec /usr/lib/rpm/php.prov: No such file or directory
env: '/usr/lib/rpm/php.req': No such file or directory
error: Couldn't exec /usr/lib/rpm/php.prov: No such file or directory
env: '/usr/lib/rpm/php.req': No such file or directory
error: Couldn't exec /usr/lib/rpm/php.prov: No such file or directory
env: '/usr/lib/rpm/php.req': No such file or directory
error: Couldn't exec /usr/lib/rpm/php.prov: No such file or directory
env: '/usr/lib/rpm/php.req': No such file or directory
error: Couldn't exec /usr/lib/rpm/php.prov: No such file or directory
env: '/usr/lib/rpm/php.req': No such file or directory
error: Couldn't exec /usr/lib/rpm/php.prov: No such file or directory
env: '/usr/lib/rpm/php.req': No such file or directory
error: Couldn't exec /usr/lib/rpm/php.prov: No such file or directory
env: '/usr/lib/rpm/php.req': No such file or directory
error: Couldn't exec /usr/lib/rpm/php.prov: No such file or directory
env: '/usr/lib/rpm/php.req': No such file or directory
error: Couldn't exec /usr/lib/rpm/php.prov: No such file or directory
env: '/usr/lib/rpm/php.req': No such file or directory
error: Couldn't exec /usr/lib/rpm/php.prov: No such file or directory
env: '/usr/lib/rpm/php.req': No such file or directory
error: Couldn't exec /usr/lib/rpm/php.prov: No such file or directory
env: '/usr/lib/rpm/php.req': No such file or directory
error: Couldn't exec /usr/lib/rpm/php.prov: No such file or directory
env: '/usr/lib/rpm/php.req': No such file or directory
error: Couldn't exec /usr/lib/rpm/php.prov: No such file or directory
env: '/usr/lib/rpm/php.req': No such file or directory
error: Couldn't exec /usr/lib/rpm/php.prov: No such file or directory
env: '/usr/lib/rpm/php.req': No such file or directory
error: Couldn't exec /usr/lib/rpm/php.prov: No such file or directory
env: '/usr/lib/rpm/php.req': No such file or directory
error: Couldn't exec /usr/lib/rpm/php.prov: No such file or directory
env: '/usr/lib/rpm/php.req': No such file or directory
error: Couldn't exec /usr/lib/rpm/php.prov: No such file or directory
env: '/usr/lib/rpm/php.req': No such file or directory
error: Couldn't exec /usr/lib/rpm/php.prov: No such file or directory
env: '/usr/lib/rpm/php.req': No such file or directory
error: Couldn't exec /usr/lib/rpm/php.prov: No such file or directory
env: '/usr/lib/rpm/php.req': No such file or directory
error: Couldn't exec /usr/lib/rpm/php.prov: No such file or directory
env: '/usr/lib/rpm/php.req': No such file or directory
error: Couldn't exec /usr/lib/rpm/php.prov: No such file or directory
env: '/usr/lib/rpm/php.req': No such file or directory
error: Couldn't exec /usr/lib/rpm/php.prov: No such file or directory
env: '/usr/lib/rpm/php.req': No such file or directory
error: Couldn't exec /usr/lib/rpm/php.prov: No such file or directory
env: '/usr/lib/rpm/php.req': No such file or directory
error: Couldn't exec /usr/lib/rpm/php.prov: No such file or directory
env: '/usr/lib/rpm/php.req': No such file or directory
error: Couldn't exec /usr/lib/rpm/php.prov: No such file or directory
env: '/usr/lib/rpm/php.req': No such file or directory
error: Couldn't exec /usr/lib/rpm/php.prov: No such file or directory
env: '/usr/lib/rpm/php.req': No such file or directory
error: Couldn't exec /usr/lib/rpm/php.prov: No such file or directory
env: '/usr/lib/rpm/php.req': No such file or directory
error: Couldn't exec /usr/lib/rpm/php.prov: No such file or directory
env: '/usr/lib/rpm/php.req': No such file or directory
error: Couldn't exec /usr/lib/rpm/php.prov: No such file or directory
env: '/usr/lib/rpm/php.req': No such file or directory
error: Couldn't exec /usr/lib/rpm/php.prov: No such file or directory
env: '/usr/lib/rpm/php.req': No such file or directory
error: Couldn't exec /usr/lib/rpm/php.prov: No such file or directory
env: '/usr/lib/rpm/php.req': No such file or directory
error: Couldn't exec /usr/lib/rpm/php.prov: No such file or directory
env: '/usr/lib/rpm/php.req': No such file or directory
error: Couldn't exec /usr/lib/rpm/php.prov: No such file or directory
env: '/usr/lib/rpm/php.req': No such file or directory
error: Couldn't exec /usr/lib/rpm/php.prov: No such file or directory
env: '/usr/lib/rpm/php.req': No such file or directory
error: Couldn't exec /usr/lib/rpm/php.prov: No such file or directory
env: '/usr/lib/rpm/php.req': No such file or directory
error: Couldn't exec /usr/lib/rpm/php.prov: No such file or directory
env: '/usr/lib/rpm/php.req': No such file or directory
error: Couldn't exec /usr/lib/rpm/php.prov: No such file or directory
env: '/usr/lib/rpm/php.req': No such file or directory
error: Couldn't exec /usr/lib/rpm/php.prov: No such file or directory
env: '/usr/lib/rpm/php.req': No such file or directory
error: Couldn't exec /usr/lib/rpm/php.prov: No such file or directory
env: '/usr/lib/rpm/php.req': No such file or directory
error: Couldn't exec /usr/lib/rpm/php.prov: No such file or directory
env: '/usr/lib/rpm/php.req': No such file or directory
error: Couldn't exec /usr/lib/rpm/php.prov: No such file or directory
env: '/usr/lib/rpm/php.req': No such file or directory
error: Couldn't exec /usr/lib/rpm/php.prov: No such file or directory
env: '/usr/lib/rpm/php.req': No such file or directory
error: Couldn't exec /usr/lib/rpm/php.prov: No such file or directory
env: '/usr/lib/rpm/php.req': No such file or directory
error: Couldn't exec /usr/lib/rpm/php.prov: No such file or directory
env: '/usr/lib/rpm/php.req': No such file or directory
error: Couldn't exec /usr/lib/rpm/php.prov: No such file or directory
env: '/usr/lib/rpm/php.req': No such file or directory
error: Couldn't exec /usr/lib/rpm/php.prov: No such file or directory
env: '/usr/lib/rpm/php.req': No such file or directory
error: Couldn't exec /usr/lib/rpm/php.prov: No such file or directory
env: '/usr/lib/rpm/php.req': No such file or directory
error: Couldn't exec /usr/lib/rpm/php.prov: No such file or directory
env: '/usr/lib/rpm/php.req': No such file or directory
error: Couldn't exec /usr/lib/rpm/php.prov: No such file or directory
env: '/usr/lib/rpm/php.req': No such file or directory
error: Couldn't exec /usr/lib/rpm/php.prov: No such file or directory
env: '/usr/lib/rpm/php.req': No such file or directory
error: Couldn't exec /usr/lib/rpm/php.prov: No such file or directory
env: '/usr/lib/rpm/php.req': No such file or directory
error: Couldn't exec /usr/lib/rpm/php.prov: No such file or directory
env: '/usr/lib/rpm/php.req': No such file or directory
error: Couldn't exec /usr/lib/rpm/php.prov: No such file or directory
env: '/usr/lib/rpm/php.req': No such file or directory
error: Couldn't exec /usr/lib/rpm/php.prov: No such file or directory
env: '/usr/lib/rpm/php.req': No such file or directory
error: Couldn't exec /usr/lib/rpm/php.prov: No such file or directory
env: '/usr/lib/rpm/php.req': No such file or directory
error: Couldn't exec /usr/lib/rpm/php.prov: No such file or directory
env: '/usr/lib/rpm/php.req': No such file or directory
error: Couldn't exec /usr/lib/rpm/php.prov: No such file or directory
env: '/usr/lib/rpm/php.req': No such file or directory
error: Couldn't exec /usr/lib/rpm/php.prov: No such file or directory
env: '/usr/lib/rpm/php.req': No such file or directory
error: Couldn't exec /usr/lib/rpm/php.prov: No such file or directory
env: '/usr/lib/rpm/php.req': No such file or directory
error: Couldn't exec /usr/lib/rpm/php.prov: No such file or directory
env: '/usr/lib/rpm/php.req': No such file or directory
error: Couldn't exec /usr/lib/rpm/php.prov: No such file or directory
env: '/usr/lib/rpm/php.req': No such file or directory
error: Couldn't exec /usr/lib/rpm/php.prov: No such file or directory
env: '/usr/lib/rpm/php.req': No such file or directory
error: Couldn't exec /usr/lib/rpm/php.prov: No such file or directory
env: '/usr/lib/rpm/php.req': No such file or directory
error: Couldn't exec /usr/lib/rpm/php.prov: No such file or directory
env: '/usr/lib/rpm/php.req': No such file or directory
error: Couldn't exec /usr/lib/rpm/php.prov: No such file or directory
env: '/usr/lib/rpm/php.req': No such file or directory
error: Couldn't exec /usr/lib/rpm/php.prov: No such file or directory
env: '/usr/lib/rpm/php.req': No such file or directory
error: Couldn't exec /usr/lib/rpm/php.prov: No such file or directory
env: '/usr/lib/rpm/php.req': No such file or directory
error: Couldn't exec /usr/lib/rpm/php.prov: No such file or directory
env: '/usr/lib/rpm/php.req': No such file or directory
error: Couldn't exec /usr/lib/rpm/php.prov: No such file or directory
env: '/usr/lib/rpm/php.req': No such file or directory
error: Couldn't exec /usr/lib/rpm/php.prov: No such file or directory
env: '/usr/lib/rpm/php.req': No such file or directory
error: Couldn't exec /usr/lib/rpm/php.prov: No such file or directory
env: '/usr/lib/rpm/php.req': No such file or directory
error: Couldn't exec /usr/lib/rpm/php.prov: No such file or directory
env: '/usr/lib/rpm/php.req': No such file or directory
error: Couldn't exec /usr/lib/rpm/php.prov: No such file or directory
env: '/usr/lib/rpm/php.req': No such file or directory
error: Couldn't exec /usr/lib/rpm/php.prov: No such file or directory
env: '/usr/lib/rpm/php.req': No such file or directory
error: Couldn't exec /usr/lib/rpm/php.prov: No such file or directory
env: '/usr/lib/rpm/php.req': No such file or directory
error: Couldn't exec /usr/lib/rpm/php.prov: No such file or directory
env: '/usr/lib/rpm/php.req': No such file or directory
error: Couldn't exec /usr/lib/rpm/php.prov: No such file or directory
env: '/usr/lib/rpm/php.req': No such file or directory
error: Couldn't exec /usr/lib/rpm/php.prov: No such file or directory
env: '/usr/lib/rpm/php.req': No such file or directory
error: Couldn't exec /usr/lib/rpm/php.prov: No such file or directory
env: '/usr/lib/rpm/php.req': No such file or directory
error: Couldn't exec /usr/lib/rpm/php.prov: No such file or directory
env: '/usr/lib/rpm/php.req': No such file or directory
error: Couldn't exec /usr/lib/rpm/php.prov: No such file or directory
env: '/usr/lib/rpm/php.req': No such file or directory
error: Couldn't exec /usr/lib/rpm/php.prov: No such file or directory
env: '/usr/lib/rpm/php.req': No such file or directory
error: Couldn't exec /usr/lib/rpm/php.prov: No such file or directory
env: '/usr/lib/rpm/php.req': No such file or directory
error: Couldn't exec /usr/lib/rpm/php.prov: No such file or directory
env: '/usr/lib/rpm/php.req': No such file or directory
error: Couldn't exec /usr/lib/rpm/php.prov: No such file or directory
env: '/usr/lib/rpm/php.req': No such file or directory
error: Couldn't exec /usr/lib/rpm/php.prov: No such file or directory
env: '/usr/lib/rpm/php.req': No such file or directory
error: Couldn't exec /usr/lib/rpm/php.prov: No such file or directory
env: '/usr/lib/rpm/php.req': No such file or directory
error: Couldn't exec /usr/lib/rpm/php.prov: No such file or directory
env: '/usr/lib/rpm/php.req': No such file or directory
error: Couldn't exec /usr/lib/rpm/php.prov: No such file or directory
env: '/usr/lib/rpm/php.req': No such file or directory
error: Couldn't exec /usr/lib/rpm/php.prov: No such file or directory
env: '/usr/lib/rpm/php.req': No such file or directory
error: Couldn't exec /usr/lib/rpm/php.prov: No such file or directory
env: '/usr/lib/rpm/php.req': No such file or directory
error: Couldn't exec /usr/lib/rpm/php.prov: No such file or directory
env: '/usr/lib/rpm/php.req': No such file or directory
error: Couldn't exec /usr/lib/rpm/php.prov: No such file or directory
env: '/usr/lib/rpm/php.req': No such file or directory
error: Couldn't exec /usr/lib/rpm/php.prov: No such file or directory
env: '/usr/lib/rpm/php.req': No such file or directory
error: Couldn't exec /usr/lib/rpm/php.prov: No such file or directory
env: '/usr/lib/rpm/php.req': No such file or directory
error: Couldn't exec /usr/lib/rpm/php.prov: No such file or directory
env: '/usr/lib/rpm/php.req': No such file or directory
error: Couldn't exec /usr/lib/rpm/php.prov: No such file or directory
env: '/usr/lib/rpm/php.req': No such file or directory
error: Couldn't exec /usr/lib/rpm/php.prov: No such file or directory
env: '/usr/lib/rpm/php.req': No such file or directory
error: Couldn't exec /usr/lib/rpm/php.prov: No such file or directory
env: '/usr/lib/rpm/php.req': No such file or directory
error: Couldn't exec /usr/lib/rpm/php.prov: No such file or directory
env: '/usr/lib/rpm/php.req': No such file or directory
error: Couldn't exec /usr/lib/rpm/php.prov: No such file or directory
env: '/usr/lib/rpm/php.req': No such file or directory
error: Couldn't exec /usr/lib/rpm/php.prov: No such file or directory
env: '/usr/lib/rpm/php.req': No such file or directory
error: Couldn't exec /usr/lib/rpm/php.prov: No such file or directory
env: '/usr/lib/rpm/php.req': No such file or directory
error: Couldn't exec /usr/lib/rpm/php.prov: No such file or directory
env: '/usr/lib/rpm/php.req': No such file or directory
error: Couldn't exec /usr/lib/rpm/php.prov: No such file or directory
env: '/usr/lib/rpm/php.req': No such file or directory
error: Couldn't exec /usr/lib/rpm/php.prov: No such file or directory
env: '/usr/lib/rpm/php.req': No such file or directory
error: Couldn't exec /usr/lib/rpm/php.prov: No such file or directory
env: '/usr/lib/rpm/php.req': No such file or directory
error: Couldn't exec /usr/lib/rpm/php.prov: No such file or directory
env: '/usr/lib/rpm/php.req': No such file or directory
error: Couldn't exec /usr/lib/rpm/php.prov: No such file or directory
env: '/usr/lib/rpm/php.req': No such file or directory
error: Couldn't exec /usr/lib/rpm/php.prov: No such file or directory
env: '/usr/lib/rpm/php.req': No such file or directory
error: Couldn't exec /usr/lib/rpm/php.prov: No such file or directory
env: '/usr/lib/rpm/php.req': No such file or directory
error: Couldn't exec /usr/lib/rpm/php.prov: No such file or directory
env: '/usr/lib/rpm/php.req': No such file or directory
error: Couldn't exec /usr/lib/rpm/php.prov: No such file or directory
env: '/usr/lib/rpm/php.req': No such file or directory
error: Couldn't exec /usr/lib/rpm/php.prov: No such file or directory
env: '/usr/lib/rpm/php.req': No such file or directory
error: Couldn't exec /usr/lib/rpm/php.prov: No such file or directory
env: '/usr/lib/rpm/php.req': No such file or directory
error: Couldn't exec /usr/lib/rpm/php.prov: No such file or directory
env: '/usr/lib/rpm/php.req': No such file or directory
error: Couldn't exec /usr/lib/rpm/php.prov: No such file or directory
env: '/usr/lib/rpm/php.req': No such file or directory
error: Couldn't exec /usr/lib/rpm/php.prov: No such file or directory
env: '/usr/lib/rpm/php.req': No such file or directory
error: Couldn't exec /usr/lib/rpm/php.prov: No such file or directory
env: '/usr/lib/rpm/php.req': No such file or directory
error: Couldn't exec /usr/lib/rpm/php.prov: No such file or directory
env: '/usr/lib/rpm/php.req': No such file or directory
error: Couldn't exec /usr/lib/rpm/php.prov: No such file or directory
env: '/usr/lib/rpm/php.req': No such file or directory
error: Couldn't exec /usr/lib/rpm/php.prov: No such file or directory
env: '/usr/lib/rpm/php.req': No such file or directory
error: Couldn't exec /usr/lib/rpm/php.prov: No such file or directory
env: '/usr/lib/rpm/php.req': No such file or directory
error: Couldn't exec /usr/lib/rpm/php.prov: No such file or directory
env: '/usr/lib/rpm/php.req': No such file or directory
error: Couldn't exec /usr/lib/rpm/php.prov: No such file or directory
env: '/usr/lib/rpm/php.req': No such file or directory
error: Couldn't exec /usr/lib/rpm/php.prov: No such file or directory
env: '/usr/lib/rpm/php.req': No such file or directory
error: Couldn't exec /usr/lib/rpm/php.prov: No such file or directory
env: '/usr/lib/rpm/php.req': No such file or directory
error: Couldn't exec /usr/lib/rpm/php.prov: No such file or directory
env: '/usr/lib/rpm/php.req': No such file or directory
error: Couldn't exec /usr/lib/rpm/php.prov: No such file or directory
env: '/usr/lib/rpm/php.req': No such file or directory
error: Couldn't exec /usr/lib/rpm/php.prov: No such file or directory
env: '/usr/lib/rpm/php.req': No such file or directory
error: Couldn't exec /usr/lib/rpm/php.prov: No such file or directory
env: '/usr/lib/rpm/php.req': No such file or directory
error: Couldn't exec /usr/lib/rpm/php.prov: No such file or directory
env: '/usr/lib/rpm/php.req': No such file or directory
error: Couldn't exec /usr/lib/rpm/php.prov: No such file or directory
env: '/usr/lib/rpm/php.req': No such file or directory
error: Couldn't exec /usr/lib/rpm/php.prov: No such file or directory
env: '/usr/lib/rpm/php.req': No such file or directory
error: Couldn't exec /usr/lib/rpm/php.prov: No such file or directory
env: '/usr/lib/rpm/php.req': No such file or directory
error: Couldn't exec /usr/lib/rpm/php.prov: No such file or directory
env: '/usr/lib/rpm/php.req': No such file or directory
error: Couldn't exec /usr/lib/rpm/php.prov: No such file or directory
env: '/usr/lib/rpm/php.req': No such file or directory
error: Couldn't exec /usr/lib/rpm/php.prov: No such file or directory
env: '/usr/lib/rpm/php.req': No such file or directory
error: Couldn't exec /usr/lib/rpm/php.prov: No such file or directory
env: '/usr/lib/rpm/php.req': No such file or directory
error: Couldn't exec /usr/lib/rpm/php.prov: No such file or directory
env: '/usr/lib/rpm/php.req': No such file or directory
error: Couldn't exec /usr/lib/rpm/php.prov: No such file or directory
env: '/usr/lib/rpm/php.req': No such file or directory
error: Couldn't exec /usr/lib/rpm/php.prov: No such file or directory
env: '/usr/lib/rpm/php.req': No such file or directory
error: Couldn't exec /usr/lib/rpm/php.prov: No such file or directory
env: '/usr/lib/rpm/php.req': No such file or directory
error: Couldn't exec /usr/lib/rpm/php.prov: No such file or directory
env: '/usr/lib/rpm/php.req': No such file or directory
Removing dependency on self: R config(lms) = 0:1.11.13-12
Provides: config(lms) = 0:1.11.13-12
Requires(interp): /bin/sh
Requires(post): /sbin/chkconfig
Requires(preun): /sbin/chkconfig
Requires: /bin/sh /usr/bin/perl /usr/bin/python2 perl(Config::IniFiles) perl(Crypt::SSLeay) perl(DBI) perl(Digest::MD5) perl(Getopt::Long) perl(HTML::TokeParser) perl(HTTP::Cookies) perl(HTTP::Request::Common) perl(LWP::UserAgent) perl(POSIX) perl(Text::Iconv) perl(Time::Local) perl(strict) perl(vars) python(abi)
Conflicts: apache-base < 2.4.0-1
Processing files: lms-scripts-1.11.13-12.x86_64
Requires: /usr/bin/perl perl(Config::IniFiles) perl(DBI) perl(Encode) perl(File::Copy) perl(Getopt::Long) perl(LWP::UserAgent) perl(MIME::Base64) perl(MIME::Parser) perl(MIME::QuotedPrint) perl(MIME::Words) perl(Mail::Sender) perl(Net::Server::PreFork) perl(POSIX) perl(Sys::Hostname) perl(Text::Iconv) perl(Time::Local) perl(constant) perl(strict) perl(vars)
Processing files: lms-sqlpanel-1.11.13-12.x86_64
error: Couldn't exec /usr/lib/rpm/php.prov: No such file or directory
env: '/usr/lib/rpm/php.req': No such file or directory
error: Couldn't exec /usr/lib/rpm/php.prov: No such file or directory
env: '/usr/lib/rpm/php.req': No such file or directory
Processing files: lms-user-1.11.13-12.x86_64
error: Couldn't exec /usr/lib/rpm/php.prov: No such file or directory
env: '/usr/lib/rpm/php.req': No such file or directory
error: Couldn't exec /usr/lib/rpm/php.prov: No such file or directory
env: '/usr/lib/rpm/php.req': No such file or directory
Processing files: lms-lmsd-1.11.13-12.x86_64
Removing dependency on self: R config(lms-lmsd) = 0:1.11.13-12
Provides: config(lms-lmsd) = 0:1.11.13-12 cutoff.so()(64bit) dhcp.so()(64bit) dns.so()(64bit) elf(buildid) = 02db56a446891491989722f1816104c2a8e03978 elf(buildid) = 10d433bb9e24a7abaeb4ae9456cd7dc5884d450d elf(buildid) = 22c6122e57d9a3ada0f8d90bc491582f9dd1b890 elf(buildid) = 3da55992aefa795d386a28262acc46deea92e8d3 elf(buildid) = 8070ff5af3b728d8ce2b35465f29f0a7c2d1be69 elf(buildid) = 820c43e12de0a671f7f787df8da7a6c1bd5d2f8a elf(buildid) = 9ebc16bcecf9ac17b058f01e5ab91ce0bd50d8d7 elf(buildid) = a02811e6dd0bb6a478d389e713b47aa558f72688 elf(buildid) = a4fbfebf4f276d4860b928b0783e84a7e999e080 elf(buildid) = acf9d57f642a463e730ac5093e440251be2799ea elf(buildid) = afd82c930b3cfa80ca97e52c600971368082ddf0 elf(buildid) = b93e39d41923d29b16ee8c0bd56ea754db00c0f7 elf(buildid) = b980bf6a5e7f79065ce6ac28b3fd9ff0b57f9ac4 elf(buildid) = bb0cb387a3b197909f55f3b36570ad6139799f3f elf(buildid) = bb7c9c42c57fb2fba9198985531623939543e3f5 elf(buildid) = cbb71b140ff53c87185aba85db01e3336cf4a2bb elf(buildid) = d83f5d2bbfb185729c66250f5f6f3920af6e0028 elf(buildid) = df1d840dd16043a92dd1fc2eff50bbfc62efcd56 elf(buildid) = e8dc6ab1ea7944c0a726610eeb2a1597518b4dfb elf(buildid) = f203db92d27c38899765440240e31e80a26e3947 ethers.so()(64bit) ewx-pt.so()(64bit) ewx-stm-channels.so()(64bit) ewx-stm.so()(64bit) ggnotify.so()(64bit) hostfile.so()(64bit) notify.so()(64bit) oident.so()(64bit) parser.so()(64bit) payments.so()(64bit) pinger.so()(64bit) system.so()(64bit) tc-new.so()(64bit) tc.so()(64bit) traffic.so()(64bit)
Requires(interp): /bin/sh /bin/sh
Requires(post): /bin/sh /sbin/chkconfig
Requires(preun): /bin/sh /sbin/chkconfig
Requires: /bin/sh libc.so.6()(64bit) libc.so.6(GLIBC_2.14)(64bit) libc.so.6(GLIBC_2.15)(64bit) libc.so.6(GLIBC_2.2.5)(64bit) libc.so.6(GLIBC_2.3)(64bit) libc.so.6(GLIBC_2.3.4)(64bit) libc.so.6(GLIBC_2.4)(64bit) libc.so.6(GLIBC_2.7)(64bit) libcom_err.so.2()(64bit) libcrypto.so.1.1()(64bit) libdl.so.2()(64bit) libdl.so.2(GLIBC_2.2.5)(64bit) libgadu.so.3()(64bit) libkrb5.so.26()(64bit) libm.so.6()(64bit) libm.so.6(GLIBC_2.29)(64bit) libmysqlclient.so.20()(64bit) libmysqlclient.so.20(libmysqlclient_20.0)(64bit) libnetsnmp.so.40()(64bit) libpq.so.5()(64bit) libssh2.so.1()(64bit) libssl.so.1.1()(64bit) rtld(GNU_HASH)
Obsoletes: lms-almsd
Processing files: lms-userpanel-1.11.13-12.x86_64
error: Couldn't exec /usr/lib/rpm/php.prov: No such file or directory
env: '/usr/lib/rpm/php.req': No such file or directory
error: Couldn't exec /usr/lib/rpm/php.prov: No such file or directory
env: '/usr/lib/rpm/php.req': No such file or directory
error: Couldn't exec /usr/lib/rpm/php.prov: No such file or directory
env: '/usr/lib/rpm/php.req': No such file or directory
error: Couldn't exec /usr/lib/rpm/php.prov: No such file or directory
env: '/usr/lib/rpm/php.req': No such file or directory
error: Couldn't exec /usr/lib/rpm/php.prov: No such file or directory
env: '/usr/lib/rpm/php.req': No such file or directory
error: Couldn't exec /usr/lib/rpm/php.prov: No such file or directory
env: '/usr/lib/rpm/php.req': No such file or directory
error: Couldn't exec /usr/lib/rpm/php.prov: No such file or directory
env: '/usr/lib/rpm/php.req': No such file or directory
error: Couldn't exec /usr/lib/rpm/php.prov: No such file or directory
env: '/usr/lib/rpm/php.req': No such file or directory
error: Couldn't exec /usr/lib/rpm/php.prov: No such file or directory
env: '/usr/lib/rpm/php.req': No such file or directory
error: Couldn't exec /usr/lib/rpm/php.prov: No such file or directory
env: '/usr/lib/rpm/php.req': No such file or directory
error: Couldn't exec /usr/lib/rpm/php.prov: No such file or directory
env: '/usr/lib/rpm/php.req': No such file or directory
error: Couldn't exec /usr/lib/rpm/php.prov: No such file or directory
env: '/usr/lib/rpm/php.req': No such file or directory
error: Couldn't exec /usr/lib/rpm/php.prov: No such file or directory
env: '/usr/lib/rpm/php.req': No such file or directory
error: Couldn't exec /usr/lib/rpm/php.prov: No such file or directory
env: '/usr/lib/rpm/php.req': No such file or directory
error: Couldn't exec /usr/lib/rpm/php.prov: No such file or directory
env: '/usr/lib/rpm/php.req': No such file or directory
error: Couldn't exec /usr/lib/rpm/php.prov: No such file or directory
env: '/usr/lib/rpm/php.req': No such file or directory
error: Couldn't exec /usr/lib/rpm/php.prov: No such file or directory
env: '/usr/lib/rpm/php.req': No such file or directory
error: Couldn't exec /usr/lib/rpm/php.prov: No such file or directory
env: '/usr/lib/rpm/php.req': No such file or directory
error: Couldn't exec /usr/lib/rpm/php.prov: No such file or directory
env: '/usr/lib/rpm/php.req': No such file or directory
error: Couldn't exec /usr/lib/rpm/php.prov: No such file or directory
env: '/usr/lib/rpm/php.req': No such file or directory
error: Couldn't exec /usr/lib/rpm/php.prov: No such file or directory
env: '/usr/lib/rpm/php.req': No such file or directory
error: Couldn't exec /usr/lib/rpm/php.prov: No such file or directory
env: '/usr/lib/rpm/php.req': No such file or directory
error: Couldn't exec /usr/lib/rpm/php.prov: No such file or directory
env: '/usr/lib/rpm/php.req': No such file or directory
error: Couldn't exec /usr/lib/rpm/php.prov: No such file or directory
env: '/usr/lib/rpm/php.req': No such file or directory
error: Couldn't exec /usr/lib/rpm/php.prov: No such file or directory
env: '/usr/lib/rpm/php.req': No such file or directory
error: Couldn't exec /usr/lib/rpm/php.prov: No such file or directory
env: '/usr/lib/rpm/php.req': No such file or directory
error: Couldn't exec /usr/lib/rpm/php.prov: No such file or directory
env: '/usr/lib/rpm/php.req': No such file or directory
error: Couldn't exec /usr/lib/rpm/php.prov: No such file or directory
env: '/usr/lib/rpm/php.req': No such file or directory
error: Couldn't exec /usr/lib/rpm/php.prov: No such file or directory
env: '/usr/lib/rpm/php.req': No such file or directory
error: Couldn't exec /usr/lib/rpm/php.prov: No such file or directory
env: '/usr/lib/rpm/php.req': No such file or directory
error: Couldn't exec /usr/lib/rpm/php.prov: No such file or directory
env: '/usr/lib/rpm/php.req': No such file or directory
error: Couldn't exec /usr/lib/rpm/php.prov: No such file or directory
env: '/usr/lib/rpm/php.req': No such file or directory
error: Couldn't exec /usr/lib/rpm/php.prov: No such file or directory
env: '/usr/lib/rpm/php.req': No such file or directory
error: Couldn't exec /usr/lib/rpm/php.prov: No such file or directory
env: '/usr/lib/rpm/php.req': No such file or directory
error: Couldn't exec /usr/lib/rpm/php.prov: No such file or directory
env: '/usr/lib/rpm/php.req': No such file or directory
error: Couldn't exec /usr/lib/rpm/php.prov: No such file or directory
env: '/usr/lib/rpm/php.req': No such file or directory
error: Couldn't exec /usr/lib/rpm/php.prov: No such file or directory
env: '/usr/lib/rpm/php.req': No such file or directory
error: Couldn't exec /usr/lib/rpm/php.prov: No such file or directory
env: '/usr/lib/rpm/php.req': No such file or directory
error: Couldn't exec /usr/lib/rpm/php.prov: No such file or directory
env: '/usr/lib/rpm/php.req': No such file or directory
error: Couldn't exec /usr/lib/rpm/php.prov: No such file or directory
env: '/usr/lib/rpm/php.req': No such file or directory
error: Couldn't exec /usr/lib/rpm/php.prov: No such file or directory
env: '/usr/lib/rpm/php.req': No such file or directory
error: Couldn't exec /usr/lib/rpm/php.prov: No such file or directory
env: '/usr/lib/rpm/php.req': No such file or directory
error: Couldn't exec /usr/lib/rpm/php.prov: No such file or directory
env: '/usr/lib/rpm/php.req': No such file or directory
error: Couldn't exec /usr/lib/rpm/php.prov: No such file or directory
env: '/usr/lib/rpm/php.req': No such file or directory
error: Couldn't exec /usr/lib/rpm/php.prov: No such file or directory
env: '/usr/lib/rpm/php.req': No such file or directory
error: Couldn't exec /usr/lib/rpm/php.prov: No such file or directory
env: '/usr/lib/rpm/php.req': No such file or directory
error: Couldn't exec /usr/lib/rpm/php.prov: No such file or directory
env: '/usr/lib/rpm/php.req': No such file or directory
error: Couldn't exec /usr/lib/rpm/php.prov: No such file or directory
env: '/usr/lib/rpm/php.req': No such file or directory
error: Couldn't exec /usr/lib/rpm/php.prov: No such file or directory
env: '/usr/lib/rpm/php.req': No such file or directory
error: Couldn't exec /usr/lib/rpm/php.prov: No such file or directory
env: '/usr/lib/rpm/php.req': No such file or directory
error: Couldn't exec /usr/lib/rpm/php.prov: No such file or directory
env: '/usr/lib/rpm/php.req': No such file or directory
error: Couldn't exec /usr/lib/rpm/php.prov: No such file or directory
env: '/usr/lib/rpm/php.req': No such file or directory
error: Couldn't exec /usr/lib/rpm/php.prov: No such file or directory
env: '/usr/lib/rpm/php.req': No such file or directory
error: Couldn't exec /usr/lib/rpm/php.prov: No such file or directory
env: '/usr/lib/rpm/php.req': No such file or directory
error: Couldn't exec /usr/lib/rpm/php.prov: No such file or directory
env: '/usr/lib/rpm/php.req': No such file or directory
error: Couldn't exec /usr/lib/rpm/php.prov: No such file or directory
env: '/usr/lib/rpm/php.req': No such file or directory
Processing files: lms-debuginfo-1.11.13-12.x86_64
Checking for unpackaged file(s): /usr/lib/rpm/check-files /tmp/B.BHJf8e/BUILD/tmp/lms-1.11.13-root-builder
warning: Installed (but unpackaged) file(s) found:
	/usr/share/lms/www/userpanel/modules/finances/style
	/usr/share/lms/www/userpanel/modules/help/style
	/usr/share/lms/www/userpanel/modules/helpdesk/style
	/usr/share/lms/www/userpanel/modules/info/style
	/usr/share/lms/www/userpanel/modules/logout/style
	/usr/share/lms/www/userpanel/modules/messages/style
	/usr/share/lms/www/userpanel/modules/modules/style
	/usr/share/lms/www/userpanel/modules/stats/style
warning: Could not canonicalize hostname: ymir-builder
Wrote: /tmp/B.BHJf8e/RPMS/lms-1.11.13-12.x86_64.rpm
Wrote: /tmp/B.BHJf8e/RPMS/lms-scripts-1.11.13-12.x86_64.rpm
Wrote: /tmp/B.BHJf8e/RPMS/lms-sqlpanel-1.11.13-12.x86_64.rpm
Wrote: /tmp/B.BHJf8e/RPMS/lms-user-1.11.13-12.x86_64.rpm
Wrote: /tmp/B.BHJf8e/RPMS/lms-lmsd-1.11.13-12.x86_64.rpm
Wrote: /tmp/B.BHJf8e/RPMS/lms-userpanel-1.11.13-12.x86_64.rpm
Wrote: /tmp/B.BHJf8e/RPMS/lms-debuginfo-1.11.13-12.x86_64.rpm
Executing(%clean): /bin/sh -e /tmp/B.BHJf8e/BUILD/tmp/rpm-tmp.53055
+ umask 022
+ cd /tmp/B.BHJf8e/BUILD
+ cd lms
+ /bin/rm '--interactive=never' -rf /tmp/B.BHJf8e/BUILD/tmp/lms-1.11.13-root-builder
+ rm -rf /tmp/B.BHJf8e/BUILD/tmp/lms-1.11.13-root-builder
ended at: Fri Oct 16 17:11:28 2020, done in 0:00:38.682332
+ chmod -R u+rwX /tmp/B.BHJf8e/BUILD
+ rm -rf /tmp/B.BHJf8e/tmp /tmp/B.BHJf8e/BUILD
test-build: not copying to /spools/ready
Begin-PLD-Builder-Info
not upgrading
End-PLD-Builder-Info
+ rm -rf /tmp/B.BHJf8e
Begin-PLD-Builder-Info
Build-Time: user:20.63s sys:3.54s real:42.83s (faults io:20 non-io:919932)

Files queued for ftp:
    487867 lms-debuginfo-1.11.13-12.x86_64.rpm
    181662 lms-userpanel-1.11.13-12.x86_64.rpm
    132350 lms-lmsd-1.11.13-12.x86_64.rpm
     10910 lms-user-1.11.13-12.x86_64.rpm
      7707 lms-sqlpanel-1.11.13-12.x86_64.rpm
     40054 lms-scripts-1.11.13-12.x86_64.rpm
   2708271 lms-1.11.13-12.x86_64.rpm

warning: Installed (but unpackaged) file(s) found:
	/usr/share/lms/www/userpanel/modules/finances/style
	/usr/share/lms/www/userpanel/modules/help/style
	/usr/share/lms/www/userpanel/modules/helpdesk/style
	/usr/share/lms/www/userpanel/modules/info/style
	/usr/share/lms/www/userpanel/modules/logout/style
	/usr/share/lms/www/userpanel/modules/messages/style
	/usr/share/lms/www/userpanel/modules/modules/style
	/usr/share/lms/www/userpanel/modules/stats/style
End-PLD-Builder-Info
[Back to list of logs] [View rpm -qa of builder]